incubator-cassandra-dev mailing list archives

Site index · List index
Message view « Date » · « Thread »
Top « Date » · « Thread »
From Apache Hudson Server <hud...@hudson.apache.org>
Subject Build failed in Hudson: Cassandra-0.7 #58
Date Wed, 08 Dec 2010 02:13:43 GMT
See <https://hudson.apache.org/hudson/job/Cassandra-0.7/58/changes>

Changes:

[jbellis] fix "create column family" example in cli help
patch by jbellis

------------------------------------------
[...truncated 1383 lines...]
    [junit] Testsuite: org.apache.cassandra.db.CompactionsTest
    [junit] Tests run: 2, Failures: 0, Errors: 0, Time elapsed: 1.475 sec
    [junit] 
    [junit] Testsuite: org.apache.cassandra.db.DefsTest
    [junit] Tests run: 15, Failures: 0, Errors: 0, Time elapsed: 1.787 sec
    [junit] 
    [junit] Testsuite: org.apache.cassandra.db.MultitableTest
    [junit] Tests run: 1, Failures: 0, Errors: 0, Time elapsed: 0.559 sec
    [junit] 
    [junit] Testsuite: org.apache.cassandra.db.NameSortTest
    [junit] Tests run: 3, Failures: 0, Errors: 0, Time elapsed: 2.837 sec
    [junit] 
    [junit] Testsuite: org.apache.cassandra.db.OneCompactionTest
    [junit] Tests run: 2, Failures: 0, Errors: 0, Time elapsed: 0.586 sec
    [junit] 
    [junit] Testsuite: org.apache.cassandra.db.ReadMessageTest
    [junit] Tests run: 2, Failures: 0, Errors: 0, Time elapsed: 0.535 sec
    [junit] 
    [junit] Testsuite: org.apache.cassandra.db.RecoveryManager2Test
    [junit] Tests run: 1, Failures: 0, Errors: 0, Time elapsed: 0.666 sec
    [junit] 
    [junit] Testsuite: org.apache.cassandra.db.RecoveryManager3Test
    [junit] Tests run: 1, Failures: 0, Errors: 0, Time elapsed: 0.517 sec
    [junit] 
    [junit] Testsuite: org.apache.cassandra.db.RecoveryManagerTest
    [junit] Tests run: 2, Failures: 0, Errors: 0, Time elapsed: 0.526 sec
    [junit] 
    [junit] Testsuite: org.apache.cassandra.db.RecoveryManagerTruncateTest
    [junit] Tests run: 1, Failures: 0, Errors: 0, Time elapsed: 0.534 sec
    [junit] 
    [junit] Testsuite: org.apache.cassandra.db.RemoveColumnFamilyTest
    [junit] Tests run: 1, Failures: 0, Errors: 0, Time elapsed: 0.421 sec
    [junit] 
    [junit] Testsuite: org.apache.cassandra.db.RemoveColumnFamilyWithFlush1Test
    [junit] Tests run: 1, Failures: 0, Errors: 0, Time elapsed: 0.472 sec
    [junit] 
    [junit] Testsuite: org.apache.cassandra.db.RemoveColumnFamilyWithFlush2Test
    [junit] Tests run: 1, Failures: 0, Errors: 0, Time elapsed: 0.471 sec
    [junit] 
    [junit] Testsuite: org.apache.cassandra.db.RemoveColumnTest
    [junit] Tests run: 1, Failures: 0, Errors: 0, Time elapsed: 0.476 sec
    [junit] 
    [junit] Testsuite: org.apache.cassandra.db.RemoveSubColumnTest
    [junit] Tests run: 1, Failures: 0, Errors: 0, Time elapsed: 0.473 sec
    [junit] 
    [junit] Testsuite: org.apache.cassandra.db.RemoveSuperColumnTest
    [junit] Tests run: 4, Failures: 0, Errors: 0, Time elapsed: 0.602 sec
    [junit] 
    [junit] Testsuite: org.apache.cassandra.db.RowIterationTest
    [junit] Tests run: 1, Failures: 0, Errors: 0, Time elapsed: 0.225 sec
    [junit] 
    [junit] Testsuite: org.apache.cassandra.db.RowTest
    [junit] Tests run: 4, Failures: 0, Errors: 0, Time elapsed: 2.394 sec
    [junit] 
    [junit] Testsuite: org.apache.cassandra.db.SuperColumnTest
    [junit] Tests run: 1, Failures: 0, Errors: 0, Time elapsed: 0.127 sec
    [junit] 
    [junit] Testsuite: org.apache.cassandra.db.TableTest
    [junit] Tests run: 10, Failures: 0, Errors: 0, Time elapsed: 1.129 sec
    [junit] 
    [junit] Testsuite: org.apache.cassandra.db.TimeSortTest
    [junit] Tests run: 2, Failures: 0, Errors: 0, Time elapsed: 1.324 sec
    [junit] 
    [junit] Testsuite: org.apache.cassandra.db.commitlog.CommitLogHeaderTest
    [junit] Tests run: 2, Failures: 0, Errors: 0, Time elapsed: 0.385 sec
    [junit] 
    [junit] Testsuite: org.apache.cassandra.db.marshal.IntegerTypeTest
    [junit] Tests run: 10, Failures: 0, Errors: 0, Time elapsed: 0.189 sec
    [junit] 
    [junit] Testsuite: org.apache.cassandra.db.marshal.TimeUUIDTypeTest
    [junit] Tests run: 4, Failures: 0, Errors: 0, Time elapsed: 0.068 sec
    [junit] 
    [junit] Testsuite: org.apache.cassandra.db.marshal.TypeCompareTest
    [junit] Tests run: 5, Failures: 0, Errors: 0, Time elapsed: 0.139 sec
    [junit] 
    [junit] Testsuite: org.apache.cassandra.dht.BootStrapperTest
    [junit] Tests run: 4, Failures: 0, Errors: 0, Time elapsed: 1.244 sec
    [junit] 
    [junit] ------------- Standard Error -----------------
    [junit]  WARN 18:11:16,306 Generated random token Token(bytes[474472d14bc59580166ff6490444ee1e]).
Random tokens will result in an unbalanced ring; see http://wiki.apache.org/cassandra/Operations
    [junit] ------------- ---------------- ---------------
    [junit] Testsuite: org.apache.cassandra.dht.ByteOrderedPartitionerTest
    [junit] Tests run: 5, Failures: 0, Errors: 0, Time elapsed: 1.007 sec
    [junit] 
    [junit] Testsuite: org.apache.cassandra.dht.CollatingOrderPreservingPartitionerTest
    [junit] Tests run: 7, Failures: 0, Errors: 0, Time elapsed: 1.247 sec
    [junit] 
    [junit] Testsuite: org.apache.cassandra.dht.OrderPreservingPartitionerTest
    [junit] Tests run: 6, Failures: 0, Errors: 0, Time elapsed: 1.132 sec
    [junit] 
    [junit] Testsuite: org.apache.cassandra.dht.RandomPartitionerTest
    [junit] Tests run: 5, Failures: 0, Errors: 0, Time elapsed: 0.648 sec
    [junit] 
    [junit] Testsuite: org.apache.cassandra.dht.RangeTest
    [junit] Tests run: 12, Failures: 0, Errors: 0, Time elapsed: 0.385 sec
    [junit] 
    [junit] Testsuite: org.apache.cassandra.gms.ArrivalWindowTest
    [junit] Tests run: 1, Failures: 0, Errors: 0, Time elapsed: 0.114 sec
    [junit] 
    [junit] Testsuite: org.apache.cassandra.gms.GossipDigestTest
    [junit] Tests run: 1, Failures: 0, Errors: 0, Time elapsed: 0.054 sec
    [junit] 
    [junit] Testsuite: org.apache.cassandra.hadoop.ColumnFamilyInputFormatTest
    [junit] Tests run: 1, Failures: 0, Errors: 0, Time elapsed: 0.181 sec
    [junit] 
    [junit] Testsuite: org.apache.cassandra.io.BloomFilterTrackerTest
    [junit] Tests run: 3, Failures: 0, Errors: 0, Time elapsed: 0.329 sec
    [junit] 
    [junit] Testsuite: org.apache.cassandra.io.LazilyCompactedRowTest
    [junit] Tests run: 5, Failures: 0, Errors: 0, Time elapsed: 1.454 sec
    [junit] 
    [junit] Testsuite: org.apache.cassandra.io.sstable.LegacySSTableTest
    [junit] Tests run: 1, Failures: 0, Errors: 0, Time elapsed: 0.814 sec
    [junit] 
    [junit] ------------- Standard Error -----------------
    [junit]  WARN 18:11:32,471 Invalid file '.svn' in data directory <https://hudson.apache.org/hudson/job/Cassandra-0.7/ws/cassandra/test/data/legacy-sstables/b/Keyspace1.>
    [junit] ------------- ---------------- ---------------
    [junit] Testsuite: org.apache.cassandra.io.sstable.SSTableReaderTest
    [junit] Tests run: 3, Failures: 0, Errors: 0, Time elapsed: 0.735 sec
    [junit] 
    [junit] Testsuite: org.apache.cassandra.io.sstable.SSTableTest
    [junit] Tests run: 2, Failures: 0, Errors: 0, Time elapsed: 1.041 sec
    [junit] 
    [junit] Testsuite: org.apache.cassandra.io.sstable.SSTableWriterTest
    [junit] Tests run: 1, Failures: 0, Errors: 0, Time elapsed: 0.503 sec
    [junit] 
    [junit] Testsuite: org.apache.cassandra.io.util.BufferedRandomAccessFileTest
    [junit] Tests run: 4, Failures: 0, Errors: 0, Time elapsed: 0.08 sec
    [junit] 
    [junit] Testsuite: org.apache.cassandra.locator.DynamicEndpointSnitchTest
    [junit] Tests run: 1, Failures: 0, Errors: 0, Time elapsed: 6.147 sec
    [junit] 
    [junit] Testsuite: org.apache.cassandra.locator.NetworkTopologyStrategyTest
    [junit] Tests run: 1, Failures: 0, Errors: 0, Time elapsed: 0.401 sec
    [junit] 
    [junit] Testsuite: org.apache.cassandra.locator.OldNetworkTopologyStrategyTest
    [junit] Tests run: 3, Failures: 0, Errors: 0, Time elapsed: 0.402 sec
    [junit] 
    [junit] Testsuite: org.apache.cassandra.locator.ReplicationStrategyEndpointCacheTest
    [junit] Tests run: 2, Failures: 0, Errors: 0, Time elapsed: 0.501 sec
    [junit] 
    [junit] Testsuite: org.apache.cassandra.locator.SimpleStrategyTest
    [junit] Tests run: 4, Failures: 0, Errors: 0, Time elapsed: 0.468 sec
    [junit] 
    [junit] Testsuite: org.apache.cassandra.locator.TokenMetadataTest
    [junit] Tests run: 2, Failures: 0, Errors: 0, Time elapsed: 0.383 sec
    [junit] 
    [junit] Testsuite: org.apache.cassandra.service.AntiEntropyServiceTest
    [junit] Tests run: 7, Failures: 0, Errors: 0, Time elapsed: 0.886 sec
    [junit] 
    [junit] ------------- Standard Error -----------------
    [junit]  WARN 18:11:52,429 Generated random token Token(bytes[dd67a7f10667f4ea4a7a2f4cf27b3559]).
Random tokens will result in an unbalanced ring; see http://wiki.apache.org/cassandra/Operations
    [junit] Exception in thread "Thread-4" java.lang.RuntimeException: java.lang.NullPointerException
    [junit] 	at org.apache.cassandra.utils.WrappedRunnable.run(WrappedRunnable.java:34)
    [junit] 	at org.apache.cassandra.streaming.StreamInSession.closeIfFinished(StreamInSession.java:164)
    [junit] 	at org.apache.cassandra.streaming.IncomingStreamReader.read(IncomingStreamReader.java:66)
    [junit] 	at org.apache.cassandra.net.IncomingTcpConnection.run(IncomingTcpConnection.java:75)
    [junit] Caused by: java.lang.NullPointerException
    [junit] 	at org.apache.cassandra.service.AntiEntropyService.completedRequest(AntiEntropyService.java:133)
    [junit] 	at org.apache.cassandra.service.AntiEntropyService$Differencer$Callback.runMayThrow(AntiEntropyService.java:537)
    [junit] 	at org.apache.cassandra.utils.WrappedRunnable.run(WrappedRunnable.java:30)
    [junit] 	... 3 more
    [junit] ------------- ---------------- ---------------
    [junit] Testsuite: org.apache.cassandra.service.CassandraServerTest
    [junit] Tests run: 1, Failures: 0, Errors: 0, Time elapsed: 0.329 sec
    [junit] 
    [junit] Testsuite: org.apache.cassandra.service.ConsistencyLevelTest
    [junit] Tests run: 1, Failures: 0, Errors: 0, Time elapsed: 0.481 sec
    [junit] 
    [junit] Testsuite: org.apache.cassandra.service.EmbeddedCassandraServiceTest
    [junit] Testsuite: org.apache.cassandra.service.EmbeddedCassandraServiceTest
    [junit] Tests run: 1, Failures: 0, Errors: 1, Time elapsed: 0 sec
    [junit] 
    [junit] Testcase: org.apache.cassandra.service.EmbeddedCassandraServiceTest:BeforeFirstTest:
Caused an ERROR
    [junit] Forked Java VM exited abnormally. Please note the time in the report does not
reflect the time until the VM exit.
    [junit] junit.framework.AssertionFailedError: Forked Java VM exited abnormally. Please
note the time in the report does not reflect the time until the VM exit.
    [junit] 
    [junit] 
    [junit] Test org.apache.cassandra.service.EmbeddedCassandraServiceTest FAILED (crashed)
    [junit] Testsuite: org.apache.cassandra.service.InitClientTest
    [junit] Tests run: 1, Failures: 0, Errors: 0, Time elapsed: 5.386 sec
    [junit] 
    [junit] Testsuite: org.apache.cassandra.service.MoveTest
    [junit] Tests run: 6, Failures: 0, Errors: 0, Time elapsed: 0.899 sec
    [junit] 
    [junit] ------------- Standard Error -----------------
    [junit]  WARN 18:12:04,814 Node /127.0.0.3 'leaving' token mismatch. Long network partition?
    [junit] ------------- ---------------- ---------------
    [junit] Testsuite: org.apache.cassandra.service.ReadResponseResolverTest
    [junit] Tests run: 5, Failures: 0, Errors: 0, Time elapsed: 0.4 sec
    [junit] 
    [junit] Testsuite: org.apache.cassandra.service.RemoveTest
    [junit] Tests run: 5, Failures: 0, Errors: 0, Time elapsed: 1.681 sec
    [junit] 
    [junit] Testsuite: org.apache.cassandra.service.StorageProxyTest
    [junit] Tests run: 4, Failures: 0, Errors: 0, Time elapsed: 0.356 sec
    [junit] 
    [junit] Testsuite: org.apache.cassandra.service.StorageServiceClientTest
    [junit] Tests run: 1, Failures: 0, Errors: 0, Time elapsed: 5.406 sec
    [junit] 
    [junit] Testsuite: org.apache.cassandra.service.StorageServiceServerTest
    [junit] Tests run: 3, Failures: 0, Errors: 0, Time elapsed: 0.608 sec
    [junit] 
    [junit] ------------- Standard Error -----------------
    [junit]  WARN 18:12:17,196 Generated random token Token(bytes[aa934d5531a24bfbcf909e63d4d353fd]).
Random tokens will result in an unbalanced ring; see http://wiki.apache.org/cassandra/Operations
    [junit] ------------- ---------------- ---------------
    [junit] Testsuite: org.apache.cassandra.streaming.BootstrapTest
    [junit] Tests run: 1, Failures: 0, Errors: 0, Time elapsed: 0.531 sec
    [junit] 
    [junit] Testsuite: org.apache.cassandra.streaming.StreamingTransferTest
    [junit] Tests run: 2, Failures: 0, Errors: 0, Time elapsed: 0.464 sec
    [junit] 
    [junit] ------------- Standard Error -----------------
    [junit]  WARN 18:12:19,827 Generated random token Token(bytes[8711150e9f405e756f113cde6f40b2d6]).
Random tokens will result in an unbalanced ring; see http://wiki.apache.org/cassandra/Operations
    [junit] ------------- ---------------- ---------------
    [junit] Testsuite: org.apache.cassandra.tools.SSTableExportTest
    [junit] Tests run: 4, Failures: 0, Errors: 0, Time elapsed: 0.581 sec
    [junit] 
    [junit] Testsuite: org.apache.cassandra.tools.SSTableImportTest
    [junit] Tests run: 2, Failures: 0, Errors: 0, Time elapsed: 0.541 sec
    [junit] 
    [junit] Testsuite: org.apache.cassandra.utils.BloomFilterTest
    [junit] Tests run: 6, Failures: 0, Errors: 0, Time elapsed: 0.502 sec
    [junit] 
    [junit] Testsuite: org.apache.cassandra.utils.BoundedStatsDequeTest
    [junit] Tests run: 1, Failures: 0, Errors: 0, Time elapsed: 0.052 sec
    [junit] 
    [junit] Testsuite: org.apache.cassandra.utils.EstimatedHistogramTest
    [junit] Tests run: 1, Failures: 0, Errors: 0, Time elapsed: 0.054 sec
    [junit] 
    [junit] Testsuite: org.apache.cassandra.utils.FBUtilitiesTest
    [junit] Tests run: 4, Failures: 0, Errors: 0, Time elapsed: 0.13 sec
    [junit] 
    [junit] Testsuite: org.apache.cassandra.utils.FilterTest
    [junit] Tests run: 1, Failures: 0, Errors: 0, Time elapsed: 0.213 sec
    [junit] 
    [junit] Testsuite: org.apache.cassandra.utils.MerkleTreeTest
    [junit] Tests run: 14, Failures: 0, Errors: 0, Time elapsed: 0.419 sec
    [junit] 

BUILD FAILED
<https://hudson.apache.org/hudson/job/Cassandra-0.7/ws/cassandra/build.xml>:456: The
following error occurred while executing this line:
<https://hudson.apache.org/hudson/job/Cassandra-0.7/ws/cassandra/build.xml>:451: Some
unit test(s) failed.

Total time: 10 minutes 36 seconds
[TASKS] Skipping publisher since build result is FAILURE
Publishing Javadoc
Archiving artifacts
Recording test results


Mime
View raw message