incubator-cassandra-dev mailing list archives

Site index · List index
Message view « Date » · « Thread »
Top « Date » · « Thread »
From Apache Hudson Server <hud...@hudson.apache.org>
Subject Build failed in Hudson: Cassandra-0.7 #40
Date Wed, 01 Dec 2010 18:49:54 GMT
See <https://hudson.apache.org/hudson/job/Cassandra-0.7/40/changes>

Changes:

[jbellis] SimpleStrategyTest extends CleanupHelper to avoid heisenbugs from other tests' left-overs
patch by jbellis

[jbellis] merge from 0.6

------------------------------------------
[...truncated 1585 lines...]
    [junit] Testsuite: org.apache.cassandra.dht.OrderPreservingPartitionerTest
    [junit] Tests run: 6, Failures: 0, Errors: 0, Time elapsed: 8.445 sec
    [junit] 
    [junit] Cobertura: Loaded information on 961 classes.
    [junit] Cobertura: Saved information on 961 classes.
    [junit] Testsuite: org.apache.cassandra.dht.RandomPartitionerTest
    [junit] Tests run: 5, Failures: 0, Errors: 0, Time elapsed: 4.102 sec
    [junit] 
    [junit] Cobertura: Loaded information on 961 classes.
    [junit] Cobertura: Saved information on 961 classes.
    [junit] Testsuite: org.apache.cassandra.dht.RangeTest
    [junit] Tests run: 12, Failures: 0, Errors: 0, Time elapsed: 0.505 sec
    [junit] 
    [junit] Cobertura: Loaded information on 961 classes.
    [junit] Cobertura: Saved information on 961 classes.
    [junit] Testsuite: org.apache.cassandra.gms.ArrivalWindowTest
    [junit] Tests run: 1, Failures: 0, Errors: 0, Time elapsed: 0.134 sec
    [junit] 
    [junit] Cobertura: Loaded information on 961 classes.
    [junit] Cobertura: Saved information on 961 classes.
    [junit] Testsuite: org.apache.cassandra.gms.GossipDigestTest
    [junit] Tests run: 1, Failures: 0, Errors: 0, Time elapsed: 0.066 sec
    [junit] 
    [junit] Cobertura: Loaded information on 961 classes.
    [junit] Cobertura: Saved information on 961 classes.
    [junit] Testsuite: org.apache.cassandra.hadoop.ColumnFamilyInputFormatTest
    [junit] Tests run: 1, Failures: 0, Errors: 0, Time elapsed: 0.212 sec
    [junit] 
    [junit] Cobertura: Loaded information on 961 classes.
    [junit] Cobertura: Saved information on 961 classes.
    [junit] Testsuite: org.apache.cassandra.io.BloomFilterTrackerTest
    [junit] Tests run: 3, Failures: 0, Errors: 0, Time elapsed: 0.429 sec
    [junit] 
    [junit] Cobertura: Loaded information on 961 classes.
    [junit] Cobertura: Saved information on 961 classes.
    [junit] Testsuite: org.apache.cassandra.io.LazilyCompactedRowTest
    [junit] Tests run: 5, Failures: 0, Errors: 0, Time elapsed: 21.332 sec
    [junit] 
    [junit] Cobertura: Loaded information on 961 classes.
    [junit] Cobertura: Saved information on 961 classes.
    [junit] Testsuite: org.apache.cassandra.io.sstable.LegacySSTableTest
    [junit] Tests run: 1, Failures: 0, Errors: 0, Time elapsed: 3.717 sec
    [junit] 
    [junit] ------------- Standard Error -----------------
    [junit]  WARN 18:45:48,593 Invalid file '.svn' in data directory <https://hudson.apache.org/hudson/job/Cassandra-0.7/ws/cassandra/test/data/legacy-sstables/b/Keyspace1.>
    [junit] ------------- ---------------- ---------------
    [junit] Cobertura: Loaded information on 961 classes.
    [junit] Cobertura: Saved information on 961 classes.
    [junit] Testsuite: org.apache.cassandra.io.sstable.SSTableReaderTest
    [junit] Tests run: 3, Failures: 0, Errors: 0, Time elapsed: 4.908 sec
    [junit] 
    [junit] Cobertura: Loaded information on 961 classes.
    [junit] Cobertura: Saved information on 961 classes.
    [junit] Testsuite: org.apache.cassandra.io.sstable.SSTableTest
    [junit] Tests run: 2, Failures: 0, Errors: 0, Time elapsed: 6.907 sec
    [junit] 
    [junit] Cobertura: Loaded information on 961 classes.
    [junit] Cobertura: Saved information on 961 classes.
    [junit] Testsuite: org.apache.cassandra.io.sstable.SSTableWriterTest
    [junit] Tests run: 1, Failures: 0, Errors: 0, Time elapsed: 1.068 sec
    [junit] 
    [junit] Cobertura: Loaded information on 961 classes.
    [junit] Cobertura: Saved information on 961 classes.
    [junit] Testsuite: org.apache.cassandra.io.util.BufferedRandomAccessFileTest
    [junit] Tests run: 4, Failures: 0, Errors: 0, Time elapsed: 0.863 sec
    [junit] 
    [junit] Cobertura: Loaded information on 961 classes.
    [junit] Cobertura: Saved information on 961 classes.
    [junit] Testsuite: org.apache.cassandra.locator.DynamicEndpointSnitchTest
    [junit] Tests run: 1, Failures: 0, Errors: 0, Time elapsed: 6.244 sec
    [junit] 
    [junit] Cobertura: Loaded information on 961 classes.
    [junit] Cobertura: Saved information on 961 classes.
    [junit] Testsuite: org.apache.cassandra.locator.NetworkTopologyStrategyTest
    [junit] Tests run: 1, Failures: 0, Errors: 0, Time elapsed: 0.498 sec
    [junit] 
    [junit] Cobertura: Loaded information on 961 classes.
    [junit] Cobertura: Saved information on 961 classes.
    [junit] Testsuite: org.apache.cassandra.locator.OldNetworkTopologyStrategyTest
    [junit] Tests run: 3, Failures: 0, Errors: 0, Time elapsed: 0.479 sec
    [junit] 
    [junit] Cobertura: Loaded information on 961 classes.
    [junit] Cobertura: Saved information on 961 classes.
    [junit] Testsuite: org.apache.cassandra.locator.ReplicationStrategyEndpointCacheTest
    [junit] Tests run: 2, Failures: 0, Errors: 0, Time elapsed: 0.671 sec
    [junit] 
    [junit] Cobertura: Loaded information on 961 classes.
    [junit] Cobertura: Saved information on 961 classes.
    [junit] Testsuite: org.apache.cassandra.locator.SimpleStrategyTest
    [junit] Tests run: 4, Failures: 0, Errors: 0, Time elapsed: 0.725 sec
    [junit] 
    [junit] Cobertura: Loaded information on 961 classes.
    [junit] Cobertura: Saved information on 961 classes.
    [junit] Testsuite: org.apache.cassandra.locator.TokenMetadataTest
    [junit] Tests run: 2, Failures: 0, Errors: 0, Time elapsed: 0.5 sec
    [junit] 
    [junit] Cobertura: Loaded information on 961 classes.
    [junit] Cobertura: Saved information on 961 classes.
    [junit] Testsuite: org.apache.cassandra.service.AntiEntropyServiceTest
    [junit] Exception in thread "Thread-5" java.lang.RuntimeException: java.lang.NullPointerException
    [junit] 	at org.apache.cassandra.utils.WrappedRunnable.run(WrappedRunnable.java:34)
    [junit] 	at org.apache.cassandra.streaming.StreamInSession.closeIfFinished(StreamInSession.java:164)
    [junit] 	at org.apache.cassandra.streaming.IncomingStreamReader.read(IncomingStreamReader.java:66)
    [junit] 	at org.apache.cassandra.net.IncomingTcpConnection.run(IncomingTcpConnection.java:75)
    [junit] Caused by: java.lang.NullPointerException
    [junit] 	at org.apache.cassandra.service.AntiEntropyService.completedRequest(AntiEntropyService.java:133)
    [junit] 	at org.apache.cassandra.service.AntiEntropyService$Differencer$Callback.runMayThrow(AntiEntropyService.java:537)
    [junit] 	at org.apache.cassandra.utils.WrappedRunnable.run(WrappedRunnable.java:30)
    [junit] 	... 3 more
    [junit] Tests run: 7, Failures: 0, Errors: 0, Time elapsed: 5.152 sec
    [junit] 
    [junit] ------------- Standard Error -----------------
    [junit]  WARN 18:46:52,386 Generated random token Token(bytes[fa7759a77616126ee8d4f7489c271d5c]).
Random tokens will result in an unbalanced ring; see http://wiki.apache.org/cassandra/Operations
    [junit] Exception in thread "AntiEntropyStage:1" java.lang.AssertionError
    [junit] 	at org.apache.cassandra.locator.TokenMetadata.firstTokenIndex(TokenMetadata.java:392)
    [junit] 	at org.apache.cassandra.locator.TokenMetadata.firstToken(TokenMetadata.java:406)
    [junit] 	at org.apache.cassandra.locator.AbstractReplicationStrategy.getNaturalEndpoints(AbstractReplicationStrategy.java:98)
    [junit] 	at org.apache.cassandra.service.StorageService.constructRangeToEndpointMap(StorageService.java:561)
    [junit] 	at org.apache.cassandra.service.StorageService.getRangeToAddressMap(StorageService.java:536)
    [junit] 	at org.apache.cassandra.service.AntiEntropyService.getNeighbors(AntiEntropyService.java:158)
    [junit] 	at org.apache.cassandra.service.AntiEntropyService.rendezvous(AntiEntropyService.java:182)
    [junit] 	at org.apache.cassandra.service.AntiEntropyService.access$100(AntiEntropyService.java:86)
    [junit] 	at org.apache.cassandra.service.AntiEntropyService$TreeResponseVerbHandler.doVerb(AntiEntropyService.java:659)
    [junit] 	at org.apache.cassandra.net.MessageDeliveryTask.run(MessageDeliveryTask.java:63)
    [junit] 	at java.util.concurrent.ThreadPoolExecutor$Worker.runTask(ThreadPoolExecutor.java:886)
    [junit] 	at java.util.concurrent.ThreadPoolExecutor$Worker.run(ThreadPoolExecutor.java:908)
    [junit] 	at java.lang.Thread.run(Thread.java:619)
    [junit] ------------- ---------------- ---------------
    [junit] Cobertura: Loaded information on 961 classes.
    [junit] Cobertura: Saved information on 961 classes.
    [junit] Testsuite: org.apache.cassandra.service.CassandraServerTest
    [junit] Tests run: 1, Failures: 0, Errors: 0, Time elapsed: 0.441 sec
    [junit] 
    [junit] Cobertura: Loaded information on 961 classes.
    [junit] Cobertura: Saved information on 961 classes.
    [junit] Testsuite: org.apache.cassandra.service.EmbeddedCassandraServiceTest
    [junit] Tests run: 1, Failures: 0, Errors: 0, Time elapsed: 1.91 sec
    [junit] 
    [junit] ------------- Standard Error -----------------
    [junit]  WARN 18:47:03,855 Unable to lock JVM memory (ENOMEM). This can result in part
of the JVM being swapped out, especially with mmapped I/O enabled. Increase RLIMIT_MEMLOCK
or run Cassandra as root.
    [junit]  WARN 18:47:04,805 Generated random token Token(bytes[d3b1876dbabf43db7f25ab92a6a8e190]).
Random tokens will result in an unbalanced ring; see http://wiki.apache.org/cassandra/Operations
    [junit] ------------- ---------------- ---------------
    [junit] Cobertura: Loaded information on 961 classes.
    [junit] Cobertura: Saved information on 961 classes.
    [junit] Testsuite: org.apache.cassandra.service.InitClientTest
    [junit] Tests run: 1, Failures: 0, Errors: 0, Time elapsed: 5.493 sec
    [junit] 
    [junit] Cobertura: Loaded information on 961 classes.
    [junit] Cobertura: Saved information on 961 classes.
    [junit] Testsuite: org.apache.cassandra.service.MoveTest
    [junit] Tests run: 6, Failures: 0, Errors: 0, Time elapsed: 3.804 sec
    [junit] 
    [junit] ------------- Standard Error -----------------
    [junit]  WARN 18:47:21,061 Node /127.0.0.3 'leaving' token mismatch. Long network partition?
    [junit] ------------- ---------------- ---------------
    [junit] Cobertura: Loaded information on 961 classes.
    [junit] Cobertura: Saved information on 961 classes.
    [junit] Testsuite: org.apache.cassandra.service.ReadResponseResolverTest
    [junit] Tests run: 5, Failures: 0, Errors: 0, Time elapsed: 0.512 sec
    [junit] 
    [junit] Cobertura: Loaded information on 961 classes.
    [junit] Cobertura: Saved information on 961 classes.
    [junit] Testsuite: org.apache.cassandra.service.RemoveTest
    [junit] Tests run: 5, Failures: 0, Errors: 0, Time elapsed: 3.391 sec
    [junit] 
    [junit] Cobertura: Loaded information on 961 classes.
    [junit] Cobertura: Saved information on 961 classes.
    [junit] Testsuite: org.apache.cassandra.service.StorageProxyTest
    [junit] Tests run: 4, Failures: 0, Errors: 0, Time elapsed: 0.518 sec
    [junit] 
    [junit] Cobertura: Loaded information on 961 classes.
    [junit] Cobertura: Saved information on 961 classes.
    [junit] Testsuite: org.apache.cassandra.service.StorageServiceClientTest
    [junit] Tests run: 1, Failures: 0, Errors: 0, Time elapsed: 5.519 sec
    [junit] 
    [junit] Cobertura: Loaded information on 961 classes.
    [junit] Cobertura: Saved information on 961 classes.
    [junit] Testsuite: org.apache.cassandra.service.StorageServiceServerTest
    [junit] Tests run: 3, Failures: 0, Errors: 0, Time elapsed: 1.398 sec
    [junit] 
    [junit] ------------- Standard Error -----------------
    [junit]  WARN 18:47:49,526 Generated random token Token(bytes[cb0647b097f1d207f7ff377ffc897835]).
Random tokens will result in an unbalanced ring; see http://wiki.apache.org/cassandra/Operations
    [junit] ------------- ---------------- ---------------
    [junit] Cobertura: Loaded information on 961 classes.
    [junit] Cobertura: Saved information on 961 classes.
    [junit] Testsuite: org.apache.cassandra.streaming.BootstrapTest
    [junit] Tests run: 1, Failures: 0, Errors: 0, Time elapsed: 0.69 sec
    [junit] 
    [junit] Cobertura: Loaded information on 961 classes.
    [junit] Cobertura: Saved information on 961 classes.
    [junit] Testsuite: org.apache.cassandra.streaming.StreamingTransferTest
    [junit] Tests run: 2, Failures: 0, Errors: 0, Time elapsed: 1.98 sec
    [junit] 
    [junit] ------------- Standard Error -----------------
    [junit]  WARN 18:47:58,138 Generated random token Token(bytes[c3ab8b3ed29ad248a967e14a410aaba0]).
Random tokens will result in an unbalanced ring; see http://wiki.apache.org/cassandra/Operations
    [junit] ------------- ---------------- ---------------
    [junit] Cobertura: Loaded information on 961 classes.
    [junit] Cobertura: Saved information on 961 classes.
    [junit] Testsuite: org.apache.cassandra.tools.SSTableExportTest
    [junit] Tests run: 4, Failures: 0, Errors: 0, Time elapsed: 1.269 sec
    [junit] 
    [junit] Cobertura: Loaded information on 961 classes.
    [junit] Cobertura: Saved information on 961 classes.
    [junit] Testsuite: org.apache.cassandra.tools.SSTableImportTest
    [junit] Tests run: 2, Failures: 0, Errors: 0, Time elapsed: 0.86 sec
    [junit] 
    [junit] Cobertura: Loaded information on 961 classes.
    [junit] Cobertura: Saved information on 961 classes.
    [junit] Testsuite: org.apache.cassandra.utils.BloomFilterTest
    [junit] Tests run: 6, Failures: 0, Errors: 0, Time elapsed: 6.294 sec
    [junit] 
    [junit] Cobertura: Loaded information on 961 classes.
    [junit] Cobertura: Saved information on 961 classes.
    [junit] Testsuite: org.apache.cassandra.utils.BoundedStatsDequeTest
    [junit] Tests run: 1, Failures: 0, Errors: 0, Time elapsed: 0.067 sec
    [junit] 
    [junit] Cobertura: Loaded information on 961 classes.
    [junit] Cobertura: Saved information on 961 classes.
    [junit] Testsuite: org.apache.cassandra.utils.EstimatedHistogramTest
    [junit] Tests run: 1, Failures: 0, Errors: 0, Time elapsed: 0.083 sec
    [junit] 
    [junit] Cobertura: Loaded information on 961 classes.
    [junit] Cobertura: Saved information on 961 classes.
    [junit] Testsuite: org.apache.cassandra.utils.FBUtilitiesTest
    [junit] Tests run: 4, Failures: 0, Errors: 0, Time elapsed: 0.171 sec
    [junit] 
    [junit] Cobertura: Loaded information on 961 classes.
    [junit] Cobertura: Saved information on 961 classes.
    [junit] Testsuite: org.apache.cassandra.utils.FilterTest
    [junit] Tests run: 1, Failures: 0, Errors: 0, Time elapsed: 2.053 sec
    [junit] 
    [junit] Cobertura: Loaded information on 961 classes.
    [junit] Cobertura: Saved information on 961 classes.
    [junit] Testsuite: org.apache.cassandra.utils.MerkleTreeTest
    [junit] Tests run: 14, Failures: 0, Errors: 0, Time elapsed: 0.59 sec
    [junit] 
    [junit] Cobertura: Loaded information on 961 classes.
    [junit] Cobertura: Saved information on 961 classes.

BUILD FAILED
<https://hudson.apache.org/hudson/job/Cassandra-0.7/ws/cassandra/build.xml>:456: The
following error occurred while executing this line:
<https://hudson.apache.org/hudson/job/Cassandra-0.7/ws/cassandra/build.xml>:451: Some
unit test(s) failed.

Total time: 17 minutes 30 seconds
[TASKS] Skipping publisher since build result is FAILURE
Publishing Javadoc
Archiving artifacts
Recording test results
Skipping Cobertura coverage report as build was not UNSTABLE or better ...


Mime
View raw message