incubator-cassandra-dev mailing list archives

Site index · List index
Message view « Date » · « Thread »
Top « Date » · « Thread »
From Apache Hudson Server <hud...@hudson.apache.org>
Subject Build failed in Hudson: Cassandra-0.7 #47
Date Fri, 03 Dec 2010 15:59:51 GMT
See <https://hudson.apache.org/hudson/job/Cassandra-0.7/47/changes>

Changes:

[jbellis] add debug messages for system_ thrift calls
patch by jbellis

------------------------------------------
[...truncated 1575 lines...]
    [junit] Cobertura: Saved information on 961 classes.
    [junit] Testsuite: org.apache.cassandra.dht.RangeTest
    [junit] Tests run: 12, Failures: 0, Errors: 0, Time elapsed: 0.498 sec
    [junit] 
    [junit] Cobertura: Loaded information on 961 classes.
    [junit] Cobertura: Saved information on 961 classes.
    [junit] Testsuite: org.apache.cassandra.gms.ArrivalWindowTest
    [junit] Tests run: 1, Failures: 0, Errors: 0, Time elapsed: 0.133 sec
    [junit] 
    [junit] Cobertura: Loaded information on 961 classes.
    [junit] Cobertura: Saved information on 961 classes.
    [junit] Testsuite: org.apache.cassandra.gms.GossipDigestTest
    [junit] Tests run: 1, Failures: 0, Errors: 0, Time elapsed: 0.066 sec
    [junit] 
    [junit] Cobertura: Loaded information on 961 classes.
    [junit] Cobertura: Saved information on 961 classes.
    [junit] Testsuite: org.apache.cassandra.hadoop.ColumnFamilyInputFormatTest
    [junit] Tests run: 1, Failures: 0, Errors: 0, Time elapsed: 0.212 sec
    [junit] 
    [junit] Cobertura: Loaded information on 961 classes.
    [junit] Cobertura: Saved information on 961 classes.
    [junit] Testsuite: org.apache.cassandra.io.BloomFilterTrackerTest
    [junit] Tests run: 3, Failures: 0, Errors: 0, Time elapsed: 0.426 sec
    [junit] 
    [junit] Cobertura: Loaded information on 961 classes.
    [junit] Cobertura: Saved information on 961 classes.
    [junit] Testsuite: org.apache.cassandra.io.LazilyCompactedRowTest
    [junit] Tests run: 5, Failures: 0, Errors: 0, Time elapsed: 21.453 sec
    [junit] 
    [junit] Cobertura: Loaded information on 961 classes.
    [junit] Cobertura: Saved information on 961 classes.
    [junit] Testsuite: org.apache.cassandra.io.sstable.LegacySSTableTest
    [junit] Tests run: 1, Failures: 0, Errors: 0, Time elapsed: 3.728 sec
    [junit] 
    [junit] ------------- Standard Error -----------------
    [junit]  WARN 15:55:45,128 Invalid file '.svn' in data directory <https://hudson.apache.org/hudson/job/Cassandra-0.7/ws/cassandra/test/data/legacy-sstables/b/Keyspace1.>
    [junit] ------------- ---------------- ---------------
    [junit] Cobertura: Loaded information on 961 classes.
    [junit] Cobertura: Saved information on 961 classes.
    [junit] Testsuite: org.apache.cassandra.io.sstable.SSTableReaderTest
    [junit] Tests run: 3, Failures: 0, Errors: 0, Time elapsed: 5.503 sec
    [junit] 
    [junit] Cobertura: Loaded information on 961 classes.
    [junit] Cobertura: Saved information on 961 classes.
    [junit] Testsuite: org.apache.cassandra.io.sstable.SSTableTest
    [junit] Tests run: 2, Failures: 0, Errors: 0, Time elapsed: 6.938 sec
    [junit] 
    [junit] Cobertura: Loaded information on 961 classes.
    [junit] Cobertura: Saved information on 961 classes.
    [junit] Testsuite: org.apache.cassandra.io.sstable.SSTableWriterTest
    [junit] Tests run: 1, Failures: 0, Errors: 0, Time elapsed: 1.111 sec
    [junit] 
    [junit] Cobertura: Loaded information on 961 classes.
    [junit] Cobertura: Saved information on 961 classes.
    [junit] Testsuite: org.apache.cassandra.io.util.BufferedRandomAccessFileTest
    [junit] Tests run: 4, Failures: 0, Errors: 0, Time elapsed: 0.786 sec
    [junit] 
    [junit] Cobertura: Loaded information on 961 classes.
    [junit] Cobertura: Saved information on 961 classes.
    [junit] Testsuite: org.apache.cassandra.locator.DynamicEndpointSnitchTest
    [junit] Tests run: 1, Failures: 0, Errors: 0, Time elapsed: 6.253 sec
    [junit] 
    [junit] Cobertura: Loaded information on 961 classes.
    [junit] Cobertura: Saved information on 961 classes.
    [junit] Testsuite: org.apache.cassandra.locator.NetworkTopologyStrategyTest
    [junit] Tests run: 1, Failures: 0, Errors: 0, Time elapsed: 0.497 sec
    [junit] 
    [junit] Cobertura: Loaded information on 961 classes.
    [junit] Cobertura: Saved information on 961 classes.
    [junit] Testsuite: org.apache.cassandra.locator.OldNetworkTopologyStrategyTest
    [junit] Tests run: 3, Failures: 0, Errors: 0, Time elapsed: 0.505 sec
    [junit] 
    [junit] Cobertura: Loaded information on 961 classes.
    [junit] Cobertura: Saved information on 961 classes.
    [junit] Testsuite: org.apache.cassandra.locator.ReplicationStrategyEndpointCacheTest
    [junit] Tests run: 2, Failures: 0, Errors: 0, Time elapsed: 0.669 sec
    [junit] 
    [junit] Cobertura: Loaded information on 961 classes.
    [junit] Cobertura: Saved information on 961 classes.
    [junit] Testsuite: org.apache.cassandra.locator.SimpleStrategyTest
    [junit] Tests run: 4, Failures: 0, Errors: 0, Time elapsed: 0.716 sec
    [junit] 
    [junit] Cobertura: Loaded information on 961 classes.
    [junit] Cobertura: Saved information on 961 classes.
    [junit] Testsuite: org.apache.cassandra.locator.TokenMetadataTest
    [junit] Tests run: 2, Failures: 0, Errors: 0, Time elapsed: 0.508 sec
    [junit] 
    [junit] Cobertura: Loaded information on 961 classes.
    [junit] Cobertura: Saved information on 961 classes.
    [junit] Testsuite: org.apache.cassandra.service.AntiEntropyServiceTest
    [junit] Exception in thread "Thread-5" java.lang.RuntimeException: java.lang.NullPointerException
    [junit] Tests run: 7, Failures: 0, Errors: 0, Time elapsed: 4.788 sec
    [junit] 	at org.apache.cassandra.utils.WrappedRunnable.run(WrappedRunnable.java:34)
    [junit] 
    [junit] 	at org.apache.cassandra.streaming.StreamInSession.closeIfFinished(StreamInSession.java:164)
    [junit] ------------- Standard Error -----------------
    [junit] 	at org.apache.cassandra.streaming.IncomingStreamReader.read(IncomingStreamReader.java:66)
    [junit]  WARN 15:56:48,767 Generated random token Token(bytes[b40753a2085030464e86bc9282018827]).
Random tokens will result in an unbalanced ring; see http://wiki.apache.org/cassandra/Operations
    [junit] 	at org.apache.cassandra.net.IncomingTcpConnection.run(IncomingTcpConnection.java:75)
    [junit] Exception in thread "AntiEntropyStage:1" java.lang.AssertionError
    [junit] Caused by: java.lang.NullPointerException
    [junit] 	at org.apache.cassandra.locator.TokenMetadata.firstTokenIndex(TokenMetadata.java:392)
    [junit] 	at org.apache.cassandra.service.AntiEntropyService.completedRequest(AntiEntropyService.java:133)
    [junit] 	at org.apache.cassandra.locator.TokenMetadata.firstToken(TokenMetadata.java:406)
    [junit] 	at org.apache.cassandra.service.AntiEntropyService$Differencer$Callback.runMayThrow(AntiEntropyService.java:537)
    [junit] 	at org.apache.cassandra.locator.AbstractReplicationStrategy.getNaturalEndpoints(AbstractReplicationStrategy.java:98)
    [junit] 	at org.apache.cassandra.utils.WrappedRunnable.run(WrappedRunnable.java:30)
    [junit] 	at org.apache.cassandra.service.StorageService.constructRangeToEndpointMap(StorageService.java:561)
    [junit] 	... 3 more
    [junit] 	at org.apache.cassandra.service.StorageService.getRangeToAddressMap(StorageService.java:536)
    [junit] 	at org.apache.cassandra.service.AntiEntropyService.getNeighbors(AntiEntropyService.java:158)
    [junit] 	at org.apache.cassandra.service.AntiEntropyService.rendezvous(AntiEntropyService.java:182)
    [junit] 	at org.apache.cassandra.service.AntiEntropyService.access$100(AntiEntropyService.java:86)
    [junit] 	at org.apache.cassandra.service.AntiEntropyService$TreeResponseVerbHandler.doVerb(AntiEntropyService.java:659)
    [junit] 	at org.apache.cassandra.net.MessageDeliveryTask.run(MessageDeliveryTask.java:63)
    [junit] 	at java.util.concurrent.ThreadPoolExecutor$Worker.runTask(ThreadPoolExecutor.java:886)
    [junit] 	at java.util.concurrent.ThreadPoolExecutor$Worker.run(ThreadPoolExecutor.java:908)
    [junit] 	at java.lang.Thread.run(Thread.java:619)
    [junit] ------------- ---------------- ---------------
    [junit] Cobertura: Loaded information on 961 classes.
    [junit] Cobertura: Saved information on 961 classes.
    [junit] Testsuite: org.apache.cassandra.service.CassandraServerTest
    [junit] Tests run: 1, Failures: 0, Errors: 0, Time elapsed: 0.435 sec
    [junit] 
    [junit] Cobertura: Loaded information on 961 classes.
    [junit] Cobertura: Saved information on 961 classes.
    [junit] Testsuite: org.apache.cassandra.service.EmbeddedCassandraServiceTest
    [junit] Tests run: 1, Failures: 0, Errors: 0, Time elapsed: 1.951 sec
    [junit] 
    [junit] ------------- Standard Error -----------------
    [junit]  WARN 15:57:00,214 Unable to lock JVM memory (ENOMEM). This can result in part
of the JVM being swapped out, especially with mmapped I/O enabled. Increase RLIMIT_MEMLOCK
or run Cassandra as root.
    [junit]  WARN 15:57:01,203 Generated random token Token(bytes[2a5febe162c0e27b31255a2090f3303c]).
Random tokens will result in an unbalanced ring; see http://wiki.apache.org/cassandra/Operations
    [junit] ------------- ---------------- ---------------
    [junit] Cobertura: Loaded information on 961 classes.
    [junit] Cobertura: Saved information on 961 classes.
    [junit] Testsuite: org.apache.cassandra.service.InitClientTest
    [junit] Tests run: 1, Failures: 0, Errors: 0, Time elapsed: 5.491 sec
    [junit] 
    [junit] Cobertura: Loaded information on 961 classes.
    [junit] Cobertura: Saved information on 961 classes.
    [junit] Testsuite: org.apache.cassandra.service.MoveTest
    [junit] Tests run: 6, Failures: 0, Errors: 0, Time elapsed: 3.761 sec
    [junit] 
    [junit] ------------- Standard Error -----------------
    [junit]  WARN 15:57:17,358 Node /127.0.0.3 'leaving' token mismatch. Long network partition?
    [junit] ------------- ---------------- ---------------
    [junit] Cobertura: Loaded information on 961 classes.
    [junit] Cobertura: Saved information on 961 classes.
    [junit] Testsuite: org.apache.cassandra.service.ReadResponseResolverTest
    [junit] Tests run: 5, Failures: 0, Errors: 0, Time elapsed: 0.514 sec
    [junit] 
    [junit] Cobertura: Loaded information on 961 classes.
    [junit] Cobertura: Saved information on 961 classes.
    [junit] Testsuite: org.apache.cassandra.service.RemoveTest
    [junit] Tests run: 5, Failures: 0, Errors: 0, Time elapsed: 3.695 sec
    [junit] 
    [junit] Cobertura: Loaded information on 961 classes.
    [junit] Cobertura: Saved information on 961 classes.
    [junit] Testsuite: org.apache.cassandra.service.StorageProxyTest
    [junit] Tests run: 4, Failures: 0, Errors: 0, Time elapsed: 0.501 sec
    [junit] 
    [junit] Cobertura: Loaded information on 961 classes.
    [junit] Cobertura: Saved information on 961 classes.
    [junit] Testsuite: org.apache.cassandra.service.StorageServiceClientTest
    [junit] Tests run: 1, Failures: 0, Errors: 0, Time elapsed: 5.506 sec
    [junit] 
    [junit] Cobertura: Loaded information on 961 classes.
    [junit] Cobertura: Saved information on 961 classes.
    [junit] Testsuite: org.apache.cassandra.service.StorageServiceServerTest
    [junit] Tests run: 3, Failures: 0, Errors: 0, Time elapsed: 1.35 sec
    [junit] 
    [junit] ------------- Standard Error -----------------
    [junit]  WARN 15:57:45,996 Generated random token Token(bytes[bb5ef58274b58038eb90ff919bf4ec74]).
Random tokens will result in an unbalanced ring; see http://wiki.apache.org/cassandra/Operations
    [junit] ------------- ---------------- ---------------
    [junit] Cobertura: Loaded information on 961 classes.
    [junit] Cobertura: Saved information on 961 classes.
    [junit] Testsuite: org.apache.cassandra.streaming.BootstrapTest
    [junit] Tests run: 1, Failures: 0, Errors: 0, Time elapsed: 0.69 sec
    [junit] 
    [junit] Cobertura: Loaded information on 961 classes.
    [junit] Cobertura: Saved information on 961 classes.
    [junit] Testsuite: org.apache.cassandra.streaming.StreamingTransferTest
    [junit] Tests run: 2, Failures: 0, Errors: 0, Time elapsed: 1.984 sec
    [junit] 
    [junit] ------------- Standard Error -----------------
    [junit]  WARN 15:57:54,436 Generated random token Token(bytes[2cdf1d4283486708b064273eee26ca79]).
Random tokens will result in an unbalanced ring; see http://wiki.apache.org/cassandra/Operations
    [junit] ------------- ---------------- ---------------
    [junit] Cobertura: Loaded information on 961 classes.
    [junit] Cobertura: Saved information on 961 classes.
    [junit] Testsuite: org.apache.cassandra.tools.SSTableExportTest
    [junit] Tests run: 4, Failures: 0, Errors: 1, Time elapsed: 1.213 sec
    [junit] 
    [junit] Testcase: testExportSimpleCf(org.apache.cassandra.tools.SSTableExportTest):	Caused
an ERROR
    [junit] Index: 4, Size: 4
    [junit] java.lang.IndexOutOfBoundsException: Index: 4, Size: 4
    [junit] 	at java.util.ArrayList.RangeCheck(ArrayList.java:547)
    [junit] 	at java.util.ArrayList.get(ArrayList.java:322)
    [junit] 	at org.apache.cassandra.tools.SSTableExportTest.testExportSimpleCf(SSTableExportTest.java:130)
    [junit] 
    [junit] 
    [junit] Cobertura: Loaded information on 961 classes.
    [junit] Cobertura: Saved information on 961 classes.
    [junit] Test org.apache.cassandra.tools.SSTableExportTest FAILED
    [junit] Testsuite: org.apache.cassandra.tools.SSTableImportTest
    [junit] Tests run: 2, Failures: 0, Errors: 0, Time elapsed: 0.838 sec
    [junit] 
    [junit] Cobertura: Loaded information on 961 classes.
    [junit] Cobertura: Saved information on 961 classes.
    [junit] Testsuite: org.apache.cassandra.utils.BloomFilterTest
    [junit] Tests run: 6, Failures: 0, Errors: 0, Time elapsed: 6.419 sec
    [junit] 
    [junit] Cobertura: Loaded information on 961 classes.
    [junit] Cobertura: Saved information on 961 classes.
    [junit] Testsuite: org.apache.cassandra.utils.BoundedStatsDequeTest
    [junit] Tests run: 1, Failures: 0, Errors: 0, Time elapsed: 0.068 sec
    [junit] 
    [junit] Cobertura: Loaded information on 961 classes.
    [junit] Cobertura: Saved information on 961 classes.
    [junit] Testsuite: org.apache.cassandra.utils.EstimatedHistogramTest
    [junit] Tests run: 1, Failures: 0, Errors: 0, Time elapsed: 0.083 sec
    [junit] 
    [junit] Cobertura: Loaded information on 961 classes.
    [junit] Cobertura: Saved information on 961 classes.
    [junit] Testsuite: org.apache.cassandra.utils.FBUtilitiesTest
    [junit] Tests run: 4, Failures: 0, Errors: 0, Time elapsed: 0.171 sec
    [junit] 
    [junit] Cobertura: Loaded information on 961 classes.
    [junit] Cobertura: Saved information on 961 classes.
    [junit] Testsuite: org.apache.cassandra.utils.FilterTest
    [junit] Tests run: 1, Failures: 0, Errors: 0, Time elapsed: 2.032 sec
    [junit] 
    [junit] Cobertura: Loaded information on 961 classes.
    [junit] Cobertura: Saved information on 961 classes.
    [junit] Testsuite: org.apache.cassandra.utils.MerkleTreeTest
    [junit] Tests run: 14, Failures: 0, Errors: 0, Time elapsed: 0.588 sec
    [junit] 
    [junit] Cobertura: Loaded information on 961 classes.
    [junit] Cobertura: Saved information on 961 classes.

BUILD FAILED
<https://hudson.apache.org/hudson/job/Cassandra-0.7/ws/cassandra/build.xml>:456: The
following error occurred while executing this line:
<https://hudson.apache.org/hudson/job/Cassandra-0.7/ws/cassandra/build.xml>:451: Some
unit test(s) failed.

Total time: 17 minutes 29 seconds
[TASKS] Skipping publisher since build result is FAILURE
Publishing Javadoc
Archiving artifacts
Recording test results
Skipping Cobertura coverage report as build was not UNSTABLE or better ...


Mime
View raw message