incubator-cassandra-dev mailing list archives

Site index · List index
Message view « Date » · « Thread »
Top « Date » · « Thread »
From Apache Hudson Server <hud...@hudson.apache.org>
Subject Build failed in Hudson: Cassandra-0.7 #65
Date Fri, 10 Dec 2010 04:14:55 GMT
See <https://hudson.apache.org/hudson/job/Cassandra-0.7/65/changes>

Changes:

[jbellis] r/m whitespace

------------------------------------------
[...truncated 1408 lines...]
    [junit] Timeout occurred. Please note the time in the report does not reflect the time
until the timeout.
    [junit] junit.framework.AssertionFailedError: Timeout occurred. Please note the time in
the report does not reflect the time until the timeout.
    [junit] 
    [junit] 
    [junit] Test org.apache.cassandra.db.NameSortTest FAILED (timeout)
    [junit] Testsuite: org.apache.cassandra.db.OneCompactionTest
    [junit] Tests run: 2, Failures: 0, Errors: 0, Time elapsed: 1.281 sec
    [junit] 
    [junit] Testsuite: org.apache.cassandra.db.ReadMessageTest
    [junit] Tests run: 2, Failures: 0, Errors: 0, Time elapsed: 0.661 sec
    [junit] 
    [junit] Testsuite: org.apache.cassandra.db.RecoveryManager2Test
    [junit] Tests run: 1, Failures: 0, Errors: 0, Time elapsed: 4.172 sec
    [junit] 
    [junit] Testsuite: org.apache.cassandra.db.RecoveryManager3Test
    [junit] Tests run: 1, Failures: 0, Errors: 0, Time elapsed: 1.087 sec
    [junit] 
    [junit] Testsuite: org.apache.cassandra.db.RecoveryManagerTest
    [junit] Tests run: 2, Failures: 0, Errors: 0, Time elapsed: 1.05 sec
    [junit] 
    [junit] Testsuite: org.apache.cassandra.db.RecoveryManagerTruncateTest
    [junit] Tests run: 1, Failures: 0, Errors: 0, Time elapsed: 1.019 sec
    [junit] 
    [junit] Testsuite: org.apache.cassandra.db.RemoveColumnFamilyTest
    [junit] Tests run: 1, Failures: 0, Errors: 0, Time elapsed: 0.543 sec
    [junit] 
    [junit] Testsuite: org.apache.cassandra.db.RemoveColumnFamilyWithFlush1Test
    [junit] Tests run: 1, Failures: 0, Errors: 0, Time elapsed: 0.774 sec
    [junit] 
    [junit] Testsuite: org.apache.cassandra.db.RemoveColumnFamilyWithFlush2Test
    [junit] Tests run: 1, Failures: 0, Errors: 0, Time elapsed: 0.812 sec
    [junit] 
    [junit] Testsuite: org.apache.cassandra.db.RemoveColumnTest
    [junit] Tests run: 1, Failures: 0, Errors: 0, Time elapsed: 0.811 sec
    [junit] 
    [junit] Testsuite: org.apache.cassandra.db.RemoveSubColumnTest
    [junit] Tests run: 1, Failures: 0, Errors: 0, Time elapsed: 0.801 sec
    [junit] 
    [junit] Testsuite: org.apache.cassandra.db.RemoveSuperColumnTest
    [junit] Tests run: 4, Failures: 0, Errors: 0, Time elapsed: 1.882 sec
    [junit] 
    [junit] Testsuite: org.apache.cassandra.db.RowIterationTest
    [junit] Tests run: 1, Failures: 0, Errors: 0, Time elapsed: 0.789 sec
    [junit] 
    [junit] Testsuite: org.apache.cassandra.db.RowTest
    [junit] Tests run: 4, Failures: 0, Errors: 0, Time elapsed: 2.391 sec
    [junit] 
    [junit] Testsuite: org.apache.cassandra.db.SuperColumnTest
    [junit] Tests run: 1, Failures: 0, Errors: 0, Time elapsed: 0.125 sec
    [junit] 
    [junit] Testsuite: org.apache.cassandra.db.TableTest
    [junit] Tests run: 10, Failures: 0, Errors: 0, Time elapsed: 3.776 sec
    [junit] 
    [junit] Testsuite: org.apache.cassandra.db.TimeSortTest
    [junit] Tests run: 2, Failures: 0, Errors: 0, Time elapsed: 5.779 sec
    [junit] 
    [junit] Testsuite: org.apache.cassandra.db.commitlog.CommitLogHeaderTest
    [junit] Tests run: 2, Failures: 0, Errors: 0, Time elapsed: 0.381 sec
    [junit] 
    [junit] Testsuite: org.apache.cassandra.db.marshal.IntegerTypeTest
    [junit] Tests run: 10, Failures: 0, Errors: 0, Time elapsed: 0.185 sec
    [junit] 
    [junit] Testsuite: org.apache.cassandra.db.marshal.TimeUUIDTypeTest
    [junit] Tests run: 4, Failures: 0, Errors: 0, Time elapsed: 0.069 sec
    [junit] 
    [junit] Testsuite: org.apache.cassandra.db.marshal.TypeCompareTest
    [junit] Tests run: 5, Failures: 0, Errors: 0, Time elapsed: 0.138 sec
    [junit] 
    [junit] Testsuite: org.apache.cassandra.dht.BootStrapperTest
    [junit] Tests run: 4, Failures: 0, Errors: 0, Time elapsed: 1.781 sec
    [junit] 
    [junit] ------------- Standard Error -----------------
    [junit]  WARN 04:11:51,956 Generated random token Token(bytes[5f97af8e00474b0600b97a1f36967fe3]).
Random tokens will result in an unbalanced ring; see http://wiki.apache.org/cassandra/Operations
    [junit] ------------- ---------------- ---------------
    [junit] Testsuite: org.apache.cassandra.dht.ByteOrderedPartitionerTest
    [junit] Tests run: 5, Failures: 0, Errors: 0, Time elapsed: 0.997 sec
    [junit] 
    [junit] Testsuite: org.apache.cassandra.dht.CollatingOrderPreservingPartitionerTest
    [junit] Tests run: 7, Failures: 0, Errors: 0, Time elapsed: 1.252 sec
    [junit] 
    [junit] Testsuite: org.apache.cassandra.dht.OrderPreservingPartitionerTest
    [junit] Tests run: 6, Failures: 0, Errors: 0, Time elapsed: 1.114 sec
    [junit] 
    [junit] Testsuite: org.apache.cassandra.dht.RandomPartitionerTest
    [junit] Tests run: 5, Failures: 0, Errors: 0, Time elapsed: 0.643 sec
    [junit] 
    [junit] Testsuite: org.apache.cassandra.dht.RangeTest
    [junit] Tests run: 12, Failures: 0, Errors: 0, Time elapsed: 0.385 sec
    [junit] 
    [junit] Testsuite: org.apache.cassandra.gms.ArrivalWindowTest
    [junit] Tests run: 1, Failures: 0, Errors: 0, Time elapsed: 0.113 sec
    [junit] 
    [junit] Testsuite: org.apache.cassandra.gms.GossipDigestTest
    [junit] Tests run: 1, Failures: 0, Errors: 0, Time elapsed: 0.053 sec
    [junit] 
    [junit] Testsuite: org.apache.cassandra.hadoop.ColumnFamilyInputFormatTest
    [junit] Tests run: 1, Failures: 0, Errors: 0, Time elapsed: 0.196 sec
    [junit] 
    [junit] Testsuite: org.apache.cassandra.io.BloomFilterTrackerTest
    [junit] Tests run: 3, Failures: 0, Errors: 0, Time elapsed: 0.326 sec
    [junit] 
    [junit] Testsuite: org.apache.cassandra.io.LazilyCompactedRowTest
    [junit] Tests run: 5, Failures: 0, Errors: 0, Time elapsed: 17.779 sec
    [junit] 
    [junit] Testsuite: org.apache.cassandra.io.sstable.LegacySSTableTest
    [junit] Tests run: 1, Failures: 0, Errors: 0, Time elapsed: 0.827 sec
    [junit] 
    [junit] ------------- Standard Error -----------------
    [junit]  WARN 04:12:24,691 Invalid file '.svn' in data directory <https://hudson.apache.org/hudson/job/Cassandra-0.7/ws/cassandra/test/data/legacy-sstables/b/Keyspace1.>
    [junit] ------------- ---------------- ---------------
    [junit] Testsuite: org.apache.cassandra.io.sstable.SSTableReaderTest
    [junit] Tests run: 3, Failures: 0, Errors: 0, Time elapsed: 5.425 sec
    [junit] 
    [junit] Testsuite: org.apache.cassandra.io.sstable.SSTableTest
    [junit] Tests run: 2, Failures: 0, Errors: 0, Time elapsed: 1.252 sec
    [junit] 
    [junit] Testsuite: org.apache.cassandra.io.sstable.SSTableWriterTest
    [junit] Tests run: 1, Failures: 0, Errors: 0, Time elapsed: 0.885 sec
    [junit] 
    [junit] Testsuite: org.apache.cassandra.io.util.BufferedRandomAccessFileTest
    [junit] Tests run: 4, Failures: 0, Errors: 0, Time elapsed: 0.673 sec
    [junit] 
    [junit] Testsuite: org.apache.cassandra.locator.DynamicEndpointSnitchTest
    [junit] Tests run: 1, Failures: 0, Errors: 0, Time elapsed: 6.135 sec
    [junit] 
    [junit] Testsuite: org.apache.cassandra.locator.NetworkTopologyStrategyTest
    [junit] Tests run: 1, Failures: 0, Errors: 0, Time elapsed: 0.39 sec
    [junit] 
    [junit] Testsuite: org.apache.cassandra.locator.OldNetworkTopologyStrategyTest
    [junit] Tests run: 3, Failures: 0, Errors: 0, Time elapsed: 0.397 sec
    [junit] 
    [junit] Testsuite: org.apache.cassandra.locator.ReplicationStrategyEndpointCacheTest
    [junit] Tests run: 2, Failures: 0, Errors: 0, Time elapsed: 0.536 sec
    [junit] 
    [junit] Testsuite: org.apache.cassandra.locator.SimpleStrategyTest
    [junit] Tests run: 4, Failures: 0, Errors: 0, Time elapsed: 0.557 sec
    [junit] 
    [junit] Testsuite: org.apache.cassandra.locator.TokenMetadataTest
    [junit] Tests run: 2, Failures: 0, Errors: 0, Time elapsed: 0.384 sec
    [junit] 
    [junit] Testsuite: org.apache.cassandra.service.AntiEntropyServiceTest
    [junit] Exception in thread "Thread-4" java.lang.RuntimeException: java.lang.NullPointerException
    [junit] 	at org.apache.cassandra.utils.WrappedRunnable.run(WrappedRunnable.java:34)
    [junit] 	at org.apache.cassandra.streaming.StreamInSession.closeIfFinished(StreamInSession.java:164)
    [junit] 	at org.apache.cassandra.streaming.IncomingStreamReader.read(IncomingStreamReader.java:66)
    [junit] 	at org.apache.cassandra.net.IncomingTcpConnection.run(IncomingTcpConnection.java:75)
    [junit] Tests run: 7, Failures: 0, Errors: 0, Time elapsed: 2.38 sec
    [junit] Caused by: java.lang.NullPointerException
    [junit] 
    [junit] 	at org.apache.cassandra.service.AntiEntropyService.completedRequest(AntiEntropyService.java:133)
    [junit] ------------- Standard Error -----------------
    [junit] 	at org.apache.cassandra.service.AntiEntropyService$Differencer$Callback.runMayThrow(AntiEntropyService.java:537)
    [junit]  WARN 04:12:50,852 Generated random token Token(bytes[15e1abb130a8dde781dcc314d8b5c611]).
Random tokens will result in an unbalanced ring; see http://wiki.apache.org/cassandra/Operations
    [junit] 	at org.apache.cassandra.utils.WrappedRunnable.run(WrappedRunnable.java:30)
    [junit] ------------- ---------------- ---------------
    [junit] 	... 3 more
    [junit] Testsuite: org.apache.cassandra.service.CassandraServerTest
    [junit] Tests run: 1, Failures: 0, Errors: 0, Time elapsed: 0.329 sec
    [junit] 
    [junit] Testsuite: org.apache.cassandra.service.ConsistencyLevelTest
    [junit] Tests run: 1, Failures: 0, Errors: 0, Time elapsed: 0.66 sec
    [junit] 
    [junit] Testsuite: org.apache.cassandra.service.EmbeddedCassandraServiceTest
    [junit] Tests run: 1, Failures: 0, Errors: 1, Time elapsed: 1.704 sec
    [junit] 
    [junit] ------------- Standard Error -----------------
    [junit]  WARN 04:12:56,594 Unable to lock JVM memory (ENOMEM). This can result in part
of the JVM being swapped out, especially with mmapped I/O enabled. Increase RLIMIT_MEMLOCK
or run Cassandra as root.
    [junit]  WARN 04:12:57,601 Generated random token Token(bytes[262aa8c51786c9cf1ca470ec8a55ffdc]).
Random tokens will result in an unbalanced ring; see http://wiki.apache.org/cassandra/Operations
    [junit] ------------- ---------------- ---------------
    [junit] Testcase: testEmbeddedCassandraService(org.apache.cassandra.service.EmbeddedCassandraServiceTest):
Caused an ERROR
    [junit] null
    [junit] UnavailableException()
    [junit] 	at org.apache.cassandra.thrift.Cassandra$insert_result.read(Cassandra.java:14416)
    [junit] 	at org.apache.cassandra.thrift.Cassandra$Client.recv_insert(Cassandra.java:828)
    [junit] 	at org.apache.cassandra.thrift.Cassandra$Client.insert(Cassandra.java:800)
    [junit] 	at org.apache.cassandra.service.EmbeddedCassandraServiceTest.testEmbeddedCassandraService(EmbeddedCassandraServiceTest.java:101)
    [junit] 
    [junit] 
    [junit] Test org.apache.cassandra.service.EmbeddedCassandraServiceTest FAILED
    [junit] Testsuite: org.apache.cassandra.service.InitClientTest
    [junit] Tests run: 1, Failures: 0, Errors: 0, Time elapsed: 5.383 sec
    [junit] 
    [junit] Testsuite: org.apache.cassandra.service.MoveTest
    [junit] Tests run: 6, Failures: 0, Errors: 0, Time elapsed: 3.222 sec
    [junit] 
    [junit] ------------- Standard Error -----------------
    [junit]  WARN 04:13:08,112 Node /127.0.0.3 'leaving' token mismatch. Long network partition?
    [junit] ------------- ---------------- ---------------
    [junit] Testsuite: org.apache.cassandra.service.ReadResponseResolverTest
    [junit] Tests run: 5, Failures: 0, Errors: 0, Time elapsed: 0.399 sec
    [junit] 
    [junit] Testsuite: org.apache.cassandra.service.RemoveTest
    [junit] Tests run: 5, Failures: 0, Errors: 0, Time elapsed: 3.244 sec
    [junit] 
    [junit] Testsuite: org.apache.cassandra.service.StorageProxyTest
    [junit] Tests run: 4, Failures: 0, Errors: 0, Time elapsed: 0.357 sec
    [junit] 
    [junit] Testsuite: org.apache.cassandra.service.StorageServiceClientTest
    [junit] Tests run: 1, Failures: 0, Errors: 0, Time elapsed: 5.403 sec
    [junit] 
    [junit] Testsuite: org.apache.cassandra.service.StorageServiceServerTest
    [junit] Tests run: 3, Failures: 0, Errors: 0, Time elapsed: 1.032 sec
    [junit] 
    [junit] ------------- Standard Error -----------------
    [junit]  WARN 04:13:22,816 Generated random token Token(bytes[a9abc2b4f076ee66ea3d1d1e7af14926]).
Random tokens will result in an unbalanced ring; see http://wiki.apache.org/cassandra/Operations
    [junit] ------------- ---------------- ---------------
    [junit] Testsuite: org.apache.cassandra.streaming.BootstrapTest
    [junit] Tests run: 1, Failures: 0, Errors: 0, Time elapsed: 0.494 sec
    [junit] 
    [junit] Testsuite: org.apache.cassandra.streaming.StreamingTransferTest
    [junit] Tests run: 2, Failures: 0, Errors: 0, Time elapsed: 1.666 sec
    [junit] 
    [junit] ------------- Standard Error -----------------
    [junit]  WARN 04:13:25,796 Generated random token Token(bytes[d6641b4258dca342309a4e70697c8e38]).
Random tokens will result in an unbalanced ring; see http://wiki.apache.org/cassandra/Operations
    [junit] ------------- ---------------- ---------------
    [junit] Testsuite: org.apache.cassandra.tools.SSTableExportTest
    [junit] Tests run: 4, Failures: 0, Errors: 0, Time elapsed: 1.044 sec
    [junit] 
    [junit] Testsuite: org.apache.cassandra.tools.SSTableImportTest
    [junit] Tests run: 2, Failures: 0, Errors: 0, Time elapsed: 0.696 sec
    [junit] 
    [junit] Testsuite: org.apache.cassandra.utils.BloomFilterTest
    [junit] Tests run: 6, Failures: 0, Errors: 0, Time elapsed: 0.515 sec
    [junit] 
    [junit] Testsuite: org.apache.cassandra.utils.BoundedStatsDequeTest
    [junit] Tests run: 1, Failures: 0, Errors: 0, Time elapsed: 0.052 sec
    [junit] 
    [junit] Testsuite: org.apache.cassandra.utils.EstimatedHistogramTest
    [junit] Tests run: 1, Failures: 0, Errors: 0, Time elapsed: 0.053 sec
    [junit] 
    [junit] Testsuite: org.apache.cassandra.utils.FBUtilitiesTest
    [junit] Tests run: 4, Failures: 0, Errors: 0, Time elapsed: 0.127 sec
    [junit] 
    [junit] Testsuite: org.apache.cassandra.utils.FilterTest
    [junit] Tests run: 1, Failures: 0, Errors: 0, Time elapsed: 0.231 sec
    [junit] 
    [junit] Testsuite: org.apache.cassandra.utils.MerkleTreeTest
    [junit] Tests run: 14, Failures: 0, Errors: 0, Time elapsed: 0.415 sec
    [junit] 

BUILD FAILED
<https://hudson.apache.org/hudson/job/Cassandra-0.7/ws/cassandra/build.xml>:456: The
following error occurred while executing this line:
<https://hudson.apache.org/hudson/job/Cassandra-0.7/ws/cassandra/build.xml>:451: Some
unit test(s) failed.

Total time: 12 minutes 57 seconds
[TASKS] Skipping publisher since build result is FAILURE
Publishing Javadoc
Archiving artifacts
Recording test results


Mime
View raw message