incubator-cassandra-dev mailing list archives

Site index · List index
Message view « Date » · « Thread »
Top « Date » · « Thread »
From Apache Hudson Server <hud...@hudson.apache.org>
Subject Build failed in Hudson: Cassandra-0.7 #9
Date Tue, 16 Nov 2010 16:39:03 GMT
See <https://hudson.apache.org/hudson/job/Cassandra-0.7/9/changes>

Changes:

[jbellis] fix LexicalUUID.getUUID use of ByteBuffer, and inline into UUIDGen.getUUID
patch by jbellis

------------------------------------------
[...truncated 1562 lines...]
    [junit] Cobertura: Saved information on 956 classes.
    [junit] Testsuite: org.apache.cassandra.dht.BootStrapperTest
    [junit] Tests run: 4, Failures: 0, Errors: 0, Time elapsed: 3.339 sec
    [junit] 
    [junit] ------------- Standard Error -----------------
    [junit]  WARN 16:33:25,867 Generated random token Token(bytes[fc2d975a911afba3bb3145b4dbb8908f]).
Random tokens will result in an unbalanced ring; see http://wiki.apache.org/cassandra/Operations
    [junit] ------------- ---------------- ---------------
    [junit] Cobertura: Loaded information on 956 classes.
    [junit] Cobertura: Saved information on 956 classes.
    [junit] Testsuite: org.apache.cassandra.dht.ByteOrderedPartitionerTest
    [junit] Tests run: 5, Failures: 0, Errors: 0, Time elapsed: 13.842 sec
    [junit] 
    [junit] Cobertura: Loaded information on 956 classes.
    [junit] Cobertura: Saved information on 956 classes.
    [junit] Testsuite: org.apache.cassandra.dht.CollatingOrderPreservingPartitionerTest
    [junit] Tests run: 7, Failures: 0, Errors: 0, Time elapsed: 14.869 sec
    [junit] 
    [junit] Cobertura: Loaded information on 956 classes.
    [junit] Cobertura: Saved information on 956 classes.
    [junit] Testsuite: org.apache.cassandra.dht.OrderPreservingPartitionerTest
    [junit] Tests run: 6, Failures: 0, Errors: 0, Time elapsed: 8.038 sec
    [junit] 
    [junit] Cobertura: Loaded information on 956 classes.
    [junit] Cobertura: Saved information on 956 classes.
    [junit] Testsuite: org.apache.cassandra.dht.RandomPartitionerTest
    [junit] Tests run: 5, Failures: 0, Errors: 0, Time elapsed: 3.838 sec
    [junit] 
    [junit] Cobertura: Loaded information on 956 classes.
    [junit] Cobertura: Saved information on 956 classes.
    [junit] Testsuite: org.apache.cassandra.dht.RangeTest
    [junit] Tests run: 12, Failures: 0, Errors: 0, Time elapsed: 0.499 sec
    [junit] 
    [junit] Cobertura: Loaded information on 956 classes.
    [junit] Cobertura: Saved information on 956 classes.
    [junit] Testsuite: org.apache.cassandra.gms.ArrivalWindowTest
    [junit] Tests run: 1, Failures: 0, Errors: 0, Time elapsed: 0.145 sec
    [junit] 
    [junit] Cobertura: Loaded information on 956 classes.
    [junit] Cobertura: Saved information on 956 classes.
    [junit] Testsuite: org.apache.cassandra.gms.GossipDigestTest
    [junit] Tests run: 1, Failures: 0, Errors: 0, Time elapsed: 0.069 sec
    [junit] 
    [junit] Cobertura: Loaded information on 956 classes.
    [junit] Cobertura: Saved information on 956 classes.
    [junit] Testsuite: org.apache.cassandra.hadoop.ColumnFamilyInputFormatTest
    [junit] Tests run: 1, Failures: 0, Errors: 0, Time elapsed: 0.245 sec
    [junit] 
    [junit] Cobertura: Loaded information on 956 classes.
    [junit] Cobertura: Saved information on 956 classes.
    [junit] Testsuite: org.apache.cassandra.io.BloomFilterTrackerTest
    [junit] Tests run: 3, Failures: 0, Errors: 0, Time elapsed: 0.384 sec
    [junit] 
    [junit] Cobertura: Loaded information on 956 classes.
    [junit] Cobertura: Saved information on 956 classes.
    [junit] Testsuite: org.apache.cassandra.io.LazilyCompactedRowTest
    [junit] Tests run: 5, Failures: 0, Errors: 0, Time elapsed: 22.019 sec
    [junit] 
    [junit] Cobertura: Loaded information on 956 classes.
    [junit] Cobertura: Saved information on 956 classes.
    [junit] Testsuite: org.apache.cassandra.io.sstable.LegacySSTableTest
    [junit] Tests run: 1, Failures: 0, Errors: 0, Time elapsed: 3.737 sec
    [junit] 
    [junit] ------------- Standard Error -----------------
    [junit]  WARN 16:35:09,176 Invalid file '.svn' in data directory <https://hudson.apache.org/hudson/job/Cassandra-0.7/ws/cassandra/test/data/legacy-sstables/b/Keyspace1.>
    [junit] ------------- ---------------- ---------------
    [junit] Cobertura: Loaded information on 956 classes.
    [junit] Cobertura: Saved information on 956 classes.
    [junit] Testsuite: org.apache.cassandra.io.sstable.SSTableReaderTest
    [junit] Tests run: 3, Failures: 0, Errors: 0, Time elapsed: 6.042 sec
    [junit] 
    [junit] Cobertura: Loaded information on 956 classes.
    [junit] Cobertura: Saved information on 956 classes.
    [junit] Testsuite: org.apache.cassandra.io.sstable.SSTableTest
    [junit] Tests run: 2, Failures: 0, Errors: 0, Time elapsed: 7.02 sec
    [junit] 
    [junit] Cobertura: Loaded information on 956 classes.
    [junit] Cobertura: Saved information on 956 classes.
    [junit] Testsuite: org.apache.cassandra.io.sstable.SSTableWriterTest
    [junit] Tests run: 1, Failures: 0, Errors: 0, Time elapsed: 1.159 sec
    [junit] 
    [junit] Cobertura: Loaded information on 956 classes.
    [junit] Cobertura: Saved information on 956 classes.
    [junit] Testsuite: org.apache.cassandra.io.util.BufferedRandomAccessFileTest
    [junit] Tests run: 4, Failures: 0, Errors: 0, Time elapsed: 0.816 sec
    [junit] 
    [junit] Cobertura: Loaded information on 956 classes.
    [junit] Cobertura: Saved information on 956 classes.
    [junit] Testsuite: org.apache.cassandra.locator.DynamicEndpointSnitchTest
    [junit] Tests run: 1, Failures: 0, Errors: 0, Time elapsed: 1.221 sec
    [junit] 
    [junit] Cobertura: Loaded information on 956 classes.
    [junit] Cobertura: Saved information on 956 classes.
    [junit] Testsuite: org.apache.cassandra.locator.NetworkTopologyStrategyTest
    [junit] Tests run: 1, Failures: 0, Errors: 0, Time elapsed: 0.489 sec
    [junit] 
    [junit] Cobertura: Loaded information on 956 classes.
    [junit] Cobertura: Saved information on 956 classes.
    [junit] Testsuite: org.apache.cassandra.locator.OldNetworkTopologyStrategyTest
    [junit] Tests run: 3, Failures: 0, Errors: 0, Time elapsed: 0.429 sec
    [junit] 
    [junit] Cobertura: Loaded information on 956 classes.
    [junit] Cobertura: Saved information on 956 classes.
    [junit] Testsuite: org.apache.cassandra.locator.ReplicationStrategyEndpointCacheTest
    [junit] Tests run: 2, Failures: 0, Errors: 0, Time elapsed: 1.128 sec
    [junit] 
    [junit] Cobertura: Loaded information on 956 classes.
    [junit] Cobertura: Saved information on 956 classes.
    [junit] Testsuite: org.apache.cassandra.locator.SimpleStrategyTest
    [junit] Tests run: 4, Failures: 0, Errors: 0, Time elapsed: 0.806 sec
    [junit] 
    [junit] Cobertura: Loaded information on 956 classes.
    [junit] Cobertura: Saved information on 956 classes.
    [junit] Testsuite: org.apache.cassandra.locator.TokenMetadataTest
    [junit] Tests run: 2, Failures: 0, Errors: 0, Time elapsed: 0.491 sec
    [junit] 
    [junit] Cobertura: Loaded information on 956 classes.
    [junit] Cobertura: Saved information on 956 classes.
    [junit] Testsuite: org.apache.cassandra.service.AntiEntropyServiceTest
    [junit] Exception in thread "Thread-5" java.lang.RuntimeException: java.lang.NullPointerException
    [junit] 	at org.apache.cassandra.utils.WrappedRunnable.run(WrappedRunnable.java:34)
    [junit] 	at org.apache.cassandra.streaming.StreamInSession.closeIfFinished(StreamInSession.java:162)
    [junit] 	at org.apache.cassandra.streaming.IncomingStreamReader.read(IncomingStreamReader.java:66)
    [junit] 	at org.apache.cassandra.net.IncomingTcpConnection.run(IncomingTcpConnection.java:75)
    [junit] Caused by: java.lang.NullPointerException
    [junit] 	at org.apache.cassandra.service.AntiEntropyService.completedRequest(AntiEntropyService.java:133)
    [junit] 	at org.apache.cassandra.service.AntiEntropyService$Differencer$Callback.runMayThrow(AntiEntropyService.java:558)
    [junit] 	at org.apache.cassandra.utils.WrappedRunnable.run(WrappedRunnable.java:30)
    [junit] 	... 3 more
    [junit] Tests run: 7, Failures: 0, Errors: 0, Time elapsed: 4.541 sec
    [junit] 
    [junit] ------------- Standard Error -----------------
    [junit]  WARN 16:36:09,231 Generated random token Token(bytes[570d33bab8b1d8b79ae9fe34179d1825]).
Random tokens will result in an unbalanced ring; see http://wiki.apache.org/cassandra/Operations
    [junit] ------------- ---------------- ---------------
    [junit] Cobertura: Loaded information on 956 classes.
    [junit] Cobertura: Saved information on 956 classes.
    [junit] Testsuite: org.apache.cassandra.service.CassandraServerTest
    [junit] Tests run: 1, Failures: 0, Errors: 0, Time elapsed: 0.373 sec
    [junit] 
    [junit] Cobertura: Loaded information on 956 classes.
    [junit] Cobertura: Saved information on 956 classes.
    [junit] Testsuite: org.apache.cassandra.service.EmbeddedCassandraServiceTest
    [junit] Tests run: 1, Failures: 0, Errors: 0, Time elapsed: 2.115 sec
    [junit] 
    [junit] ------------- Standard Error -----------------
    [junit]  WARN 16:36:20,893 Unable to lock JVM memory (ENOMEM). This can result in part
of the JVM being swapped out, especially with mmapped I/O enabled. Increase RLIMIT_MEMLOCK
or run Cassandra as root.
    [junit]  WARN 16:36:22,108 Generated random token Token(bytes[b26dc5263f31bb1215e737cceb3bffc2]).
Random tokens will result in an unbalanced ring; see http://wiki.apache.org/cassandra/Operations
    [junit] ------------- ---------------- ---------------
    [junit] Cobertura: Loaded information on 956 classes.
    [junit] Cobertura: Saved information on 956 classes.
    [junit] Testsuite: org.apache.cassandra.service.MoveTest
    [junit] Tests run: 6, Failures: 0, Errors: 0, Time elapsed: 4.255 sec
    [junit] 
    [junit] ------------- Standard Error -----------------
    [junit]  WARN 16:36:29,815 Node /127.0.0.3 'leaving' token mismatch. Long network partition?
    [junit] ------------- ---------------- ---------------
    [junit] Cobertura: Loaded information on 956 classes.
    [junit] Cobertura: Saved information on 956 classes.
    [junit] Testsuite: org.apache.cassandra.service.ReadResponseResolverTest
    [junit] Tests run: 5, Failures: 0, Errors: 0, Time elapsed: 0.516 sec
    [junit] 
    [junit] Cobertura: Loaded information on 956 classes.
    [junit] Cobertura: Saved information on 956 classes.
    [junit] Testsuite: org.apache.cassandra.service.RemoveTest
    [junit] Tests run: 5, Failures: 0, Errors: 0, Time elapsed: 4.031 sec
    [junit] 
    [junit] Cobertura: Loaded information on 956 classes.
    [junit] Cobertura: Saved information on 956 classes.
    [junit] Testsuite: org.apache.cassandra.service.StorageProxyTest
    [junit] Tests run: 4, Failures: 0, Errors: 0, Time elapsed: 0.504 sec
    [junit] 
    [junit] Cobertura: Loaded information on 956 classes.
    [junit] Cobertura: Saved information on 956 classes.
    [junit] Testsuite: org.apache.cassandra.service.StorageServiceClientTest
    [junit] Tests run: 1, Failures: 0, Errors: 0, Time elapsed: 5.528 sec
    [junit] 
    [junit] Cobertura: Loaded information on 956 classes.
    [junit] Cobertura: Saved information on 956 classes.
    [junit] Testsuite: org.apache.cassandra.service.StorageServiceServerTest
    [junit] Tests run: 3, Failures: 0, Errors: 0, Time elapsed: 1.545 sec
    [junit] 
    [junit] ------------- Standard Error -----------------
    [junit]  WARN 16:36:59,240 Generated random token Token(bytes[b66d8ef75e8d3f63abf00bb64c1052c6]).
Random tokens will result in an unbalanced ring; see http://wiki.apache.org/cassandra/Operations
    [junit] ------------- ---------------- ---------------
    [junit] Cobertura: Loaded information on 956 classes.
    [junit] Cobertura: Saved information on 956 classes.
    [junit] Testsuite: org.apache.cassandra.streaming.BootstrapTest
    [junit] Tests run: 1, Failures: 0, Errors: 0, Time elapsed: 1.167 sec
    [junit] 
    [junit] Cobertura: Loaded information on 956 classes.
    [junit] Cobertura: Saved information on 956 classes.
    [junit] Testsuite: org.apache.cassandra.streaming.StreamingTransferTest
    [junit] Tests run: 2, Failures: 0, Errors: 0, Time elapsed: 2.277 sec
    [junit] 
    [junit] ------------- Standard Error -----------------
    [junit]  WARN 16:37:08,626 Generated random token Token(bytes[625e1a6ddee321716fbacf95cb6dcfdb]).
Random tokens will result in an unbalanced ring; see http://wiki.apache.org/cassandra/Operations
    [junit] ------------- ---------------- ---------------
    [junit] Cobertura: Loaded information on 956 classes.
    [junit] Cobertura: Saved information on 956 classes.
    [junit] Testsuite: org.apache.cassandra.tools.SSTableExportTest
    [junit] Tests run: 4, Failures: 0, Errors: 0, Time elapsed: 1.268 sec
    [junit] 
    [junit] Cobertura: Loaded information on 956 classes.
    [junit] Cobertura: Saved information on 956 classes.
    [junit] Testsuite: org.apache.cassandra.tools.SSTableImportTest
    [junit] Tests run: 2, Failures: 0, Errors: 0, Time elapsed: 0.907 sec
    [junit] 
    [junit] Cobertura: Loaded information on 956 classes.
    [junit] Cobertura: Saved information on 956 classes.
    [junit] Testsuite: org.apache.cassandra.utils.BloomFilterTest
    [junit] Tests run: 6, Failures: 0, Errors: 0, Time elapsed: 6.299 sec
    [junit] 
    [junit] Cobertura: Loaded information on 956 classes.
    [junit] Cobertura: Saved information on 956 classes.
    [junit] Testsuite: org.apache.cassandra.utils.BoundedStatsDequeTest
    [junit] Tests run: 1, Failures: 0, Errors: 0, Time elapsed: 0.073 sec
    [junit] 
    [junit] Cobertura: Loaded information on 956 classes.
    [junit] Cobertura: Saved information on 956 classes.
    [junit] Testsuite: org.apache.cassandra.utils.EstimatedHistogramTest
    [junit] Tests run: 1, Failures: 0, Errors: 0, Time elapsed: 0.083 sec
    [junit] 
    [junit] Cobertura: Loaded information on 956 classes.
    [junit] Cobertura: Saved information on 956 classes.
    [junit] Testsuite: org.apache.cassandra.utils.FBUtilitiesTest
    [junit] Tests run: 4, Failures: 0, Errors: 0, Time elapsed: 0.18 sec
    [junit] 
    [junit] Cobertura: Loaded information on 956 classes.
    [junit] Cobertura: Saved information on 956 classes.
    [junit] Testsuite: org.apache.cassandra.utils.FilterTest
    [junit] Tests run: 1, Failures: 0, Errors: 0, Time elapsed: 2.072 sec
    [junit] 
    [junit] Cobertura: Loaded information on 956 classes.
    [junit] Cobertura: Saved information on 956 classes.
    [junit] Testsuite: org.apache.cassandra.utils.MerkleTreeTest
    [junit] Tests run: 14, Failures: 0, Errors: 0, Time elapsed: 0.596 sec
    [junit] 
    [junit] Cobertura: Loaded information on 956 classes.
    [junit] Cobertura: Saved information on 956 classes.

BUILD FAILED
<https://hudson.apache.org/hudson/job/Cassandra-0.7/ws/cassandra/build.xml>:456: The
following error occurred while executing this line:
<https://hudson.apache.org/hudson/job/Cassandra-0.7/ws/cassandra/build.xml>:451: Some
unit test(s) failed.

Total time: 17 minutes 32 seconds
[TASKS] Skipping publisher since build result is FAILURE
Publishing Javadoc
Archiving artifacts
Recording test results
Skipping Cobertura coverage report as build was not UNSTABLE or better ...


Mime
View raw message