incubator-cassandra-dev mailing list archives

Site index · List index
Message view « Date » · « Thread »
Top « Date » · « Thread »
From Apache Hudson Server <hud...@hudson.apache.org>
Subject Build failed in Hudson: Cassandra-0.7 #5
Date Mon, 15 Nov 2010 20:37:11 GMT
See <https://hudson.apache.org/hudson/job/Cassandra-0.7/5/>

------------------------------------------
[...truncated 1187 lines...]
    [junit] Cobertura: Loaded information on 956 classes.
    [junit] Cobertura: Saved information on 956 classes.
    [junit] Testsuite: org.apache.cassandra.io.util.BufferedRandomAccessFileTest
    [junit] Tests run: 4, Failures: 0, Errors: 0, Time elapsed: 0.107 sec
    [junit] 
    [junit] Cobertura: Loaded information on 956 classes.
    [junit] Cobertura: Saved information on 956 classes.
    [junit] Testsuite: org.apache.cassandra.locator.DynamicEndpointSnitchTest
    [junit] Tests run: 1, Failures: 0, Errors: 0, Time elapsed: 1.223 sec
    [junit] 
    [junit] Cobertura: Loaded information on 956 classes.
    [junit] Cobertura: Saved information on 956 classes.
    [junit] Testsuite: org.apache.cassandra.locator.NetworkTopologyStrategyTest
    [junit] Tests run: 1, Failures: 0, Errors: 0, Time elapsed: 0.488 sec
    [junit] 
    [junit] Cobertura: Loaded information on 956 classes.
    [junit] Cobertura: Saved information on 956 classes.
    [junit] Testsuite: org.apache.cassandra.locator.OldNetworkTopologyStrategyTest
    [junit] Tests run: 3, Failures: 0, Errors: 0, Time elapsed: 0.422 sec
    [junit] 
    [junit] Cobertura: Loaded information on 956 classes.
    [junit] Cobertura: Saved information on 956 classes.
    [junit] Testsuite: org.apache.cassandra.locator.ReplicationStrategyEndpointCacheTest
    [junit] Tests run: 2, Failures: 0, Errors: 0, Time elapsed: 0.739 sec
    [junit] 
    [junit] Cobertura: Loaded information on 956 classes.
    [junit] Cobertura: Saved information on 956 classes.
    [junit] Testsuite: org.apache.cassandra.locator.SimpleStrategyTest
    [junit] Tests run: 4, Failures: 0, Errors: 0, Time elapsed: 0.77 sec
    [junit] 
    [junit] Cobertura: Loaded information on 956 classes.
    [junit] Cobertura: Saved information on 956 classes.
    [junit] Testsuite: org.apache.cassandra.locator.TokenMetadataTest
    [junit] Tests run: 2, Failures: 0, Errors: 0, Time elapsed: 0.498 sec
    [junit] 
    [junit] Cobertura: Loaded information on 956 classes.
    [junit] Cobertura: Saved information on 956 classes.
    [junit] Testsuite: org.apache.cassandra.service.AntiEntropyServiceTest
    [junit] Exception in thread "Thread-5" java.lang.RuntimeException: java.lang.NullPointerException
    [junit] 	at org.apache.cassandra.utils.WrappedRunnable.run(WrappedRunnable.java:34)
    [junit] 	at org.apache.cassandra.streaming.StreamInSession.closeIfFinished(StreamInSession.java:162)
    [junit] 	at org.apache.cassandra.streaming.IncomingStreamReader.read(IncomingStreamReader.java:66)
    [junit] 	at org.apache.cassandra.net.IncomingTcpConnection.run(IncomingTcpConnection.java:75)
    [junit] Caused by: java.lang.NullPointerException
    [junit] 	at org.apache.cassandra.service.AntiEntropyService.completedRequest(AntiEntropyService.java:133)
    [junit] 	at org.apache.cassandra.service.AntiEntropyService$Differencer$Callback.runMayThrow(AntiEntropyService.java:558)
    [junit] 	at org.apache.cassandra.utils.WrappedRunnable.run(WrappedRunnable.java:30)
    [junit] 	... 3 more
    [junit] Tests run: 7, Failures: 0, Errors: 0, Time elapsed: 4.235 sec
    [junit] 
    [junit] ------------- Standard Error -----------------
    [junit]  WARN 20:25:24,848 Generated random token Token(bytes[6905d67dc4ba42f72c87269d9ecca449]).
Random tokens will result in an unbalanced ring; see http://wiki.apache.org/cassandra/Operations
    [junit] ------------- ---------------- ---------------
    [junit] Cobertura: Loaded information on 956 classes.
    [junit] Cobertura: Saved information on 956 classes.
    [junit] Testsuite: org.apache.cassandra.service.CassandraServerTest
    [junit] Tests run: 1, Failures: 0, Errors: 0, Time elapsed: 0.36 sec
    [junit] 
    [junit] Cobertura: Loaded information on 956 classes.
    [junit] Cobertura: Saved information on 956 classes.
    [junit] Testsuite: org.apache.cassandra.service.EmbeddedCassandraServiceTest
    [junit] Tests run: 1, Failures: 0, Errors: 0, Time elapsed: 1.174 sec
    [junit] 
    [junit] ------------- Standard Error -----------------
    [junit]  WARN 20:25:35,974 Unable to lock JVM memory (ENOMEM). This can result in part
of the JVM being swapped out, especially with mmapped I/O enabled. Increase RLIMIT_MEMLOCK
or run Cassandra as root.
    [junit]  WARN 20:25:36,470 Generated random token Token(bytes[06a824e4b793741c94e22b4dfba202c9]).
Random tokens will result in an unbalanced ring; see http://wiki.apache.org/cassandra/Operations
    [junit] ------------- ---------------- ---------------
    [junit] Cobertura: Loaded information on 956 classes.
    [junit] Cobertura: Saved information on 956 classes.
    [junit] Testsuite: org.apache.cassandra.service.MoveTest
    [junit] Tests run: 6, Failures: 0, Errors: 0, Time elapsed: 1.646 sec
    [junit] 
    [junit] ------------- Standard Error -----------------
    [junit]  WARN 20:25:41,790 Node /127.0.0.3 'leaving' token mismatch. Long network partition?
    [junit] ------------- ---------------- ---------------
    [junit] Cobertura: Loaded information on 956 classes.
    [junit] Cobertura: Saved information on 956 classes.
    [junit] Testsuite: org.apache.cassandra.service.ReadResponseResolverTest
    [junit] Tests run: 5, Failures: 0, Errors: 0, Time elapsed: 0.51 sec
    [junit] 
    [junit] Cobertura: Loaded information on 956 classes.
    [junit] Cobertura: Saved information on 956 classes.
    [junit] Testsuite: org.apache.cassandra.service.RemoveTest
    [junit] Tests run: 5, Failures: 0, Errors: 0, Time elapsed: 2.086 sec
    [junit] 
    [junit] Cobertura: Loaded information on 956 classes.
    [junit] Cobertura: Saved information on 956 classes.
    [junit] Testsuite: org.apache.cassandra.service.StorageProxyTest
    [junit] Tests run: 4, Failures: 0, Errors: 0, Time elapsed: 0.496 sec
    [junit] 
    [junit] Cobertura: Loaded information on 956 classes.
    [junit] Cobertura: Saved information on 956 classes.
    [junit] Testsuite: org.apache.cassandra.service.StorageServiceClientTest
    [junit] Tests run: 1, Failures: 0, Errors: 0, Time elapsed: 5.513 sec
    [junit] 
    [junit] Cobertura: Loaded information on 956 classes.
    [junit] Cobertura: Saved information on 956 classes.
    [junit] Testsuite: org.apache.cassandra.service.StorageServiceServerTest
    [junit] Tests run: 3, Failures: 0, Errors: 0, Time elapsed: 0.863 sec
    [junit] 
    [junit] ------------- Standard Error -----------------
    [junit]  WARN 20:26:07,814 Generated random token Token(bytes[29b579561411e5daaa9f12e19fb9bb6c]).
Random tokens will result in an unbalanced ring; see http://wiki.apache.org/cassandra/Operations
    [junit] ------------- ---------------- ---------------
    [junit] Cobertura: Loaded information on 956 classes.
    [junit] Cobertura: Saved information on 956 classes.
    [junit] Testsuite: org.apache.cassandra.streaming.BootstrapTest
    [junit] Tests run: 1, Failures: 0, Errors: 0, Time elapsed: 0.77 sec
    [junit] 
    [junit] Cobertura: Loaded information on 956 classes.
    [junit] Cobertura: Saved information on 956 classes.
    [junit] Testsuite: org.apache.cassandra.streaming.StreamingTransferTest
    [junit] Tests run: 2, Failures: 0, Errors: 0, Time elapsed: 0.805 sec
    [junit] 
    [junit] ------------- Standard Error -----------------
    [junit]  WARN 20:26:15,895 Generated random token Token(bytes[32f4134d8a01c3fa4532bac4e677667f]).
Random tokens will result in an unbalanced ring; see http://wiki.apache.org/cassandra/Operations
    [junit] ------------- ---------------- ---------------
    [junit] Cobertura: Loaded information on 956 classes.
    [junit] Cobertura: Saved information on 956 classes.
    [junit] Testsuite: org.apache.cassandra.tools.SSTableExportTest
    [junit] Tests run: 4, Failures: 0, Errors: 0, Time elapsed: 0.766 sec
    [junit] 
    [junit] Cobertura: Loaded information on 956 classes.
    [junit] Cobertura: Saved information on 956 classes.
    [junit] Testsuite: org.apache.cassandra.tools.SSTableImportTest
    [junit] Tests run: 2, Failures: 0, Errors: 0, Time elapsed: 0.678 sec
    [junit] 
    [junit] Cobertura: Loaded information on 956 classes.
    [junit] Cobertura: Saved information on 956 classes.
    [junit] Testsuite: org.apache.cassandra.utils.BloomFilterTest
    [junit] Tests run: 6, Failures: 0, Errors: 0, Time elapsed: 3.424 sec
    [junit] 
    [junit] Cobertura: Loaded information on 956 classes.
    [junit] Cobertura: Saved information on 956 classes.
    [junit] Testsuite: org.apache.cassandra.utils.BoundedStatsDequeTest
    [junit] Tests run: 1, Failures: 0, Errors: 0, Time elapsed: 0.068 sec
    [junit] 
    [junit] Cobertura: Loaded information on 956 classes.
    [junit] Cobertura: Saved information on 956 classes.
    [junit] Testsuite: org.apache.cassandra.utils.EstimatedHistogramTest
    [junit] Tests run: 1, Failures: 0, Errors: 0, Time elapsed: 0.084 sec
    [junit] 
    [junit] Cobertura: Loaded information on 956 classes.
    [junit] Cobertura: Saved information on 956 classes.
    [junit] Testsuite: org.apache.cassandra.utils.FBUtilitiesTest
    [junit] Tests run: 4, Failures: 0, Errors: 0, Time elapsed: 0.173 sec
    [junit] 
    [junit] Cobertura: Loaded information on 956 classes.
    [junit] Cobertura: Saved information on 956 classes.
    [junit] Testsuite: org.apache.cassandra.utils.FilterTest
    [junit] Tests run: 1, Failures: 0, Errors: 0, Time elapsed: 2.043 sec
    [junit] 
    [junit] Cobertura: Loaded information on 956 classes.
    [junit] Cobertura: Saved information on 956 classes.
    [junit] Testsuite: org.apache.cassandra.utils.MerkleTreeTest
    [junit] Tests run: 14, Failures: 0, Errors: 0, Time elapsed: 0.597 sec
    [junit] 
    [junit] Cobertura: Loaded information on 956 classes.
    [junit] Cobertura: Saved information on 956 classes.

cobertura-report:
[cobertura-report] Cobertura 1.9.3 - GNU GPL License (NO WARRANTY) - See COPYRIGHT file
[cobertura-report] Cobertura: Loaded information on 956 classes.
[cobertura-report] Report time: 4457ms
[cobertura-report] Cobertura 1.9.3 - GNU GPL License (NO WARRANTY) - See COPYRIGHT file
[cobertura-report] Cobertura: Loaded information on 956 classes.
[cobertura-report] Report time: 5568ms

codecoverage:

ivy-download:
     [echo] Downloading Ivy...
      [get] Getting: http://repo2.maven.org/maven2/org/apache/ivy/ivy/2.1.0/ivy-2.1.0.jar
      [get] To: <https://hudson.apache.org/hudson/job/Cassandra-0.7/ws/cassandra-0.7/build/ivy-2.1.0.jar>
      [get] Not modified - so not downloaded

ivy-init:

ivy-retrieve-build:
[ivy:retrieve] :: retrieving :: apache-cassandra#cassandra [sync]
[ivy:retrieve] 	confs: [default]
[ivy:retrieve] 	0 artifacts copied, 49 already retrieved (0kB/19ms)

init:

check-avro-generate:
Trying to override old definition of task avro-protocol

avro-interface-generate-client:

avro-interface-generate-internode:

avro-generate:

build-subprojects:

check-gen-cli-grammar:

gen-cli-grammar:

build-project:
     [echo] apache-cassandra: <https://hudson.apache.org/hudson/job/Cassandra-0.7/ws/cassandra-0.7/build.xml>
    [javac] <https://hudson.apache.org/hudson/job/Cassandra-0.7/ws/cassandra-0.7/build.xml>:274:
warning: 'includeantruntime' was not set, defaulting to build.sysclasspath=last; set to false
for repeatable builds
    [javac] Compiling 1 source file to <https://hudson.apache.org/hudson/job/Cassandra-0.7/ws/cassandra-0.7/build/classes>
Trying to override old definition of task paranamer

createVersionPropFile:
[propertyfile] Updating property file: <https://hudson.apache.org/hudson/job/Cassandra-0.7/ws/cassandra-0.7/build/classes/org/apache/cassandra/config/version.properties>

build:

build-test:
    [javac] <https://hudson.apache.org/hudson/job/Cassandra-0.7/ws/cassandra-0.7/build.xml>:412:
warning: 'includeantruntime' was not set, defaulting to build.sysclasspath=last; set to false
for repeatable builds

long-test:
     [echo] running long tests
    [junit] WARNING: multiple versions of ant detected in path for junit 
    [junit]          jar:file:/home/hudson/tools/ant/latest/lib/ant.jar!/org/apache/tools/ant/Project.class
    [junit]      and jar:<https://hudson.apache.org/hudson/job/Cassandra-0.7/ws/cassandra-0.7/build/lib/jars/ant-1.6.5.jar!/org/apache/tools/ant/Project.class>
    [junit] Testsuite: org.apache.cassandra.db.LongCompactionSpeedTest
    [junit] Testsuite: org.apache.cassandra.db.LongCompactionSpeedTest
    [junit] Tests run: 1, Failures: 0, Errors: 1, Time elapsed: 0 sec
    [junit] 
    [junit] Testcase: org.apache.cassandra.db.LongCompactionSpeedTest:testCompactionSlim:
Caused an ERROR
    [junit] Timeout occurred. Please note the time in the report does not reflect the time
until the timeout.
    [junit] junit.framework.AssertionFailedError: Timeout occurred. Please note the time in
the report does not reflect the time until the timeout.
    [junit] 
    [junit] 
    [junit] Test org.apache.cassandra.db.LongCompactionSpeedTest FAILED (timeout)
    [junit] Testsuite: org.apache.cassandra.utils.LongBloomFilterTest
    [junit] Testsuite: org.apache.cassandra.utils.LongBloomFilterTest
    [junit] Tests run: 1, Failures: 0, Errors: 1, Time elapsed: 0 sec
    [junit] 
    [junit] Testcase: org.apache.cassandra.utils.LongBloomFilterTest:testBigInt:	Caused an
ERROR
    [junit] Timeout occurred. Please note the time in the report does not reflect the time
until the timeout.
    [junit] junit.framework.AssertionFailedError: Timeout occurred. Please note the time in
the report does not reflect the time until the timeout.
    [junit] 
    [junit] 
    [junit] Test org.apache.cassandra.utils.LongBloomFilterTest FAILED (timeout)

BUILD FAILED
<https://hudson.apache.org/hudson/job/Cassandra-0.7/ws/cassandra-0.7/build.xml>:460:
The following error occurred while executing this line:
<https://hudson.apache.org/hudson/job/Cassandra-0.7/ws/cassandra-0.7/build.xml>:451:
Some long test(s) failed.

Total time: 17 minutes 6 seconds
[TASKS] Skipping publisher since build result is FAILURE
Publishing Javadoc
Archiving artifacts
Recording test results
Skipping Cobertura coverage report as build was not UNSTABLE or better ...


Mime
View raw message