incubator-cassandra-dev mailing list archives

Site index · List index
Message view « Date » · « Thread »
Top « Date » · « Thread »
From Apache Hudson Server <hud...@hudson.apache.org>
Subject Build failed in Hudson: Cassandra-0.7 #11
Date Wed, 17 Nov 2010 20:24:38 GMT
See <https://hudson.apache.org/hudson/job/Cassandra-0.7/11/changes>

Changes:

[jbellis] merge from 0.6

------------------------------------------
[...truncated 1593 lines...]
    [junit] Testsuite: org.apache.cassandra.dht.CollatingOrderPreservingPartitionerTest
    [junit] Tests run: 7, Failures: 0, Errors: 0, Time elapsed: 15.174 sec
    [junit] 
    [junit] Cobertura: Loaded information on 956 classes.
    [junit] Cobertura: Saved information on 956 classes.
    [junit] Testsuite: org.apache.cassandra.dht.OrderPreservingPartitionerTest
    [junit] Tests run: 6, Failures: 0, Errors: 0, Time elapsed: 8.091 sec
    [junit] 
    [junit] Cobertura: Loaded information on 956 classes.
    [junit] Cobertura: Saved information on 956 classes.
    [junit] Testsuite: org.apache.cassandra.dht.RandomPartitionerTest
    [junit] Tests run: 5, Failures: 0, Errors: 0, Time elapsed: 4.086 sec
    [junit] 
    [junit] Cobertura: Loaded information on 956 classes.
    [junit] Cobertura: Saved information on 956 classes.
    [junit] Testsuite: org.apache.cassandra.dht.RangeTest
    [junit] Tests run: 12, Failures: 0, Errors: 0, Time elapsed: 0.498 sec
    [junit] 
    [junit] Cobertura: Loaded information on 956 classes.
    [junit] Cobertura: Saved information on 956 classes.
    [junit] Testsuite: org.apache.cassandra.gms.ArrivalWindowTest
    [junit] Tests run: 1, Failures: 0, Errors: 0, Time elapsed: 0.135 sec
    [junit] 
    [junit] Cobertura: Loaded information on 956 classes.
    [junit] Cobertura: Saved information on 956 classes.
    [junit] Testsuite: org.apache.cassandra.gms.GossipDigestTest
    [junit] Tests run: 1, Failures: 0, Errors: 0, Time elapsed: 0.071 sec
    [junit] 
    [junit] Cobertura: Loaded information on 956 classes.
    [junit] Cobertura: Saved information on 956 classes.
    [junit] Testsuite: org.apache.cassandra.hadoop.ColumnFamilyInputFormatTest
    [junit] Tests run: 1, Failures: 0, Errors: 0, Time elapsed: 0.216 sec
    [junit] 
    [junit] Cobertura: Loaded information on 956 classes.
    [junit] Cobertura: Saved information on 956 classes.
    [junit] Testsuite: org.apache.cassandra.io.BloomFilterTrackerTest
    [junit] Tests run: 3, Failures: 0, Errors: 0, Time elapsed: 0.376 sec
    [junit] 
    [junit] Cobertura: Loaded information on 956 classes.
    [junit] Cobertura: Saved information on 956 classes.
    [junit] Testsuite: org.apache.cassandra.io.LazilyCompactedRowTest
    [junit] Tests run: 5, Failures: 0, Errors: 0, Time elapsed: 20.461 sec
    [junit] 
    [junit] Cobertura: Loaded information on 956 classes.
    [junit] Cobertura: Saved information on 956 classes.
    [junit] Testsuite: org.apache.cassandra.io.sstable.LegacySSTableTest
    [junit] Tests run: 1, Failures: 0, Errors: 0, Time elapsed: 3.718 sec
    [junit] 
    [junit] ------------- Standard Error -----------------
    [junit]  WARN 20:20:45,499 Invalid file '.svn' in data directory <https://hudson.apache.org/hudson/job/Cassandra-0.7/ws/cassandra/test/data/legacy-sstables/b/Keyspace1.>
    [junit] ------------- ---------------- ---------------
    [junit] Cobertura: Loaded information on 956 classes.
    [junit] Cobertura: Saved information on 956 classes.
    [junit] Testsuite: org.apache.cassandra.io.sstable.SSTableReaderTest
    [junit] Tests run: 3, Failures: 0, Errors: 0, Time elapsed: 5.927 sec
    [junit] 
    [junit] Cobertura: Loaded information on 956 classes.
    [junit] Cobertura: Saved information on 956 classes.
    [junit] Testsuite: org.apache.cassandra.io.sstable.SSTableTest
    [junit] Tests run: 2, Failures: 0, Errors: 0, Time elapsed: 7.196 sec
    [junit] 
    [junit] Cobertura: Loaded information on 956 classes.
    [junit] Cobertura: Saved information on 956 classes.
    [junit] Testsuite: org.apache.cassandra.io.sstable.SSTableWriterTest
    [junit] Tests run: 1, Failures: 0, Errors: 0, Time elapsed: 1.329 sec
    [junit] 
    [junit] Cobertura: Loaded information on 956 classes.
    [junit] Cobertura: Saved information on 956 classes.
    [junit] Testsuite: org.apache.cassandra.io.util.BufferedRandomAccessFileTest
    [junit] Tests run: 4, Failures: 0, Errors: 0, Time elapsed: 0.729 sec
    [junit] 
    [junit] Cobertura: Loaded information on 956 classes.
    [junit] Cobertura: Saved information on 956 classes.
    [junit] Testsuite: org.apache.cassandra.locator.DynamicEndpointSnitchTest
    [junit] Tests run: 1, Failures: 0, Errors: 0, Time elapsed: 1.222 sec
    [junit] 
    [junit] Cobertura: Loaded information on 956 classes.
    [junit] Cobertura: Saved information on 956 classes.
    [junit] Testsuite: org.apache.cassandra.locator.NetworkTopologyStrategyTest
    [junit] Tests run: 1, Failures: 0, Errors: 0, Time elapsed: 0.516 sec
    [junit] 
    [junit] Cobertura: Loaded information on 956 classes.
    [junit] Cobertura: Saved information on 956 classes.
    [junit] Testsuite: org.apache.cassandra.locator.OldNetworkTopologyStrategyTest
    [junit] Tests run: 3, Failures: 0, Errors: 0, Time elapsed: 0.428 sec
    [junit] 
    [junit] Cobertura: Loaded information on 956 classes.
    [junit] Cobertura: Saved information on 956 classes.
    [junit] Testsuite: org.apache.cassandra.locator.ReplicationStrategyEndpointCacheTest
    [junit] Tests run: 2, Failures: 0, Errors: 0, Time elapsed: 1.155 sec
    [junit] 
    [junit] Cobertura: Loaded information on 956 classes.
    [junit] Cobertura: Saved information on 956 classes.
    [junit] Testsuite: org.apache.cassandra.locator.SimpleStrategyTest
    [junit] Tests run: 4, Failures: 0, Errors: 0, Time elapsed: 0.802 sec
    [junit] 
    [junit] Cobertura: Loaded information on 956 classes.
    [junit] Cobertura: Saved information on 956 classes.
    [junit] Testsuite: org.apache.cassandra.locator.TokenMetadataTest
    [junit] Tests run: 2, Failures: 0, Errors: 0, Time elapsed: 0.518 sec
    [junit] 
    [junit] Cobertura: Loaded information on 956 classes.
    [junit] Cobertura: Saved information on 956 classes.
    [junit] Testsuite: org.apache.cassandra.service.AntiEntropyServiceTest
    [junit] Exception in thread "Thread-5" java.lang.RuntimeException: java.lang.NullPointerException
    [junit] 	at org.apache.cassandra.utils.WrappedRunnable.run(WrappedRunnable.java:34)
    [junit] 	at org.apache.cassandra.streaming.StreamInSession.closeIfFinished(StreamInSession.java:162)
    [junit] 	at org.apache.cassandra.streaming.IncomingStreamReader.read(IncomingStreamReader.java:66)
    [junit] Tests run: 7, Failures: 0, Errors: 0, Time elapsed: 4.906 sec
    [junit] 	at org.apache.cassandra.net.IncomingTcpConnection.run(IncomingTcpConnection.java:75)
    [junit] 
    [junit] Caused by: java.lang.NullPointerException
    [junit] ------------- Standard Error -----------------
    [junit] 	at org.apache.cassandra.service.AntiEntropyService.completedRequest(AntiEntropyService.java:133)
    [junit]  WARN 20:21:46,381 Generated random token Token(bytes[15771ccf03cba38400af43840fd4902f]).
Random tokens will result in an unbalanced ring; see http://wiki.apache.org/cassandra/Operations
    [junit] 	at org.apache.cassandra.service.AntiEntropyService$Differencer$Callback.runMayThrow(AntiEntropyService.java:537)
    [junit] Exception in thread "AntientropyStage:1" java.lang.AssertionError
    [junit] 	at org.apache.cassandra.utils.WrappedRunnable.run(WrappedRunnable.java:30)
    [junit] 	at org.apache.cassandra.locator.TokenMetadata.firstTokenIndex(TokenMetadata.java:392)
    [junit] 	... 3 more
    [junit] 	at org.apache.cassandra.locator.TokenMetadata.firstToken(TokenMetadata.java:406)
    [junit] 	at org.apache.cassandra.locator.AbstractReplicationStrategy.getNaturalEndpoints(AbstractReplicationStrategy.java:98)
    [junit] 	at org.apache.cassandra.service.StorageService.constructRangeToEndpointMap(StorageService.java:566)
    [junit] 	at org.apache.cassandra.service.StorageService.getRangeToAddressMap(StorageService.java:541)
    [junit] 	at org.apache.cassandra.service.AntiEntropyService.getNeighbors(AntiEntropyService.java:158)
    [junit] 	at org.apache.cassandra.service.AntiEntropyService.rendezvous(AntiEntropyService.java:182)
    [junit] 	at org.apache.cassandra.service.AntiEntropyService.access$100(AntiEntropyService.java:86)
    [junit] 	at org.apache.cassandra.service.AntiEntropyService$TreeResponseVerbHandler.doVerb(AntiEntropyService.java:659)
    [junit] 	at org.apache.cassandra.net.MessageDeliveryTask.run(MessageDeliveryTask.java:62)
    [junit] 	at java.util.concurrent.ThreadPoolExecutor$Worker.runTask(ThreadPoolExecutor.java:886)
    [junit] 	at java.util.concurrent.ThreadPoolExecutor$Worker.run(ThreadPoolExecutor.java:908)
    [junit] 	at java.lang.Thread.run(Thread.java:619)
    [junit] ------------- ---------------- ---------------
    [junit] Cobertura: Loaded information on 956 classes.
    [junit] Cobertura: Saved information on 956 classes.
    [junit] Testsuite: org.apache.cassandra.service.CassandraServerTest
    [junit] Tests run: 1, Failures: 0, Errors: 0, Time elapsed: 0.375 sec
    [junit] 
    [junit] Cobertura: Loaded information on 956 classes.
    [junit] Cobertura: Saved information on 956 classes.
    [junit] Testsuite: org.apache.cassandra.service.EmbeddedCassandraServiceTest
    [junit] Tests run: 1, Failures: 0, Errors: 0, Time elapsed: 2.506 sec
    [junit] 
    [junit] ------------- Standard Error -----------------
    [junit]  WARN 20:21:58,049 Unable to lock JVM memory (ENOMEM). This can result in part
of the JVM being swapped out, especially with mmapped I/O enabled. Increase RLIMIT_MEMLOCK
or run Cassandra as root.
    [junit]  WARN 20:21:59,675 Generated random token Token(bytes[933d89ebc8f1a099e2f7b4b65d02ad3b]).
Random tokens will result in an unbalanced ring; see http://wiki.apache.org/cassandra/Operations
    [junit] ------------- ---------------- ---------------
    [junit] Cobertura: Loaded information on 956 classes.
    [junit] Cobertura: Saved information on 956 classes.
    [junit] Testsuite: org.apache.cassandra.service.MoveTest
    [junit] Tests run: 6, Failures: 0, Errors: 0, Time elapsed: 4.294 sec
    [junit] 
    [junit] ------------- Standard Error -----------------
    [junit]  WARN 20:22:07,350 Node /127.0.0.3 'leaving' token mismatch. Long network partition?
    [junit] ------------- ---------------- ---------------
    [junit] Cobertura: Loaded information on 956 classes.
    [junit] Cobertura: Saved information on 956 classes.
    [junit] Testsuite: org.apache.cassandra.service.ReadResponseResolverTest
    [junit] Tests run: 5, Failures: 0, Errors: 0, Time elapsed: 0.516 sec
    [junit] 
    [junit] Cobertura: Loaded information on 956 classes.
    [junit] Cobertura: Saved information on 956 classes.
    [junit] Testsuite: org.apache.cassandra.service.RemoveTest
    [junit] Tests run: 5, Failures: 0, Errors: 0, Time elapsed: 3.97 sec
    [junit] 
    [junit] Cobertura: Loaded information on 956 classes.
    [junit] Cobertura: Saved information on 956 classes.
    [junit] Testsuite: org.apache.cassandra.service.StorageProxyTest
    [junit] Tests run: 4, Failures: 0, Errors: 0, Time elapsed: 0.504 sec
    [junit] 
    [junit] Cobertura: Loaded information on 956 classes.
    [junit] Cobertura: Saved information on 956 classes.
    [junit] Testsuite: org.apache.cassandra.service.StorageServiceClientTest
    [junit] Tests run: 1, Failures: 0, Errors: 0, Time elapsed: 5.513 sec
    [junit] 
    [junit] Cobertura: Loaded information on 956 classes.
    [junit] Cobertura: Saved information on 956 classes.
    [junit] Testsuite: org.apache.cassandra.service.StorageServiceServerTest
    [junit] Tests run: 3, Failures: 0, Errors: 0, Time elapsed: 1.685 sec
    [junit] 
    [junit] ------------- Standard Error -----------------
    [junit]  WARN 20:22:36,983 Generated random token Token(bytes[c7897bf4b6ff60de58cfca1f6570f03b]).
Random tokens will result in an unbalanced ring; see http://wiki.apache.org/cassandra/Operations
    [junit] ------------- ---------------- ---------------
    [junit] Cobertura: Loaded information on 956 classes.
    [junit] Cobertura: Saved information on 956 classes.
    [junit] Testsuite: org.apache.cassandra.streaming.BootstrapTest
    [junit] Tests run: 1, Failures: 0, Errors: 0, Time elapsed: 1.348 sec
    [junit] 
    [junit] Cobertura: Loaded information on 956 classes.
    [junit] Cobertura: Saved information on 956 classes.
    [junit] Testsuite: org.apache.cassandra.streaming.StreamingTransferTest
    [junit] Tests run: 2, Failures: 0, Errors: 0, Time elapsed: 2.129 sec
    [junit] 
    [junit] ------------- Standard Error -----------------
    [junit]  WARN 20:22:46,427 Generated random token Token(bytes[a48534e8bcaacf7db11c4aa93296a034]).
Random tokens will result in an unbalanced ring; see http://wiki.apache.org/cassandra/Operations
    [junit] ------------- ---------------- ---------------
    [junit] Cobertura: Loaded information on 956 classes.
    [junit] Cobertura: Saved information on 956 classes.
    [junit] Testsuite: org.apache.cassandra.tools.SSTableExportTest
    [junit] Tests run: 4, Failures: 0, Errors: 0, Time elapsed: 1.196 sec
    [junit] 
    [junit] Cobertura: Loaded information on 956 classes.
    [junit] Cobertura: Saved information on 956 classes.
    [junit] Testsuite: org.apache.cassandra.tools.SSTableImportTest
    [junit] Tests run: 2, Failures: 0, Errors: 0, Time elapsed: 0.916 sec
    [junit] 
    [junit] Cobertura: Loaded information on 956 classes.
    [junit] Cobertura: Saved information on 956 classes.
    [junit] Testsuite: org.apache.cassandra.utils.BloomFilterTest
    [junit] Tests run: 6, Failures: 0, Errors: 0, Time elapsed: 6.362 sec
    [junit] 
    [junit] Cobertura: Loaded information on 956 classes.
    [junit] Cobertura: Saved information on 956 classes.
    [junit] Testsuite: org.apache.cassandra.utils.BoundedStatsDequeTest
    [junit] Tests run: 1, Failures: 0, Errors: 0, Time elapsed: 0.068 sec
    [junit] 
    [junit] Cobertura: Loaded information on 956 classes.
    [junit] Cobertura: Saved information on 956 classes.
    [junit] Testsuite: org.apache.cassandra.utils.EstimatedHistogramTest
    [junit] Tests run: 1, Failures: 0, Errors: 0, Time elapsed: 0.083 sec
    [junit] 
    [junit] Cobertura: Loaded information on 956 classes.
    [junit] Cobertura: Saved information on 956 classes.
    [junit] Testsuite: org.apache.cassandra.utils.FBUtilitiesTest
    [junit] Tests run: 4, Failures: 0, Errors: 0, Time elapsed: 0.172 sec
    [junit] 
    [junit] Cobertura: Loaded information on 956 classes.
    [junit] Cobertura: Saved information on 956 classes.
    [junit] Testsuite: org.apache.cassandra.utils.FilterTest
    [junit] Tests run: 1, Failures: 0, Errors: 0, Time elapsed: 2.058 sec
    [junit] 
    [junit] Cobertura: Loaded information on 956 classes.
    [junit] Cobertura: Saved information on 956 classes.
    [junit] Testsuite: org.apache.cassandra.utils.MerkleTreeTest
    [junit] Tests run: 14, Failures: 0, Errors: 0, Time elapsed: 0.592 sec
    [junit] 
    [junit] Cobertura: Loaded information on 956 classes.
    [junit] Cobertura: Saved information on 956 classes.

BUILD FAILED
<https://hudson.apache.org/hudson/job/Cassandra-0.7/ws/cassandra/build.xml>:456: The
following error occurred while executing this line:
<https://hudson.apache.org/hudson/job/Cassandra-0.7/ws/cassandra/build.xml>:451: Some
unit test(s) failed.

Total time: 17 minutes 36 seconds
[TASKS] Skipping publisher since build result is FAILURE
Publishing Javadoc
Archiving artifacts
Recording test results
Skipping Cobertura coverage report as build was not UNSTABLE or better ...


Mime
View raw message