incubator-cassandra-dev mailing list archives

Site index · List index
Message view « Date » · « Thread »
Top « Date » · « Thread »
From Apache Hudson Server <hud...@hudson.apache.org>
Subject Build failed in Hudson: Cassandra-0.7 #15
Date Thu, 18 Nov 2010 10:40:24 GMT
See <https://hudson.apache.org/hudson/job/Cassandra-0.7/15/changes>

Changes:

[jbellis] fix sstableimport regression
patch by Bryan Tower; reviewed by Sylvain Lebresne for CASSANDRA-1753

------------------------------------------
[...truncated 1576 lines...]
    [junit] Testsuite: org.apache.cassandra.dht.CollatingOrderPreservingPartitionerTest
    [junit] Tests run: 7, Failures: 0, Errors: 0, Time elapsed: 14.76 sec
    [junit] 
    [junit] Cobertura: Loaded information on 956 classes.
    [junit] Cobertura: Saved information on 956 classes.
    [junit] Testsuite: org.apache.cassandra.dht.OrderPreservingPartitionerTest
    [junit] Tests run: 6, Failures: 0, Errors: 0, Time elapsed: 8.128 sec
    [junit] 
    [junit] Cobertura: Loaded information on 956 classes.
    [junit] Cobertura: Saved information on 956 classes.
    [junit] Testsuite: org.apache.cassandra.dht.RandomPartitionerTest
    [junit] Tests run: 5, Failures: 0, Errors: 0, Time elapsed: 3.94 sec
    [junit] 
    [junit] Cobertura: Loaded information on 956 classes.
    [junit] Cobertura: Saved information on 956 classes.
    [junit] Testsuite: org.apache.cassandra.dht.RangeTest
    [junit] Tests run: 12, Failures: 0, Errors: 0, Time elapsed: 0.538 sec
    [junit] 
    [junit] Cobertura: Loaded information on 956 classes.
    [junit] Cobertura: Saved information on 956 classes.
    [junit] Testsuite: org.apache.cassandra.gms.ArrivalWindowTest
    [junit] Tests run: 1, Failures: 0, Errors: 0, Time elapsed: 0.134 sec
    [junit] 
    [junit] Cobertura: Loaded information on 956 classes.
    [junit] Cobertura: Saved information on 956 classes.
    [junit] Testsuite: org.apache.cassandra.gms.GossipDigestTest
    [junit] Tests run: 1, Failures: 0, Errors: 0, Time elapsed: 0.067 sec
    [junit] 
    [junit] Cobertura: Loaded information on 956 classes.
    [junit] Cobertura: Saved information on 956 classes.
    [junit] Testsuite: org.apache.cassandra.hadoop.ColumnFamilyInputFormatTest
    [junit] Tests run: 1, Failures: 0, Errors: 0, Time elapsed: 0.214 sec
    [junit] 
    [junit] Cobertura: Loaded information on 956 classes.
    [junit] Cobertura: Saved information on 956 classes.
    [junit] Testsuite: org.apache.cassandra.io.BloomFilterTrackerTest
    [junit] Tests run: 3, Failures: 0, Errors: 0, Time elapsed: 0.51 sec
    [junit] 
    [junit] Cobertura: Loaded information on 956 classes.
    [junit] Cobertura: Saved information on 956 classes.
    [junit] Testsuite: org.apache.cassandra.io.LazilyCompactedRowTest
    [junit] Tests run: 5, Failures: 0, Errors: 0, Time elapsed: 25.865 sec
    [junit] 
    [junit] Cobertura: Loaded information on 956 classes.
    [junit] Cobertura: Saved information on 956 classes.
    [junit] Testsuite: org.apache.cassandra.io.sstable.LegacySSTableTest
    [junit] Tests run: 1, Failures: 0, Errors: 0, Time elapsed: 3.753 sec
    [junit] 
    [junit] ------------- Standard Error -----------------
    [junit]  WARN 10:36:20,910 Invalid file '.svn' in data directory <https://hudson.apache.org/hudson/job/Cassandra-0.7/ws/cassandra/test/data/legacy-sstables/b/Keyspace1.>
    [junit] ------------- ---------------- ---------------
    [junit] Cobertura: Loaded information on 956 classes.
    [junit] Cobertura: Saved information on 956 classes.
    [junit] Testsuite: org.apache.cassandra.io.sstable.SSTableReaderTest
    [junit] Tests run: 3, Failures: 0, Errors: 0, Time elapsed: 6.974 sec
    [junit] 
    [junit] Cobertura: Loaded information on 956 classes.
    [junit] Cobertura: Saved information on 956 classes.
    [junit] Testsuite: org.apache.cassandra.io.sstable.SSTableTest
    [junit] Tests run: 2, Failures: 0, Errors: 0, Time elapsed: 7.285 sec
    [junit] 
    [junit] Cobertura: Loaded information on 956 classes.
    [junit] Cobertura: Saved information on 956 classes.
    [junit] Testsuite: org.apache.cassandra.io.sstable.SSTableWriterTest
    [junit] Tests run: 1, Failures: 0, Errors: 0, Time elapsed: 1.418 sec
    [junit] 
    [junit] Cobertura: Loaded information on 956 classes.
    [junit] Cobertura: Saved information on 956 classes.
    [junit] Testsuite: org.apache.cassandra.io.util.BufferedRandomAccessFileTest
    [junit] Tests run: 4, Failures: 0, Errors: 0, Time elapsed: 0.739 sec
    [junit] 
    [junit] Cobertura: Loaded information on 956 classes.
    [junit] Cobertura: Saved information on 956 classes.
    [junit] Testsuite: org.apache.cassandra.locator.DynamicEndpointSnitchTest
    [junit] Tests run: 1, Failures: 0, Errors: 0, Time elapsed: 1.223 sec
    [junit] 
    [junit] Cobertura: Loaded information on 956 classes.
    [junit] Cobertura: Saved information on 956 classes.
    [junit] Testsuite: org.apache.cassandra.locator.NetworkTopologyStrategyTest
    [junit] Tests run: 1, Failures: 0, Errors: 0, Time elapsed: 0.548 sec
    [junit] 
    [junit] Cobertura: Loaded information on 956 classes.
    [junit] Cobertura: Saved information on 956 classes.
    [junit] Testsuite: org.apache.cassandra.locator.OldNetworkTopologyStrategyTest
    [junit] Tests run: 3, Failures: 0, Errors: 0, Time elapsed: 0.453 sec
    [junit] 
    [junit] Cobertura: Loaded information on 956 classes.
    [junit] Cobertura: Saved information on 956 classes.
    [junit] Testsuite: org.apache.cassandra.locator.ReplicationStrategyEndpointCacheTest
    [junit] Tests run: 2, Failures: 0, Errors: 0, Time elapsed: 1.016 sec
    [junit] 
    [junit] Cobertura: Loaded information on 956 classes.
    [junit] Cobertura: Saved information on 956 classes.
    [junit] Testsuite: org.apache.cassandra.locator.SimpleStrategyTest
    [junit] Tests run: 4, Failures: 0, Errors: 0, Time elapsed: 0.815 sec
    [junit] 
    [junit] Cobertura: Loaded information on 956 classes.
    [junit] Cobertura: Saved information on 956 classes.
    [junit] Testsuite: org.apache.cassandra.locator.TokenMetadataTest
    [junit] Tests run: 2, Failures: 0, Errors: 0, Time elapsed: 0.507 sec
    [junit] 
    [junit] Cobertura: Loaded information on 956 classes.
    [junit] Cobertura: Saved information on 956 classes.
    [junit] Testsuite: org.apache.cassandra.service.AntiEntropyServiceTest
    [junit] Exception in thread "Thread-5" java.lang.RuntimeException: java.lang.NullPointerException
    [junit] 	at org.apache.cassandra.utils.WrappedRunnable.run(WrappedRunnable.java:34)
    [junit] 	at org.apache.cassandra.streaming.StreamInSession.closeIfFinished(StreamInSession.java:162)
    [junit] 	at org.apache.cassandra.streaming.IncomingStreamReader.read(IncomingStreamReader.java:66)
    [junit] 	at org.apache.cassandra.net.IncomingTcpConnection.run(IncomingTcpConnection.java:75)
    [junit] Caused by: java.lang.NullPointerException
    [junit] 	at org.apache.cassandra.service.AntiEntropyService.completedRequest(AntiEntropyService.java:133)
    [junit] 	at org.apache.cassandra.service.AntiEntropyService$Differencer$Callback.runMayThrow(AntiEntropyService.java:537)
    [junit] 	at org.apache.cassandra.utils.WrappedRunnable.run(WrappedRunnable.java:30)
    [junit] 	... 3 more
    [junit] Tests run: 7, Failures: 0, Errors: 0, Time elapsed: 6.307 sec
    [junit] 
    [junit] ------------- Standard Error -----------------
    [junit]  WARN 10:37:23,625 Generated random token Token(bytes[f9dfc3f31f5403869218ba43df54f27f]).
Random tokens will result in an unbalanced ring; see http://wiki.apache.org/cassandra/Operations
    [junit] Exception in thread "AntientropyStage:1" java.lang.AssertionError
    [junit] 	at org.apache.cassandra.locator.TokenMetadata.firstTokenIndex(TokenMetadata.java:392)
    [junit] 	at org.apache.cassandra.locator.TokenMetadata.firstToken(TokenMetadata.java:406)
    [junit] 	at org.apache.cassandra.locator.AbstractReplicationStrategy.getNaturalEndpoints(AbstractReplicationStrategy.java:98)
    [junit] 	at org.apache.cassandra.service.StorageService.constructRangeToEndpointMap(StorageService.java:566)
    [junit] 	at org.apache.cassandra.service.StorageService.getRangeToAddressMap(StorageService.java:541)
    [junit] 	at org.apache.cassandra.service.AntiEntropyService.getNeighbors(AntiEntropyService.java:158)
    [junit] 	at org.apache.cassandra.service.AntiEntropyService.rendezvous(AntiEntropyService.java:182)
    [junit] 	at org.apache.cassandra.service.AntiEntropyService.access$100(AntiEntropyService.java:86)
    [junit] 	at org.apache.cassandra.service.AntiEntropyService$TreeResponseVerbHandler.doVerb(AntiEntropyService.java:659)
    [junit] 	at org.apache.cassandra.net.MessageDeliveryTask.run(MessageDeliveryTask.java:62)
    [junit] 	at java.util.concurrent.ThreadPoolExecutor$Worker.runTask(ThreadPoolExecutor.java:886)
    [junit] 	at java.util.concurrent.ThreadPoolExecutor$Worker.run(ThreadPoolExecutor.java:908)
    [junit] 	at java.lang.Thread.run(Thread.java:619)
    [junit] ------------- ---------------- ---------------
    [junit] Cobertura: Loaded information on 956 classes.
    [junit] Cobertura: Saved information on 956 classes.
    [junit] Testsuite: org.apache.cassandra.service.CassandraServerTest
    [junit] Tests run: 1, Failures: 0, Errors: 0, Time elapsed: 0.428 sec
    [junit] 
    [junit] Cobertura: Loaded information on 956 classes.
    [junit] Cobertura: Saved information on 956 classes.
    [junit] Testsuite: org.apache.cassandra.service.EmbeddedCassandraServiceTest
    [junit] Tests run: 1, Failures: 0, Errors: 0, Time elapsed: 2.681 sec
    [junit] 
    [junit] ------------- Standard Error -----------------
    [junit]  WARN 10:37:37,559 Unable to lock JVM memory (ENOMEM). This can result in part
of the JVM being swapped out, especially with mmapped I/O enabled. Increase RLIMIT_MEMLOCK
or run Cassandra as root.
    [junit]  WARN 10:37:39,327 Generated random token Token(bytes[76776dd512fcf6af3d94af026bc5d34b]).
Random tokens will result in an unbalanced ring; see http://wiki.apache.org/cassandra/Operations
    [junit] ------------- ---------------- ---------------
    [junit] Cobertura: Loaded information on 956 classes.
    [junit] Cobertura: Saved information on 956 classes.
    [junit] Testsuite: org.apache.cassandra.service.MoveTest
    [junit] Tests run: 6, Failures: 0, Errors: 0, Time elapsed: 4.442 sec
    [junit] 
    [junit] ------------- Standard Error -----------------
    [junit]  WARN 10:37:47,604 Node /127.0.0.3 'leaving' token mismatch. Long network partition?
    [junit] ------------- ---------------- ---------------
    [junit] Cobertura: Loaded information on 956 classes.
    [junit] Cobertura: Saved information on 956 classes.
    [junit] Testsuite: org.apache.cassandra.service.ReadResponseResolverTest
    [junit] Tests run: 5, Failures: 0, Errors: 0, Time elapsed: 0.531 sec
    [junit] 
    [junit] Cobertura: Loaded information on 956 classes.
    [junit] Cobertura: Saved information on 956 classes.
    [junit] Testsuite: org.apache.cassandra.service.RemoveTest
    [junit] Tests run: 5, Failures: 0, Errors: 0, Time elapsed: 4.244 sec
    [junit] 
    [junit] Cobertura: Loaded information on 956 classes.
    [junit] Cobertura: Saved information on 956 classes.
    [junit] Testsuite: org.apache.cassandra.service.StorageProxyTest
    [junit] Tests run: 4, Failures: 0, Errors: 0, Time elapsed: 0.53 sec
    [junit] 
    [junit] Cobertura: Loaded information on 956 classes.
    [junit] Cobertura: Saved information on 956 classes.
    [junit] Testsuite: org.apache.cassandra.service.StorageServiceClientTest
    [junit] Tests run: 1, Failures: 0, Errors: 0, Time elapsed: 5.53 sec
    [junit] 
    [junit] Cobertura: Loaded information on 956 classes.
    [junit] Cobertura: Saved information on 956 classes.
    [junit] Testsuite: org.apache.cassandra.service.StorageServiceServerTest
    [junit] Tests run: 3, Failures: 0, Errors: 0, Time elapsed: 1.418 sec
    [junit] 
    [junit] ------------- Standard Error -----------------
    [junit]  WARN 10:38:17,513 Generated random token Token(bytes[19ce660cebfd1d45a9d7784610b91845]).
Random tokens will result in an unbalanced ring; see http://wiki.apache.org/cassandra/Operations
    [junit] ------------- ---------------- ---------------
    [junit] Cobertura: Loaded information on 956 classes.
    [junit] Cobertura: Saved information on 956 classes.
    [junit] Testsuite: org.apache.cassandra.streaming.BootstrapTest
    [junit] Tests run: 1, Failures: 0, Errors: 0, Time elapsed: 0.989 sec
    [junit] 
    [junit] Cobertura: Loaded information on 956 classes.
    [junit] Cobertura: Saved information on 956 classes.
    [junit] Testsuite: org.apache.cassandra.streaming.StreamingTransferTest
    [junit] Tests run: 2, Failures: 0, Errors: 0, Time elapsed: 2.081 sec
    [junit] 
    [junit] ------------- Standard Error -----------------
    [junit]  WARN 10:38:26,970 Generated random token Token(bytes[3fc280004c22d571fc4d45b10caf3d97]).
Random tokens will result in an unbalanced ring; see http://wiki.apache.org/cassandra/Operations
    [junit] ------------- ---------------- ---------------
    [junit] Cobertura: Loaded information on 956 classes.
    [junit] Cobertura: Saved information on 956 classes.
    [junit] Testsuite: org.apache.cassandra.tools.SSTableExportTest
    [junit] Tests run: 4, Failures: 0, Errors: 0, Time elapsed: 1.576 sec
    [junit] 
    [junit] Cobertura: Loaded information on 956 classes.
    [junit] Cobertura: Saved information on 956 classes.
    [junit] Testsuite: org.apache.cassandra.tools.SSTableImportTest
    [junit] Tests run: 2, Failures: 0, Errors: 0, Time elapsed: 0.916 sec
    [junit] 
    [junit] Cobertura: Loaded information on 956 classes.
    [junit] Cobertura: Saved information on 956 classes.
    [junit] Testsuite: org.apache.cassandra.utils.BloomFilterTest
    [junit] Tests run: 6, Failures: 0, Errors: 0, Time elapsed: 7.362 sec
    [junit] 
    [junit] Cobertura: Loaded information on 956 classes.
    [junit] Cobertura: Saved information on 956 classes.
    [junit] Testsuite: org.apache.cassandra.utils.BoundedStatsDequeTest
    [junit] Tests run: 1, Failures: 0, Errors: 0, Time elapsed: 0.071 sec
    [junit] 
    [junit] Cobertura: Loaded information on 956 classes.
    [junit] Cobertura: Saved information on 956 classes.
    [junit] Testsuite: org.apache.cassandra.utils.EstimatedHistogramTest
    [junit] Tests run: 1, Failures: 0, Errors: 0, Time elapsed: 0.092 sec
    [junit] 
    [junit] Cobertura: Loaded information on 956 classes.
    [junit] Cobertura: Saved information on 956 classes.
    [junit] Testsuite: org.apache.cassandra.utils.FBUtilitiesTest
    [junit] Tests run: 4, Failures: 0, Errors: 0, Time elapsed: 0.19 sec
    [junit] 
    [junit] Cobertura: Loaded information on 956 classes.
    [junit] Cobertura: Saved information on 956 classes.
    [junit] Testsuite: org.apache.cassandra.utils.FilterTest
    [junit] Tests run: 1, Failures: 0, Errors: 0, Time elapsed: 2.219 sec
    [junit] 
    [junit] Cobertura: Loaded information on 956 classes.
    [junit] Cobertura: Saved information on 956 classes.
    [junit] Testsuite: org.apache.cassandra.utils.MerkleTreeTest
    [junit] Tests run: 14, Failures: 0, Errors: 0, Time elapsed: 0.608 sec
    [junit] 
    [junit] Cobertura: Loaded information on 956 classes.
    [junit] Cobertura: Saved information on 956 classes.

BUILD FAILED
<https://hudson.apache.org/hudson/job/Cassandra-0.7/ws/cassandra/build.xml>:456: The
following error occurred while executing this line:
<https://hudson.apache.org/hudson/job/Cassandra-0.7/ws/cassandra/build.xml>:451: Some
unit test(s) failed.

Total time: 17 minutes 55 seconds
[TASKS] Skipping publisher since build result is FAILURE
Publishing Javadoc
Archiving artifacts
Recording test results
Skipping Cobertura coverage report as build was not UNSTABLE or better ...


Mime
View raw message