incubator-cassandra-dev mailing list archives

Site index · List index
Message view « Date » · « Thread »
Top « Date » · « Thread »
From Apache Hudson Server <hud...@hudson.apache.org>
Subject Build failed in Hudson: Cassandra-0.7 #12
Date Wed, 17 Nov 2010 20:57:54 GMT
See <https://hudson.apache.org/hudson/job/Cassandra-0.7/12/changes>

Changes:

[jbellis] index scan treats missing columns as not matching secondary expressions
patch by jbellis; reviewed by Stu Hood for CASSANDRA-1745

------------------------------------------
[...truncated 1576 lines...]
    [junit] Testsuite: org.apache.cassandra.dht.CollatingOrderPreservingPartitionerTest
    [junit] Tests run: 7, Failures: 0, Errors: 0, Time elapsed: 15.37 sec
    [junit] 
    [junit] Cobertura: Loaded information on 956 classes.
    [junit] Cobertura: Saved information on 956 classes.
    [junit] Testsuite: org.apache.cassandra.dht.OrderPreservingPartitionerTest
    [junit] Tests run: 6, Failures: 0, Errors: 0, Time elapsed: 8.069 sec
    [junit] 
    [junit] Cobertura: Loaded information on 956 classes.
    [junit] Cobertura: Saved information on 956 classes.
    [junit] Testsuite: org.apache.cassandra.dht.RandomPartitionerTest
    [junit] Tests run: 5, Failures: 0, Errors: 0, Time elapsed: 3.824 sec
    [junit] 
    [junit] Cobertura: Loaded information on 956 classes.
    [junit] Cobertura: Saved information on 956 classes.
    [junit] Testsuite: org.apache.cassandra.dht.RangeTest
    [junit] Tests run: 12, Failures: 0, Errors: 0, Time elapsed: 0.521 sec
    [junit] 
    [junit] Cobertura: Loaded information on 956 classes.
    [junit] Cobertura: Saved information on 956 classes.
    [junit] Testsuite: org.apache.cassandra.gms.ArrivalWindowTest
    [junit] Tests run: 1, Failures: 0, Errors: 0, Time elapsed: 0.138 sec
    [junit] 
    [junit] Cobertura: Loaded information on 956 classes.
    [junit] Cobertura: Saved information on 956 classes.
    [junit] Testsuite: org.apache.cassandra.gms.GossipDigestTest
    [junit] Tests run: 1, Failures: 0, Errors: 0, Time elapsed: 0.069 sec
    [junit] 
    [junit] Cobertura: Loaded information on 956 classes.
    [junit] Cobertura: Saved information on 956 classes.
    [junit] Testsuite: org.apache.cassandra.hadoop.ColumnFamilyInputFormatTest
    [junit] Tests run: 1, Failures: 0, Errors: 0, Time elapsed: 0.223 sec
    [junit] 
    [junit] Cobertura: Loaded information on 956 classes.
    [junit] Cobertura: Saved information on 956 classes.
    [junit] Testsuite: org.apache.cassandra.io.BloomFilterTrackerTest
    [junit] Tests run: 3, Failures: 0, Errors: 0, Time elapsed: 0.393 sec
    [junit] 
    [junit] Cobertura: Loaded information on 956 classes.
    [junit] Cobertura: Saved information on 956 classes.
    [junit] Testsuite: org.apache.cassandra.io.LazilyCompactedRowTest
    [junit] Tests run: 5, Failures: 0, Errors: 0, Time elapsed: 21.101 sec
    [junit] 
    [junit] Cobertura: Loaded information on 956 classes.
    [junit] Cobertura: Saved information on 956 classes.
    [junit] Testsuite: org.apache.cassandra.io.sstable.LegacySSTableTest
    [junit] Tests run: 1, Failures: 0, Errors: 0, Time elapsed: 3.705 sec
    [junit] 
    [junit] ------------- Standard Error -----------------
    [junit]  WARN 20:53:58,002 Invalid file '.svn' in data directory <https://hudson.apache.org/hudson/job/Cassandra-0.7/ws/cassandra/test/data/legacy-sstables/b/Keyspace1.>
    [junit] ------------- ---------------- ---------------
    [junit] Cobertura: Loaded information on 956 classes.
    [junit] Cobertura: Saved information on 956 classes.
    [junit] Testsuite: org.apache.cassandra.io.sstable.SSTableReaderTest
    [junit] Tests run: 3, Failures: 0, Errors: 0, Time elapsed: 6.4 sec
    [junit] 
    [junit] Cobertura: Loaded information on 956 classes.
    [junit] Cobertura: Saved information on 956 classes.
    [junit] Testsuite: org.apache.cassandra.io.sstable.SSTableTest
    [junit] Tests run: 2, Failures: 0, Errors: 0, Time elapsed: 7.031 sec
    [junit] 
    [junit] Cobertura: Loaded information on 956 classes.
    [junit] Cobertura: Saved information on 956 classes.
    [junit] Testsuite: org.apache.cassandra.io.sstable.SSTableWriterTest
    [junit] Tests run: 1, Failures: 0, Errors: 0, Time elapsed: 1.283 sec
    [junit] 
    [junit] Cobertura: Loaded information on 956 classes.
    [junit] Cobertura: Saved information on 956 classes.
    [junit] Testsuite: org.apache.cassandra.io.util.BufferedRandomAccessFileTest
    [junit] Tests run: 4, Failures: 0, Errors: 0, Time elapsed: 0.767 sec
    [junit] 
    [junit] Cobertura: Loaded information on 956 classes.
    [junit] Cobertura: Saved information on 956 classes.
    [junit] Testsuite: org.apache.cassandra.locator.DynamicEndpointSnitchTest
    [junit] Tests run: 1, Failures: 0, Errors: 0, Time elapsed: 1.246 sec
    [junit] 
    [junit] Cobertura: Loaded information on 956 classes.
    [junit] Cobertura: Saved information on 956 classes.
    [junit] Testsuite: org.apache.cassandra.locator.NetworkTopologyStrategyTest
    [junit] Tests run: 1, Failures: 0, Errors: 0, Time elapsed: 0.488 sec
    [junit] 
    [junit] Cobertura: Loaded information on 956 classes.
    [junit] Cobertura: Saved information on 956 classes.
    [junit] Testsuite: org.apache.cassandra.locator.OldNetworkTopologyStrategyTest
    [junit] Tests run: 3, Failures: 0, Errors: 0, Time elapsed: 0.441 sec
    [junit] 
    [junit] Cobertura: Loaded information on 956 classes.
    [junit] Cobertura: Saved information on 956 classes.
    [junit] Testsuite: org.apache.cassandra.locator.ReplicationStrategyEndpointCacheTest
    [junit] Tests run: 2, Failures: 0, Errors: 0, Time elapsed: 1.384 sec
    [junit] 
    [junit] Cobertura: Loaded information on 956 classes.
    [junit] Cobertura: Saved information on 956 classes.
    [junit] Testsuite: org.apache.cassandra.locator.SimpleStrategyTest
    [junit] Tests run: 4, Failures: 0, Errors: 0, Time elapsed: 0.773 sec
    [junit] 
    [junit] Cobertura: Loaded information on 956 classes.
    [junit] Cobertura: Saved information on 956 classes.
    [junit] Testsuite: org.apache.cassandra.locator.TokenMetadataTest
    [junit] Tests run: 2, Failures: 0, Errors: 0, Time elapsed: 0.492 sec
    [junit] 
    [junit] Cobertura: Loaded information on 956 classes.
    [junit] Cobertura: Saved information on 956 classes.
    [junit] Testsuite: org.apache.cassandra.service.AntiEntropyServiceTest
    [junit] Tests run: 7, Failures: 0, Errors: 0, Time elapsed: 4.893 sec
    [junit] 
    [junit] ------------- Standard Error -----------------
    [junit] Exception in thread "Thread-5" java.lang.RuntimeException: java.lang.NullPointerException
    [junit] 	at org.apache.cassandra.utils.WrappedRunnable.run(WrappedRunnable.java:34)
    [junit]  WARN 20:54:59,418 Generated random token Token(bytes[d654a17757587185220201dc0e7aaba5]).
Random tokens will result in an unbalanced ring; see http://wiki.apache.org/cassandra/Operations
    [junit] 	at org.apache.cassandra.streaming.StreamInSession.closeIfFinished(StreamInSession.java:162)
    [junit] Exception in thread "AntientropyStage:1" java.lang.AssertionError
    [junit] 	at org.apache.cassandra.streaming.IncomingStreamReader.read(IncomingStreamReader.java:66)
    [junit] 	at org.apache.cassandra.locator.TokenMetadata.firstTokenIndex(TokenMetadata.java:392)
    [junit] 	at org.apache.cassandra.net.IncomingTcpConnection.run(IncomingTcpConnection.java:75)
    [junit] 	at org.apache.cassandra.locator.TokenMetadata.firstToken(TokenMetadata.java:406)
    [junit] Caused by: java.lang.NullPointerException
    [junit] 	at org.apache.cassandra.locator.AbstractReplicationStrategy.getNaturalEndpoints(AbstractReplicationStrategy.java:98)
    [junit] 	at org.apache.cassandra.service.AntiEntropyService.completedRequest(AntiEntropyService.java:133)
    [junit] 	at org.apache.cassandra.service.StorageService.constructRangeToEndpointMap(StorageService.java:566)
    [junit] 	at org.apache.cassandra.service.AntiEntropyService$Differencer$Callback.runMayThrow(AntiEntropyService.java:537)
    [junit] 	at org.apache.cassandra.service.StorageService.getRangeToAddressMap(StorageService.java:541)
    [junit] 	at org.apache.cassandra.utils.WrappedRunnable.run(WrappedRunnable.java:30)
    [junit] 	at org.apache.cassandra.service.AntiEntropyService.getNeighbors(AntiEntropyService.java:158)
    [junit] 	... 3 more
    [junit] 	at org.apache.cassandra.service.AntiEntropyService.rendezvous(AntiEntropyService.java:182)
    [junit] 	at org.apache.cassandra.service.AntiEntropyService.access$100(AntiEntropyService.java:86)
    [junit] 	at org.apache.cassandra.service.AntiEntropyService$TreeResponseVerbHandler.doVerb(AntiEntropyService.java:659)
    [junit] 	at org.apache.cassandra.net.MessageDeliveryTask.run(MessageDeliveryTask.java:62)
    [junit] 	at java.util.concurrent.ThreadPoolExecutor$Worker.runTask(ThreadPoolExecutor.java:886)
    [junit] 	at java.util.concurrent.ThreadPoolExecutor$Worker.run(ThreadPoolExecutor.java:908)
    [junit] 	at java.lang.Thread.run(Thread.java:619)
    [junit] ------------- ---------------- ---------------
    [junit] Cobertura: Loaded information on 956 classes.
    [junit] Cobertura: Saved information on 956 classes.
    [junit] Testsuite: org.apache.cassandra.service.CassandraServerTest
    [junit] Tests run: 1, Failures: 0, Errors: 0, Time elapsed: 0.376 sec
    [junit] 
    [junit] Cobertura: Loaded information on 956 classes.
    [junit] Cobertura: Saved information on 956 classes.
    [junit] Testsuite: org.apache.cassandra.service.EmbeddedCassandraServiceTest
    [junit] Tests run: 1, Failures: 0, Errors: 0, Time elapsed: 2.258 sec
    [junit] 
    [junit] ------------- Standard Error -----------------
    [junit]  WARN 20:55:11,039 Unable to lock JVM memory (ENOMEM). This can result in part
of the JVM being swapped out, especially with mmapped I/O enabled. Increase RLIMIT_MEMLOCK
or run Cassandra as root.
    [junit]  WARN 20:55:12,419 Generated random token Token(bytes[005372c1c68bab2f0c103be5bcc54e36]).
Random tokens will result in an unbalanced ring; see http://wiki.apache.org/cassandra/Operations
    [junit] ------------- ---------------- ---------------
    [junit] Cobertura: Loaded information on 956 classes.
    [junit] Cobertura: Saved information on 956 classes.
    [junit] Testsuite: org.apache.cassandra.service.MoveTest
    [junit] Tests run: 6, Failures: 0, Errors: 0, Time elapsed: 4.39 sec
    [junit] 
    [junit] ------------- Standard Error -----------------
    [junit]  WARN 20:55:20,199 Node /127.0.0.3 'leaving' token mismatch. Long network partition?
    [junit] ------------- ---------------- ---------------
    [junit] Cobertura: Loaded information on 956 classes.
    [junit] Cobertura: Saved information on 956 classes.
    [junit] Testsuite: org.apache.cassandra.service.ReadResponseResolverTest
    [junit] Tests run: 5, Failures: 0, Errors: 0, Time elapsed: 0.572 sec
    [junit] 
    [junit] Cobertura: Loaded information on 956 classes.
    [junit] Cobertura: Saved information on 956 classes.
    [junit] Testsuite: org.apache.cassandra.service.RemoveTest
    [junit] Tests run: 5, Failures: 0, Errors: 0, Time elapsed: 4.031 sec
    [junit] 
    [junit] Cobertura: Loaded information on 956 classes.
    [junit] Cobertura: Saved information on 956 classes.
    [junit] Testsuite: org.apache.cassandra.service.StorageProxyTest
    [junit] Tests run: 4, Failures: 0, Errors: 0, Time elapsed: 0.509 sec
    [junit] 
    [junit] Cobertura: Loaded information on 956 classes.
    [junit] Cobertura: Saved information on 956 classes.
    [junit] Testsuite: org.apache.cassandra.service.StorageServiceClientTest
    [junit] Tests run: 1, Failures: 0, Errors: 0, Time elapsed: 5.534 sec
    [junit] 
    [junit] Cobertura: Loaded information on 956 classes.
    [junit] Cobertura: Saved information on 956 classes.
    [junit] Testsuite: org.apache.cassandra.service.StorageServiceServerTest
    [junit] Tests run: 3, Failures: 0, Errors: 0, Time elapsed: 2.116 sec
    [junit] 
    [junit] ------------- Standard Error -----------------
    [junit]  WARN 20:55:50,137 Generated random token Token(bytes[3812d8650feba28b5407130a42610ae9]).
Random tokens will result in an unbalanced ring; see http://wiki.apache.org/cassandra/Operations
    [junit] ------------- ---------------- ---------------
    [junit] Cobertura: Loaded information on 956 classes.
    [junit] Cobertura: Saved information on 956 classes.
    [junit] Testsuite: org.apache.cassandra.streaming.BootstrapTest
    [junit] Tests run: 1, Failures: 0, Errors: 0, Time elapsed: 1.227 sec
    [junit] 
    [junit] Cobertura: Loaded information on 956 classes.
    [junit] Cobertura: Saved information on 956 classes.
    [junit] Testsuite: org.apache.cassandra.streaming.StreamingTransferTest
    [junit] Tests run: 2, Failures: 0, Errors: 0, Time elapsed: 2.011 sec
    [junit] 
    [junit] ------------- Standard Error -----------------
    [junit]  WARN 20:55:59,405 Generated random token Token(bytes[27db79f727a7495f3abfa0345dc9b42e]).
Random tokens will result in an unbalanced ring; see http://wiki.apache.org/cassandra/Operations
    [junit] ------------- ---------------- ---------------
    [junit] Cobertura: Loaded information on 956 classes.
    [junit] Cobertura: Saved information on 956 classes.
    [junit] Testsuite: org.apache.cassandra.tools.SSTableExportTest
    [junit] Tests run: 4, Failures: 0, Errors: 0, Time elapsed: 1.204 sec
    [junit] 
    [junit] Cobertura: Loaded information on 956 classes.
    [junit] Cobertura: Saved information on 956 classes.
    [junit] Testsuite: org.apache.cassandra.tools.SSTableImportTest
    [junit] Tests run: 2, Failures: 0, Errors: 0, Time elapsed: 0.891 sec
    [junit] 
    [junit] Cobertura: Loaded information on 956 classes.
    [junit] Cobertura: Saved information on 956 classes.
    [junit] Testsuite: org.apache.cassandra.utils.BloomFilterTest
    [junit] Tests run: 6, Failures: 0, Errors: 0, Time elapsed: 6.343 sec
    [junit] 
    [junit] Cobertura: Loaded information on 956 classes.
    [junit] Cobertura: Saved information on 956 classes.
    [junit] Testsuite: org.apache.cassandra.utils.BoundedStatsDequeTest
    [junit] Tests run: 1, Failures: 0, Errors: 0, Time elapsed: 0.068 sec
    [junit] 
    [junit] Cobertura: Loaded information on 956 classes.
    [junit] Cobertura: Saved information on 956 classes.
    [junit] Testsuite: org.apache.cassandra.utils.EstimatedHistogramTest
    [junit] Tests run: 1, Failures: 0, Errors: 0, Time elapsed: 0.083 sec
    [junit] 
    [junit] Cobertura: Loaded information on 956 classes.
    [junit] Cobertura: Saved information on 956 classes.
    [junit] Testsuite: org.apache.cassandra.utils.FBUtilitiesTest
    [junit] Tests run: 4, Failures: 0, Errors: 0, Time elapsed: 0.171 sec
    [junit] 
    [junit] Cobertura: Loaded information on 956 classes.
    [junit] Cobertura: Saved information on 956 classes.
    [junit] Testsuite: org.apache.cassandra.utils.FilterTest
    [junit] Tests run: 1, Failures: 0, Errors: 0, Time elapsed: 2.076 sec
    [junit] 
    [junit] Cobertura: Loaded information on 956 classes.
    [junit] Cobertura: Saved information on 956 classes.
    [junit] Testsuite: org.apache.cassandra.utils.MerkleTreeTest
    [junit] Tests run: 14, Failures: 0, Errors: 0, Time elapsed: 0.575 sec
    [junit] 
    [junit] Cobertura: Loaded information on 956 classes.
    [junit] Cobertura: Saved information on 956 classes.

BUILD FAILED
<https://hudson.apache.org/hudson/job/Cassandra-0.7/ws/cassandra/build.xml>:456: The
following error occurred while executing this line:
<https://hudson.apache.org/hudson/job/Cassandra-0.7/ws/cassandra/build.xml>:451: Some
unit test(s) failed.

Total time: 17 minutes 34 seconds
[TASKS] Skipping publisher since build result is FAILURE
Publishing Javadoc
Archiving artifacts
Recording test results
Skipping Cobertura coverage report as build was not UNSTABLE or better ...


Mime
View raw message