incubator-cassandra-dev mailing list archives

Site index · List index
Message view « Date » · « Thread »
Top « Date » · « Thread »
From Apache Hudson Server <hud...@hudson.apache.org>
Subject Build failed in Hudson: Cassandra-0.6 #2
Date Mon, 15 Nov 2010 20:23:48 GMT
See <https://hudson.apache.org/hudson/job/Cassandra-0.6/2/>

------------------------------------------
[...truncated 806 lines...]
    [junit] Testsuite: org.apache.cassandra.db.RemoveSubColumnTest
    [junit] Tests run: 1, Failures: 0, Errors: 0, Time elapsed: 0.698 sec
    [junit] 
    [junit] Cobertura: Loaded information on 696 classes.
    [junit] Cobertura: Saved information on 696 classes.
    [junit] Testsuite: org.apache.cassandra.db.RemoveSuperColumnTest
    [junit] Tests run: 4, Failures: 0, Errors: 0, Time elapsed: 0.822 sec
    [junit] 
    [junit] Cobertura: Loaded information on 696 classes.
    [junit] Cobertura: Saved information on 696 classes.
    [junit] Testsuite: org.apache.cassandra.db.RowTest
    [junit] Tests run: 3, Failures: 0, Errors: 0, Time elapsed: 0.448 sec
    [junit] 
    [junit] Cobertura: Loaded information on 696 classes.
    [junit] Cobertura: Saved information on 696 classes.
    [junit] Testsuite: org.apache.cassandra.db.SuperColumnTest
    [junit] Tests run: 1, Failures: 0, Errors: 0, Time elapsed: 0.13 sec
    [junit] 
    [junit] Cobertura: Loaded information on 696 classes.
    [junit] Cobertura: Saved information on 696 classes.
    [junit] Testsuite: org.apache.cassandra.db.SystemTableTest
    [junit] Tests run: 2, Failures: 0, Errors: 0, Time elapsed: 0.668 sec
    [junit] 
    [junit] Cobertura: Loaded information on 696 classes.
    [junit] Cobertura: Saved information on 696 classes.
    [junit] Testsuite: org.apache.cassandra.db.TableTest
    [junit] Tests run: 9, Failures: 0, Errors: 0, Time elapsed: 3.842 sec
    [junit] 
    [junit] Cobertura: Loaded information on 696 classes.
    [junit] Cobertura: Saved information on 696 classes.
    [junit] Testsuite: org.apache.cassandra.db.TimeSortTest
    [junit] Tests run: 2, Failures: 0, Errors: 0, Time elapsed: 4.294 sec
    [junit] 
    [junit] Cobertura: Loaded information on 696 classes.
    [junit] Cobertura: Saved information on 696 classes.
    [junit] Testsuite: org.apache.cassandra.db.marshal.TimeUUIDTypeTest
    [junit] Tests run: 1, Failures: 0, Errors: 0, Time elapsed: 0.093 sec
    [junit] 
    [junit] Cobertura: Loaded information on 696 classes.
    [junit] Cobertura: Saved information on 696 classes.
    [junit] Testsuite: org.apache.cassandra.db.marshal.TypeCompareTest
    [junit] Tests run: 5, Failures: 0, Errors: 0, Time elapsed: 0.221 sec
    [junit] 
    [junit] Cobertura: Loaded information on 696 classes.
    [junit] Cobertura: Saved information on 696 classes.
    [junit] Testsuite: org.apache.cassandra.dht.BootStrapperTest
    [junit] Tests run: 2, Failures: 0, Errors: 0, Time elapsed: 1.434 sec
    [junit] 
    [junit] Cobertura: Loaded information on 696 classes.
    [junit] Cobertura: Saved information on 696 classes.
    [junit] Testsuite: org.apache.cassandra.dht.CollatingOrderPreservingPartitionerTest
    [junit] Tests run: 8, Failures: 0, Errors: 0, Time elapsed: 14.005 sec
    [junit] 
    [junit] Cobertura: Loaded information on 696 classes.
    [junit] Cobertura: Saved information on 696 classes.
    [junit] Testsuite: org.apache.cassandra.dht.OrderPreservingPartitionerTest
    [junit] Tests run: 7, Failures: 0, Errors: 0, Time elapsed: 8.542 sec
    [junit] 
    [junit] Cobertura: Loaded information on 696 classes.
    [junit] Cobertura: Saved information on 696 classes.
    [junit] Testsuite: org.apache.cassandra.dht.RandomPartitionerTest
    [junit] Tests run: 6, Failures: 0, Errors: 0, Time elapsed: 3.424 sec
    [junit] 
    [junit] Cobertura: Loaded information on 696 classes.
    [junit] Cobertura: Saved information on 696 classes.
    [junit] Testsuite: org.apache.cassandra.dht.RangeIntersectionTest
    [junit] Tests run: 5, Failures: 0, Errors: 0, Time elapsed: 0.554 sec
    [junit] 
    [junit] Cobertura: Loaded information on 696 classes.
    [junit] Cobertura: Saved information on 696 classes.
    [junit] Testsuite: org.apache.cassandra.dht.RangeTest
    [junit] Tests run: 7, Failures: 0, Errors: 0, Time elapsed: 0.547 sec
    [junit] 
    [junit] Cobertura: Loaded information on 696 classes.
    [junit] Cobertura: Saved information on 696 classes.
    [junit] Testsuite: org.apache.cassandra.gms.ArrivalWindowTest
    [junit] Tests run: 1, Failures: 0, Errors: 0, Time elapsed: 0.118 sec
    [junit] 
    [junit] Cobertura: Loaded information on 696 classes.
    [junit] Cobertura: Saved information on 696 classes.
    [junit] Testsuite: org.apache.cassandra.gms.GossipDigestTest
    [junit] Tests run: 1, Failures: 0, Errors: 0, Time elapsed: 0.066 sec
    [junit] 
    [junit] Cobertura: Loaded information on 696 classes.
    [junit] Cobertura: Saved information on 696 classes.
    [junit] Testsuite: org.apache.cassandra.hadoop.ColumnFamilyInputFormatTest
    [junit] Tests run: 1, Failures: 0, Errors: 0, Time elapsed: 0.204 sec
    [junit] 
    [junit] Cobertura: Loaded information on 696 classes.
    [junit] Cobertura: Saved information on 696 classes.
    [junit] Testsuite: org.apache.cassandra.io.BloomFilterTrackerTest
    [junit] Tests run: 3, Failures: 0, Errors: 0, Time elapsed: 0.423 sec
    [junit] 
    [junit] Cobertura: Loaded information on 696 classes.
    [junit] Cobertura: Saved information on 696 classes.
    [junit] Testsuite: org.apache.cassandra.io.SSTableReaderTest
    [junit] Tests run: 1, Failures: 0, Errors: 0, Time elapsed: 0.843 sec
    [junit] 
    [junit] Cobertura: Loaded information on 696 classes.
    [junit] Cobertura: Saved information on 696 classes.
    [junit] Testsuite: org.apache.cassandra.io.SSTableTest
    [junit] Tests run: 2, Failures: 0, Errors: 0, Time elapsed: 6.258 sec
    [junit] 
    [junit] Cobertura: Loaded information on 696 classes.
    [junit] Cobertura: Saved information on 696 classes.
    [junit] Testsuite: org.apache.cassandra.io.StreamingTest
    [junit] Tests run: 1, Failures: 0, Errors: 0, Time elapsed: 0.461 sec
    [junit] 
    [junit] Cobertura: Loaded information on 696 classes.
    [junit] Cobertura: Saved information on 696 classes.
    [junit] Testsuite: org.apache.cassandra.io.util.BufferedRandomAccessFileTest
    [junit] Tests run: 1, Failures: 0, Errors: 0, Time elapsed: 0.083 sec
    [junit] 
    [junit] Cobertura: Loaded information on 696 classes.
    [junit] Cobertura: Saved information on 696 classes.
    [junit] Testsuite: org.apache.cassandra.locator.DynamicEndpointSnitchTest
    [junit] Tests run: 1, Failures: 0, Errors: 0, Time elapsed: 1.215 sec
    [junit] 
    [junit] Cobertura: Loaded information on 696 classes.
    [junit] Cobertura: Saved information on 696 classes.
    [junit] Testsuite: org.apache.cassandra.locator.RackUnawareStrategyTest
    [junit] Tests run: 4, Failures: 0, Errors: 0, Time elapsed: 0.594 sec
    [junit] 
    [junit] Cobertura: Loaded information on 696 classes.
    [junit] Cobertura: Saved information on 696 classes.
    [junit] Testsuite: org.apache.cassandra.locator.TokenMetadataTest
    [junit] Tests run: 2, Failures: 0, Errors: 0, Time elapsed: 0.559 sec
    [junit] 
    [junit] Cobertura: Loaded information on 696 classes.
    [junit] Cobertura: Saved information on 696 classes.
    [junit] Testsuite: org.apache.cassandra.service.AntiEntropyServiceTest
    [junit] Tests run: 9, Failures: 0, Errors: 0, Time elapsed: 3.475 sec
    [junit] 
    [junit] Cobertura: Loaded information on 696 classes.
    [junit] Cobertura: Saved information on 696 classes.
    [junit] Testsuite: org.apache.cassandra.service.CassandraServerTest
    [junit] Tests run: 1, Failures: 0, Errors: 0, Time elapsed: 0.377 sec
    [junit] 
    [junit] Cobertura: Loaded information on 696 classes.
    [junit] Cobertura: Saved information on 696 classes.
    [junit] Testsuite: org.apache.cassandra.service.EmbeddedCassandraServiceTest
    [junit] Tests run: 1, Failures: 0, Errors: 0, Time elapsed: 0.976 sec
    [junit] 
    [junit] ------------- Standard Error -----------------
    [junit]  WARN 20:22:49,697 Unable to lock JVM memory (ENOMEM). This can result in part
of the JVM being swapped out, especially with mmapped I/O enabled. Increase RLIMIT_MEMLOCK
or run Cassandra as root.
    [junit] ------------- ---------------- ---------------
    [junit] Cobertura: Loaded information on 696 classes.
    [junit] Cobertura: Saved information on 696 classes.
    [junit] Testsuite: org.apache.cassandra.service.MoveTest
    [junit] Tests run: 6, Failures: 0, Errors: 0, Time elapsed: 0.997 sec
    [junit] 
    [junit] ------------- Standard Error -----------------
    [junit]  WARN 20:22:54,714 Node /127.0.0.3 'leaving' token mismatch. Long network partition?
    [junit] ------------- ---------------- ---------------
    [junit] Cobertura: Loaded information on 696 classes.
    [junit] Cobertura: Saved information on 696 classes.
    [junit] Testsuite: org.apache.cassandra.service.RangeSliceResponseResolverTest
    [junit] Tests run: 1, Failures: 0, Errors: 0, Time elapsed: 0.182 sec
    [junit] 
    [junit] Cobertura: Loaded information on 696 classes.
    [junit] Cobertura: Saved information on 696 classes.
    [junit] Testsuite: org.apache.cassandra.service.ReadResponseResolverTest
    [junit] Tests run: 5, Failures: 0, Errors: 0, Time elapsed: 0.481 sec
    [junit] 
    [junit] Cobertura: Loaded information on 696 classes.
    [junit] Cobertura: Saved information on 696 classes.
    [junit] Testsuite: org.apache.cassandra.service.StorageProxyTest
    [junit] Tests run: 4, Failures: 0, Errors: 0, Time elapsed: 0.572 sec
    [junit] 
    [junit] Cobertura: Loaded information on 696 classes.
    [junit] Cobertura: Saved information on 696 classes.
    [junit] Testsuite: org.apache.cassandra.service.StorageServiceClientTest
    [junit] Tests run: 1, Failures: 0, Errors: 0, Time elapsed: 0.586 sec
    [junit] 
    [junit] Cobertura: Loaded information on 696 classes.
    [junit] Cobertura: Saved information on 696 classes.
    [junit] Testsuite: org.apache.cassandra.service.StorageServiceServerTest
    [junit] Tests run: 3, Failures: 0, Errors: 1, Time elapsed: 0.854 sec
    [junit] 
    [junit] Testcase: testRegularMode(org.apache.cassandra.service.StorageServiceServerTest):
Caused an ERROR
    [junit] Address already in use
    [junit] java.net.BindException: Address already in use
    [junit] 	at sun.nio.ch.Net.bind(Native Method)
    [junit] 	at sun.nio.ch.ServerSocketChannelImpl.bind(ServerSocketChannelImpl.java:119)
    [junit] 	at sun.nio.ch.ServerSocketAdaptor.bind(ServerSocketAdaptor.java:59)
    [junit] 	at sun.nio.ch.ServerSocketAdaptor.bind(ServerSocketAdaptor.java:52)
    [junit] 	at org.apache.cassandra.net.MessagingService.listen(MessagingService.java:153)
    [junit] 	at org.apache.cassandra.service.StorageService.initServer(StorageService.java:338)
    [junit] 	at org.apache.cassandra.service.StorageServiceServerTest.testRegularMode(StorageServiceServerTest.java:45)
    [junit] 
    [junit] 
    [junit] Cobertura: Loaded information on 696 classes.
    [junit] Cobertura: Saved information on 696 classes.
    [junit] Test org.apache.cassandra.service.StorageServiceServerTest FAILED
    [junit] Testsuite: org.apache.cassandra.streaming.BootstrapTest
    [junit] Tests run: 1, Failures: 0, Errors: 0, Time elapsed: 0.616 sec
    [junit] 
    [junit] Cobertura: Loaded information on 696 classes.
    [junit] Cobertura: Saved information on 696 classes.
    [junit] Testsuite: org.apache.cassandra.tools.SSTableExportTest
    [junit] Tests run: 4, Failures: 0, Errors: 0, Time elapsed: 0.705 sec
    [junit] 
    [junit] Cobertura: Loaded information on 696 classes.
    [junit] Cobertura: Saved information on 696 classes.
    [junit] Testsuite: org.apache.cassandra.tools.SSTableImportTest
    [junit] Tests run: 2, Failures: 0, Errors: 0, Time elapsed: 0.648 sec
    [junit] 
    [junit] Cobertura: Loaded information on 696 classes.
    [junit] Cobertura: Saved information on 696 classes.
    [junit] Testsuite: org.apache.cassandra.utils.BloomFilterTest
    [junit] Tests run: 6, Failures: 0, Errors: 0, Time elapsed: 2.885 sec
    [junit] 
    [junit] Cobertura: Loaded information on 696 classes.
    [junit] Cobertura: Saved information on 696 classes.
    [junit] Testsuite: org.apache.cassandra.utils.BoundedStatsDequeTest
    [junit] Tests run: 1, Failures: 0, Errors: 0, Time elapsed: 0.066 sec
    [junit] 
    [junit] Cobertura: Loaded information on 696 classes.
    [junit] Cobertura: Saved information on 696 classes.
    [junit] Testsuite: org.apache.cassandra.utils.EstimatedHistogramTest
    [junit] Tests run: 1, Failures: 0, Errors: 0, Time elapsed: 0.081 sec
    [junit] 
    [junit] Cobertura: Loaded information on 696 classes.
    [junit] Cobertura: Saved information on 696 classes.
    [junit] Testsuite: org.apache.cassandra.utils.FBUtilitiesTest
    [junit] Tests run: 2, Failures: 0, Errors: 0, Time elapsed: 0.15 sec
    [junit] 
    [junit] Cobertura: Loaded information on 696 classes.
    [junit] Cobertura: Saved information on 696 classes.
    [junit] Testsuite: org.apache.cassandra.utils.FilterTest
    [junit] Tests run: 1, Failures: 0, Errors: 0, Time elapsed: 1.93 sec
    [junit] 
    [junit] Cobertura: Loaded information on 696 classes.
    [junit] Cobertura: Saved information on 696 classes.
    [junit] Testsuite: org.apache.cassandra.utils.MerkleTreeTest
    [junit] Tests run: 14, Failures: 0, Errors: 0, Time elapsed: 0.702 sec
    [junit] 
    [junit] Cobertura: Loaded information on 696 classes.
    [junit] Cobertura: Saved information on 696 classes.

BUILD FAILED
<https://hudson.apache.org/hudson/job/Cassandra-0.6/ws/cassandra-0.6/build.xml>:336:
Some test(s) failed.

Total time: 4 minutes 40 seconds
[TASKS] Skipping publisher since build result is FAILURE
Publishing Javadoc
Archiving artifacts
Recording test results
Skipping Cobertura coverage report as build was not UNSTABLE or better ...


Mime
View raw message