incubator-cassandra-dev mailing list archives

Site index · List index
Message view « Date » · « Thread »
Top « Date » · « Thread »
From Apache Hudson Server <hud...@hudson.apache.org>
Subject Build failed in Hudson: Cassandra #528
Date Sat, 04 Sep 2010 12:46:48 GMT
See <https://hudson.apache.org/hudson/job/Cassandra/528/changes>

Changes:

[jbellis] update CHANGES

[jbellis] r/m unused IEndpointStateChangePublisher interface.  patch by jbellis

[brandonwilliams] Move persistent sstable stats from the system table to an sstable component.
 Patch by brandonwilliams, reviewed by jbellis for CASSANDRA-1430

[brandonwilliams] Fix typo in JVM opt in cassandra-env.sh.  Patch by brandonwilliams

[jbellis] support for Hadoop Streaming [non-jvm map/reduce via stdin/out].  patch by Stu Hood;
reviewed by jbellis for CASSANDRA-1368

[jbellis] Switch to Cloudera`s Distribution of Hadoop for binary Streaming support.  patch
by Stu Hood; reviewed by jbellis for CASSANDRA-1368

[gdusbabek] avro update ks and cf implementations. patch by gdusbabek, reviewed by stuhood.
CASSANDRA-1285

[gdusbabek] UpdateColumn family. patch by gdusbabek, reviewed by stuhood. CASSANDRA-1285

[gdusbabek] UpdateKeyspace migration. patch by gdusbabek, reviewed by stuhood. CASSANDRA-1285

[gdusbabek] thrift changes for updating keyspaces and column families. patch by gdusbabek,
reviewed by stuhood. CASSANDRA-1285

[jbellis] change list<binary> keys to set<binary> in multiget.  patch by Jon Hermes;
reviewed by jbellis for CASSANDRA-1329

[jbellis] add multiget to stress.py.  patch by Jon Hermes; reviewed by jbellis for CASSANDRA-1329

[eevans] upgrade avro to formal release candidate (v4)

Patch by eevans

[jbellis] merge from 0.6

[jbellis] use correct default name when converting to yaml.  patch by jbellis; reviewed by
Jon Hermes for CASSANDRA-1419

[gdusbabek] avro tests batch mutate in supercolumns

------------------------------------------
[...truncated 1537 lines...]
    [junit] Tests run: 2, Failures: 0, Errors: 0, Time elapsed: 0.126 sec
    [junit] 
    [junit] Cobertura: Loaded information on 932 classes.
    [junit] Cobertura: Saved information on 932 classes.
    [junit] Testsuite: org.apache.cassandra.db.commitlog.CommitLogHeaderTest
    [junit] Tests run: 2, Failures: 0, Errors: 0, Time elapsed: 0.464 sec
    [junit] 
    [junit] Cobertura: Loaded information on 932 classes.
    [junit] Cobertura: Saved information on 932 classes.
    [junit] Testsuite: org.apache.cassandra.db.marshal.IntegerTypeTest
    [junit] Tests run: 10, Failures: 0, Errors: 0, Time elapsed: 1.396 sec
    [junit] 
    [junit] Cobertura: Loaded information on 932 classes.
    [junit] Cobertura: Saved information on 932 classes.
    [junit] Testsuite: org.apache.cassandra.db.marshal.TimeUUIDTypeTest
    [junit] Tests run: 4, Failures: 0, Errors: 0, Time elapsed: 0.181 sec
    [junit] 
    [junit] Cobertura: Loaded information on 932 classes.
    [junit] Cobertura: Saved information on 932 classes.
    [junit] Testsuite: org.apache.cassandra.db.marshal.TypeCompareTest
    [junit] Tests run: 5, Failures: 0, Errors: 0, Time elapsed: 0.247 sec
    [junit] 
    [junit] Cobertura: Loaded information on 932 classes.
    [junit] Cobertura: Saved information on 932 classes.
    [junit] Testsuite: org.apache.cassandra.dht.BootStrapperTest
    [junit] Tests run: 4, Failures: 0, Errors: 0, Time elapsed: 2.563 sec
    [junit] 
    [junit] Cobertura: Loaded information on 932 classes.
    [junit] Cobertura: Saved information on 932 classes.
    [junit] Testsuite: org.apache.cassandra.dht.BoundsTest
    [junit] Tests run: 4, Failures: 0, Errors: 0, Time elapsed: 0.464 sec
    [junit] 
    [junit] Cobertura: Loaded information on 932 classes.
    [junit] Cobertura: Saved information on 932 classes.
    [junit] Testsuite: org.apache.cassandra.dht.ByteOrderedPartitionerTest
    [junit] Tests run: 5, Failures: 0, Errors: 0, Time elapsed: 11.831 sec
    [junit] 
    [junit] Cobertura: Loaded information on 932 classes.
    [junit] Cobertura: Saved information on 932 classes.
    [junit] Testsuite: org.apache.cassandra.dht.CollatingOrderPreservingPartitionerTest
    [junit] Tests run: 7, Failures: 0, Errors: 0, Time elapsed: 14.052 sec
    [junit] 
    [junit] Cobertura: Loaded information on 932 classes.
    [junit] Cobertura: Saved information on 932 classes.
    [junit] Testsuite: org.apache.cassandra.dht.OrderPreservingPartitionerTest
    [junit] Tests run: 6, Failures: 0, Errors: 0, Time elapsed: 8.041 sec
    [junit] 
    [junit] Cobertura: Loaded information on 932 classes.
    [junit] Cobertura: Saved information on 932 classes.
    [junit] Testsuite: org.apache.cassandra.dht.RandomPartitionerTest
    [junit] Tests run: 5, Failures: 0, Errors: 0, Time elapsed: 3.462 sec
    [junit] 
    [junit] Cobertura: Loaded information on 932 classes.
    [junit] Cobertura: Saved information on 932 classes.
    [junit] Testsuite: org.apache.cassandra.dht.RangeTest
    [junit] Tests run: 12, Failures: 0, Errors: 0, Time elapsed: 0.484 sec
    [junit] 
    [junit] Cobertura: Loaded information on 932 classes.
    [junit] Cobertura: Saved information on 932 classes.
    [junit] Testsuite: org.apache.cassandra.gms.ArrivalWindowTest
    [junit] Tests run: 1, Failures: 0, Errors: 0, Time elapsed: 0.132 sec
    [junit] 
    [junit] Cobertura: Loaded information on 932 classes.
    [junit] Cobertura: Saved information on 932 classes.
    [junit] Testsuite: org.apache.cassandra.gms.GossipDigestTest
    [junit] Tests run: 1, Failures: 0, Errors: 0, Time elapsed: 0.066 sec
    [junit] 
    [junit] Cobertura: Loaded information on 932 classes.
    [junit] Cobertura: Saved information on 932 classes.
    [junit] Testsuite: org.apache.cassandra.hadoop.ColumnFamilyInputFormatTest
    [junit] Tests run: 1, Failures: 0, Errors: 0, Time elapsed: 0.218 sec
    [junit] 
    [junit] Cobertura: Loaded information on 932 classes.
    [junit] Cobertura: Saved information on 932 classes.
    [junit] Testsuite: org.apache.cassandra.hadoop.ColumnFamilyOutputFormatTest
    [junit] Tests run: 1, Failures: 0, Errors: 0, Time elapsed: 5.349 sec
    [junit] 
    [junit] ------------- Standard Error -----------------
    [junit]  WARN 12:43:06,217 Unknown mlockall error 0
    [junit] ------------- ---------------- ---------------
    [junit] Cobertura: Loaded information on 932 classes.
    [junit] Cobertura: Saved information on 932 classes.
    [junit] Testsuite: org.apache.cassandra.io.BloomFilterTrackerTest
    [junit] Tests run: 3, Failures: 0, Errors: 0, Time elapsed: 0.413 sec
    [junit] 
    [junit] Cobertura: Loaded information on 932 classes.
    [junit] Cobertura: Saved information on 932 classes.
    [junit] Testsuite: org.apache.cassandra.io.LazilyCompactedRowTest
    [junit] Tests run: 5, Failures: 0, Errors: 0, Time elapsed: 2.434 sec
    [junit] 
    [junit] Cobertura: Loaded information on 932 classes.
    [junit] Cobertura: Saved information on 932 classes.
    [junit] Testsuite: org.apache.cassandra.io.sstable.LegacySSTableTest
    [junit] Tests run: 1, Failures: 0, Errors: 0, Time elapsed: 3.652 sec
    [junit] 
    [junit] Cobertura: Loaded information on 932 classes.
    [junit] Cobertura: Saved information on 932 classes.
    [junit] Testsuite: org.apache.cassandra.io.sstable.SSTableReaderTest
    [junit] Tests run: 3, Failures: 0, Errors: 0, Time elapsed: 1.365 sec
    [junit] 
    [junit] Cobertura: Loaded information on 932 classes.
    [junit] Cobertura: Saved information on 932 classes.
    [junit] Testsuite: org.apache.cassandra.io.sstable.SSTableTest
    [junit] Tests run: 2, Failures: 0, Errors: 0, Time elapsed: 6.682 sec
    [junit] 
    [junit] Cobertura: Loaded information on 932 classes.
    [junit] Cobertura: Saved information on 932 classes.
    [junit] Testsuite: org.apache.cassandra.io.sstable.SSTableWriterTest
    [junit] Tests run: 1, Failures: 0, Errors: 0, Time elapsed: 0.68 sec
    [junit] 
    [junit] Cobertura: Loaded information on 932 classes.
    [junit] Cobertura: Saved information on 932 classes.
    [junit] Testsuite: org.apache.cassandra.io.util.BufferedRandomAccessFileTest
    [junit] Tests run: 4, Failures: 0, Errors: 0, Time elapsed: 0.107 sec
    [junit] 
    [junit] Cobertura: Loaded information on 932 classes.
    [junit] Cobertura: Saved information on 932 classes.
    [junit] Testsuite: org.apache.cassandra.locator.DynamicEndpointSnitchTest
    [junit] Tests run: 1, Failures: 0, Errors: 0, Time elapsed: 1.136 sec
    [junit] 
    [junit] Cobertura: Loaded information on 932 classes.
    [junit] Cobertura: Saved information on 932 classes.
    [junit] Testsuite: org.apache.cassandra.locator.NetworkTopologyStrategyTest
    [junit] Tests run: 1, Failures: 0, Errors: 0, Time elapsed: 0.188 sec
    [junit] 
    [junit] Cobertura: Loaded information on 932 classes.
    [junit] Cobertura: Saved information on 932 classes.
    [junit] Testsuite: org.apache.cassandra.locator.OldNetworkTopologyStrategyTest
    [junit] Tests run: 3, Failures: 0, Errors: 0, Time elapsed: 0.36 sec
    [junit] 
    [junit] Cobertura: Loaded information on 932 classes.
    [junit] Cobertura: Saved information on 932 classes.
    [junit] Testsuite: org.apache.cassandra.locator.ReplicationStrategyEndpointCacheTest
    [junit] Tests run: 2, Failures: 0, Errors: 0, Time elapsed: 0.505 sec
    [junit] 
    [junit] Cobertura: Loaded information on 932 classes.
    [junit] Cobertura: Saved information on 932 classes.
    [junit] Testsuite: org.apache.cassandra.locator.SimpleStrategyTest
    [junit] Tests run: 4, Failures: 0, Errors: 0, Time elapsed: 0.563 sec
    [junit] 
    [junit] Cobertura: Loaded information on 932 classes.
    [junit] Cobertura: Saved information on 932 classes.
    [junit] Testsuite: org.apache.cassandra.service.AntiEntropyServiceTest
    [junit] Tests run: 7, Failures: 0, Errors: 0, Time elapsed: 3.713 sec
    [junit] 
    [junit] Cobertura: Loaded information on 932 classes.
    [junit] Cobertura: Saved information on 932 classes.
    [junit] Testsuite: org.apache.cassandra.service.CassandraServerTest
    [junit] Tests run: 1, Failures: 0, Errors: 0, Time elapsed: 0.405 sec
    [junit] 
    [junit] Cobertura: Loaded information on 932 classes.
    [junit] Cobertura: Saved information on 932 classes.
    [junit] Testsuite: org.apache.cassandra.service.EmbeddedCassandraServiceTest
    [junit] Tests run: 1, Failures: 0, Errors: 0, Time elapsed: 1.023 sec
    [junit] 
    [junit] ------------- Standard Error -----------------
    [junit]  WARN 12:44:22,170 Unknown mlockall error 0
    [junit] ------------- ---------------- ---------------
    [junit] Cobertura: Loaded information on 932 classes.
    [junit] Cobertura: Saved information on 932 classes.
    [junit] Testsuite: org.apache.cassandra.service.MoveTest
    [junit] Tests run: 6, Failures: 0, Errors: 0, Time elapsed: 1.383 sec
    [junit] 
    [junit] ------------- Standard Error -----------------
    [junit]  WARN 12:44:27,464 Node /127.0.0.3 'leaving' token mismatch. Long network partition?
    [junit] ------------- ---------------- ---------------
    [junit] Cobertura: Loaded information on 932 classes.
    [junit] Cobertura: Saved information on 932 classes.
    [junit] Testsuite: org.apache.cassandra.service.ReadResponseResolverTest
    [junit] Tests run: 5, Failures: 0, Errors: 0, Time elapsed: 0.498 sec
    [junit] 
    [junit] Cobertura: Loaded information on 932 classes.
    [junit] Cobertura: Saved information on 932 classes.
    [junit] Testsuite: org.apache.cassandra.service.StorageServiceClientTest
    [junit] Tests run: 1, Failures: 0, Errors: 0, Time elapsed: 5.505 sec
    [junit] 
    [junit] Cobertura: Loaded information on 932 classes.
    [junit] Cobertura: Saved information on 932 classes.
    [junit] Testsuite: org.apache.cassandra.service.StorageServiceServerTest
    [junit] Tests run: 3, Failures: 0, Errors: 0, Time elapsed: 0.813 sec
    [junit] 
    [junit] Cobertura: Loaded information on 932 classes.
    [junit] Cobertura: Saved information on 932 classes.
    [junit] Testsuite: org.apache.cassandra.streaming.BootstrapTest
    [junit] Tests run: 1, Failures: 0, Errors: 0, Time elapsed: 0.559 sec
    [junit] 
    [junit] Cobertura: Loaded information on 932 classes.
    [junit] Cobertura: Saved information on 932 classes.
    [junit] Testsuite: org.apache.cassandra.streaming.StreamingTransferTest
    [junit] Testsuite: org.apache.cassandra.streaming.StreamingTransferTest
    [junit] Tests run: 1, Failures: 0, Errors: 1, Time elapsed: 0 sec
    [junit] 
    [junit] Testcase: org.apache.cassandra.streaming.StreamingTransferTest:testTransferTable:
Caused an ERROR
    [junit] Timeout occurred. Please note the time in the report does not reflect the time
until the timeout.
    [junit] junit.framework.AssertionFailedError: Timeout occurred. Please note the time in
the report does not reflect the time until the timeout.
    [junit] 
    [junit] 
    [junit] Test org.apache.cassandra.streaming.StreamingTransferTest FAILED (timeout)
    [junit] Testsuite: org.apache.cassandra.tools.SSTableExportTest
    [junit] Tests run: 4, Failures: 0, Errors: 0, Time elapsed: 0.724 sec
    [junit] 
    [junit] Cobertura: Loaded information on 932 classes.
    [junit] Cobertura: Saved information on 932 classes.
    [junit] Testsuite: org.apache.cassandra.tools.SSTableImportTest
    [junit] Tests run: 2, Failures: 0, Errors: 0, Time elapsed: 0.616 sec
    [junit] 
    [junit] Cobertura: Loaded information on 932 classes.
    [junit] Cobertura: Saved information on 932 classes.
    [junit] Testsuite: org.apache.cassandra.utils.BloomFilterTest
    [junit] Tests run: 6, Failures: 0, Errors: 0, Time elapsed: 3.415 sec
    [junit] 
    [junit] Cobertura: Loaded information on 932 classes.
    [junit] Cobertura: Saved information on 932 classes.
    [junit] Testsuite: org.apache.cassandra.utils.BoundedStatsDequeTest
    [junit] Tests run: 1, Failures: 0, Errors: 0, Time elapsed: 0.067 sec
    [junit] 
    [junit] Cobertura: Loaded information on 932 classes.
    [junit] Cobertura: Saved information on 932 classes.
    [junit] Testsuite: org.apache.cassandra.utils.EstimatedHistogramTest
    [junit] Tests run: 1, Failures: 0, Errors: 0, Time elapsed: 0.082 sec
    [junit] 
    [junit] Cobertura: Loaded information on 932 classes.
    [junit] Cobertura: Saved information on 932 classes.
    [junit] Testsuite: org.apache.cassandra.utils.FBUtilitiesTest
    [junit] Tests run: 5, Failures: 0, Errors: 0, Time elapsed: 0.168 sec
    [junit] 
    [junit] Cobertura: Loaded information on 932 classes.
    [junit] Cobertura: Saved information on 932 classes.
    [junit] Testsuite: org.apache.cassandra.utils.FilterTest
    [junit] Tests run: 1, Failures: 0, Errors: 0, Time elapsed: 2.035 sec
    [junit] 
    [junit] Cobertura: Loaded information on 932 classes.
    [junit] Cobertura: Saved information on 932 classes.
    [junit] Testsuite: org.apache.cassandra.utils.MerkleTreeTest
    [junit] Tests run: 14, Failures: 0, Errors: 0, Time elapsed: 0.613 sec
    [junit] 
    [junit] Cobertura: Loaded information on 932 classes.
    [junit] Cobertura: Saved information on 932 classes.

BUILD FAILED
<https://hudson.apache.org/hudson/job/Cassandra/ws/cassandra/build.xml>:436: The following
error occurred while executing this line:
<https://hudson.apache.org/hudson/job/Cassandra/ws/cassandra/build.xml>:431: Some unit
test(s) failed.

Total time: 15 minutes 14 seconds
[TASKS] Skipping publisher since build result is FAILURE
Publishing Javadoc
Archiving artifacts
Recording test results
Skipping Cobertura coverage report as build was not UNSTABLE or better ...


Mime
View raw message