incubator-cassandra-dev mailing list archives

Site index · List index
Message view « Date » · « Thread »
Top « Date » · « Thread »
From Apache Hudson Server <hud...@hudson.apache.org>
Subject Build failed in Hudson: Cassandra #530
Date Mon, 06 Sep 2010 13:15:20 GMT
See <https://hudson.apache.org/hudson/job/Cassandra/530/>

------------------------------------------
[...truncated 1535 lines...]
    [junit] Tests run: 2, Failures: 0, Errors: 0, Time elapsed: 0.128 sec
    [junit] 
    [junit] Cobertura: Loaded information on 932 classes.
    [junit] Cobertura: Saved information on 932 classes.
    [junit] Testsuite: org.apache.cassandra.db.commitlog.CommitLogHeaderTest
    [junit] Tests run: 2, Failures: 0, Errors: 0, Time elapsed: 0.568 sec
    [junit] 
    [junit] Cobertura: Loaded information on 932 classes.
    [junit] Cobertura: Saved information on 932 classes.
    [junit] Testsuite: org.apache.cassandra.db.marshal.IntegerTypeTest
    [junit] Tests run: 10, Failures: 0, Errors: 0, Time elapsed: 1.406 sec
    [junit] 
    [junit] Cobertura: Loaded information on 932 classes.
    [junit] Cobertura: Saved information on 932 classes.
    [junit] Testsuite: org.apache.cassandra.db.marshal.TimeUUIDTypeTest
    [junit] Tests run: 4, Failures: 0, Errors: 0, Time elapsed: 0.188 sec
    [junit] 
    [junit] Cobertura: Loaded information on 932 classes.
    [junit] Cobertura: Saved information on 932 classes.
    [junit] Testsuite: org.apache.cassandra.db.marshal.TypeCompareTest
    [junit] Tests run: 5, Failures: 0, Errors: 0, Time elapsed: 0.272 sec
    [junit] 
    [junit] Cobertura: Loaded information on 932 classes.
    [junit] Cobertura: Saved information on 932 classes.
    [junit] Testsuite: org.apache.cassandra.dht.BootStrapperTest
    [junit] Tests run: 4, Failures: 0, Errors: 0, Time elapsed: 2.964 sec
    [junit] 
    [junit] Cobertura: Loaded information on 932 classes.
    [junit] Cobertura: Saved information on 932 classes.
    [junit] Testsuite: org.apache.cassandra.dht.BoundsTest
    [junit] Tests run: 4, Failures: 0, Errors: 0, Time elapsed: 0.461 sec
    [junit] 
    [junit] Cobertura: Loaded information on 932 classes.
    [junit] Cobertura: Saved information on 932 classes.
    [junit] Testsuite: org.apache.cassandra.dht.ByteOrderedPartitionerTest
    [junit] Tests run: 5, Failures: 0, Errors: 0, Time elapsed: 12.128 sec
    [junit] 
    [junit] Cobertura: Loaded information on 932 classes.
    [junit] Cobertura: Saved information on 932 classes.
    [junit] Testsuite: org.apache.cassandra.dht.CollatingOrderPreservingPartitionerTest
    [junit] Tests run: 7, Failures: 0, Errors: 0, Time elapsed: 14.878 sec
    [junit] 
    [junit] Cobertura: Loaded information on 932 classes.
    [junit] Cobertura: Saved information on 932 classes.
    [junit] Testsuite: org.apache.cassandra.dht.OrderPreservingPartitionerTest
    [junit] Tests run: 6, Failures: 0, Errors: 0, Time elapsed: 8.465 sec
    [junit] 
    [junit] Cobertura: Loaded information on 932 classes.
    [junit] Cobertura: Saved information on 932 classes.
    [junit] Testsuite: org.apache.cassandra.dht.RandomPartitionerTest
    [junit] Tests run: 5, Failures: 0, Errors: 0, Time elapsed: 3.684 sec
    [junit] 
    [junit] Cobertura: Loaded information on 932 classes.
    [junit] Cobertura: Saved information on 932 classes.
    [junit] Testsuite: org.apache.cassandra.dht.RangeTest
    [junit] Tests run: 12, Failures: 0, Errors: 0, Time elapsed: 0.544 sec
    [junit] 
    [junit] Cobertura: Loaded information on 932 classes.
    [junit] Cobertura: Saved information on 932 classes.
    [junit] Testsuite: org.apache.cassandra.gms.ArrivalWindowTest
    [junit] Tests run: 1, Failures: 0, Errors: 0, Time elapsed: 0.146 sec
    [junit] 
    [junit] Cobertura: Loaded information on 932 classes.
    [junit] Cobertura: Saved information on 932 classes.
    [junit] Testsuite: org.apache.cassandra.gms.GossipDigestTest
    [junit] Tests run: 1, Failures: 0, Errors: 0, Time elapsed: 0.069 sec
    [junit] 
    [junit] Cobertura: Loaded information on 932 classes.
    [junit] Cobertura: Saved information on 932 classes.
    [junit] Testsuite: org.apache.cassandra.hadoop.ColumnFamilyInputFormatTest
    [junit] Tests run: 1, Failures: 0, Errors: 0, Time elapsed: 0.219 sec
    [junit] 
    [junit] Cobertura: Loaded information on 932 classes.
    [junit] Cobertura: Saved information on 932 classes.
    [junit] Testsuite: org.apache.cassandra.hadoop.ColumnFamilyOutputFormatTest
    [junit] Tests run: 1, Failures: 0, Errors: 0, Time elapsed: 5.583 sec
    [junit] 
    [junit] ------------- Standard Error -----------------
    [junit]  WARN 13:11:21,219 Unknown mlockall error 0
    [junit] ------------- ---------------- ---------------
    [junit] Cobertura: Loaded information on 932 classes.
    [junit] Cobertura: Saved information on 932 classes.
    [junit] Testsuite: org.apache.cassandra.io.BloomFilterTrackerTest
    [junit] Tests run: 3, Failures: 0, Errors: 0, Time elapsed: 0.428 sec
    [junit] 
    [junit] Cobertura: Loaded information on 932 classes.
    [junit] Cobertura: Saved information on 932 classes.
    [junit] Testsuite: org.apache.cassandra.io.LazilyCompactedRowTest
    [junit] Tests run: 5, Failures: 0, Errors: 0, Time elapsed: 2.838 sec
    [junit] 
    [junit] Cobertura: Loaded information on 932 classes.
    [junit] Cobertura: Saved information on 932 classes.
    [junit] Testsuite: org.apache.cassandra.io.sstable.LegacySSTableTest
    [junit] Tests run: 1, Failures: 0, Errors: 0, Time elapsed: 3.855 sec
    [junit] 
    [junit] Cobertura: Loaded information on 932 classes.
    [junit] Cobertura: Saved information on 932 classes.
    [junit] Testsuite: org.apache.cassandra.io.sstable.SSTableReaderTest
    [junit] Tests run: 3, Failures: 0, Errors: 0, Time elapsed: 1.422 sec
    [junit] 
    [junit] Cobertura: Loaded information on 932 classes.
    [junit] Cobertura: Saved information on 932 classes.
    [junit] Testsuite: org.apache.cassandra.io.sstable.SSTableTest
    [junit] Tests run: 2, Failures: 0, Errors: 0, Time elapsed: 7.116 sec
    [junit] 
    [junit] Cobertura: Loaded information on 932 classes.
    [junit] Cobertura: Saved information on 932 classes.
    [junit] Testsuite: org.apache.cassandra.io.sstable.SSTableWriterTest
    [junit] Tests run: 1, Failures: 0, Errors: 0, Time elapsed: 0.766 sec
    [junit] 
    [junit] Cobertura: Loaded information on 932 classes.
    [junit] Cobertura: Saved information on 932 classes.
    [junit] Testsuite: org.apache.cassandra.io.util.BufferedRandomAccessFileTest
    [junit] Tests run: 4, Failures: 0, Errors: 0, Time elapsed: 0.143 sec
    [junit] 
    [junit] Cobertura: Loaded information on 932 classes.
    [junit] Cobertura: Saved information on 932 classes.
    [junit] Testsuite: org.apache.cassandra.locator.DynamicEndpointSnitchTest
    [junit] Tests run: 1, Failures: 0, Errors: 0, Time elapsed: 1.162 sec
    [junit] 
    [junit] Cobertura: Loaded information on 932 classes.
    [junit] Cobertura: Saved information on 932 classes.
    [junit] Testsuite: org.apache.cassandra.locator.NetworkTopologyStrategyTest
    [junit] Tests run: 1, Failures: 0, Errors: 0, Time elapsed: 0.194 sec
    [junit] 
    [junit] Cobertura: Loaded information on 932 classes.
    [junit] Cobertura: Saved information on 932 classes.
    [junit] Testsuite: org.apache.cassandra.locator.OldNetworkTopologyStrategyTest
    [junit] Tests run: 3, Failures: 0, Errors: 0, Time elapsed: 0.384 sec
    [junit] 
    [junit] Cobertura: Loaded information on 932 classes.
    [junit] Cobertura: Saved information on 932 classes.
    [junit] Testsuite: org.apache.cassandra.locator.ReplicationStrategyEndpointCacheTest
    [junit] Tests run: 2, Failures: 0, Errors: 0, Time elapsed: 0.598 sec
    [junit] 
    [junit] Cobertura: Loaded information on 932 classes.
    [junit] Cobertura: Saved information on 932 classes.
    [junit] Testsuite: org.apache.cassandra.locator.SimpleStrategyTest
    [junit] Tests run: 4, Failures: 0, Errors: 0, Time elapsed: 0.614 sec
    [junit] 
    [junit] Cobertura: Loaded information on 932 classes.
    [junit] Cobertura: Saved information on 932 classes.
    [junit] Testsuite: org.apache.cassandra.service.AntiEntropyServiceTest
    [junit] Tests run: 7, Failures: 0, Errors: 0, Time elapsed: 3.964 sec
    [junit] 
    [junit] Cobertura: Loaded information on 932 classes.
    [junit] Cobertura: Saved information on 932 classes.
    [junit] Testsuite: org.apache.cassandra.service.CassandraServerTest
    [junit] Tests run: 1, Failures: 0, Errors: 0, Time elapsed: 0.415 sec
    [junit] 
    [junit] Cobertura: Loaded information on 932 classes.
    [junit] Cobertura: Saved information on 932 classes.
    [junit] Testsuite: org.apache.cassandra.service.EmbeddedCassandraServiceTest
    [junit] Tests run: 1, Failures: 0, Errors: 0, Time elapsed: 1.053 sec
    [junit] 
    [junit] ------------- Standard Error -----------------
    [junit]  WARN 13:12:48,031 Unknown mlockall error 0
    [junit] ------------- ---------------- ---------------
    [junit] Cobertura: Loaded information on 932 classes.
    [junit] Cobertura: Saved information on 932 classes.
    [junit] Testsuite: org.apache.cassandra.service.MoveTest
    [junit] Tests run: 6, Failures: 0, Errors: 0, Time elapsed: 1.333 sec
    [junit] 
    [junit] ------------- Standard Error -----------------
    [junit]  WARN 13:12:53,309 Node /127.0.0.3 'leaving' token mismatch. Long network partition?
    [junit] ------------- ---------------- ---------------
    [junit] Cobertura: Loaded information on 932 classes.
    [junit] Cobertura: Saved information on 932 classes.
    [junit] Testsuite: org.apache.cassandra.service.ReadResponseResolverTest
    [junit] Tests run: 5, Failures: 0, Errors: 0, Time elapsed: 0.499 sec
    [junit] 
    [junit] Cobertura: Loaded information on 932 classes.
    [junit] Cobertura: Saved information on 932 classes.
    [junit] Testsuite: org.apache.cassandra.service.StorageServiceClientTest
    [junit] Tests run: 1, Failures: 0, Errors: 0, Time elapsed: 5.553 sec
    [junit] 
    [junit] Cobertura: Loaded information on 932 classes.
    [junit] Cobertura: Saved information on 932 classes.
    [junit] Testsuite: org.apache.cassandra.service.StorageServiceServerTest
    [junit] Tests run: 3, Failures: 0, Errors: 0, Time elapsed: 0.842 sec
    [junit] 
    [junit] Cobertura: Loaded information on 932 classes.
    [junit] Cobertura: Saved information on 932 classes.
    [junit] Testsuite: org.apache.cassandra.streaming.BootstrapTest
    [junit] Tests run: 1, Failures: 0, Errors: 0, Time elapsed: 0.582 sec
    [junit] 
    [junit] Cobertura: Loaded information on 932 classes.
    [junit] Cobertura: Saved information on 932 classes.
    [junit] Testsuite: org.apache.cassandra.streaming.StreamingTransferTest
    [junit] Testsuite: org.apache.cassandra.streaming.StreamingTransferTest
    [junit] Tests run: 1, Failures: 0, Errors: 1, Time elapsed: 0 sec
    [junit] 
    [junit] Testcase: org.apache.cassandra.streaming.StreamingTransferTest:testTransferTable:
Caused an ERROR
    [junit] Timeout occurred. Please note the time in the report does not reflect the time
until the timeout.
    [junit] junit.framework.AssertionFailedError: Timeout occurred. Please note the time in
the report does not reflect the time until the timeout.
    [junit] 
    [junit] 
    [junit] Test org.apache.cassandra.streaming.StreamingTransferTest FAILED (timeout)
    [junit] Testsuite: org.apache.cassandra.tools.SSTableExportTest
    [junit] Tests run: 4, Failures: 0, Errors: 0, Time elapsed: 0.704 sec
    [junit] 
    [junit] Cobertura: Loaded information on 932 classes.
    [junit] Cobertura: Saved information on 932 classes.
    [junit] Testsuite: org.apache.cassandra.tools.SSTableImportTest
    [junit] Tests run: 2, Failures: 0, Errors: 0, Time elapsed: 0.669 sec
    [junit] 
    [junit] Cobertura: Loaded information on 932 classes.
    [junit] Cobertura: Saved information on 932 classes.
    [junit] Testsuite: org.apache.cassandra.utils.BloomFilterTest
    [junit] Tests run: 6, Failures: 0, Errors: 0, Time elapsed: 3.427 sec
    [junit] 
    [junit] Cobertura: Loaded information on 932 classes.
    [junit] Cobertura: Saved information on 932 classes.
    [junit] Testsuite: org.apache.cassandra.utils.BoundedStatsDequeTest
    [junit] Tests run: 1, Failures: 0, Errors: 0, Time elapsed: 0.068 sec
    [junit] 
    [junit] Cobertura: Loaded information on 932 classes.
    [junit] Cobertura: Saved information on 932 classes.
    [junit] Testsuite: org.apache.cassandra.utils.EstimatedHistogramTest
    [junit] Tests run: 1, Failures: 0, Errors: 0, Time elapsed: 0.082 sec
    [junit] 
    [junit] Cobertura: Loaded information on 932 classes.
    [junit] Cobertura: Saved information on 932 classes.
    [junit] Testsuite: org.apache.cassandra.utils.FBUtilitiesTest
    [junit] Tests run: 5, Failures: 0, Errors: 0, Time elapsed: 0.171 sec
    [junit] 
    [junit] Cobertura: Loaded information on 932 classes.
    [junit] Cobertura: Saved information on 932 classes.
    [junit] Testsuite: org.apache.cassandra.utils.FilterTest
    [junit] Tests run: 1, Failures: 0, Errors: 0, Time elapsed: 2.044 sec
    [junit] 
    [junit] Cobertura: Loaded information on 932 classes.
    [junit] Cobertura: Saved information on 932 classes.
    [junit] Testsuite: org.apache.cassandra.utils.MerkleTreeTest
    [junit] Tests run: 14, Failures: 0, Errors: 0, Time elapsed: 0.642 sec
    [junit] 
    [junit] Cobertura: Loaded information on 932 classes.
    [junit] Cobertura: Saved information on 932 classes.

BUILD FAILED
<https://hudson.apache.org/hudson/job/Cassandra/ws/cassandra/build.xml>:436: The following
error occurred while executing this line:
<https://hudson.apache.org/hudson/job/Cassandra/ws/cassandra/build.xml>:431: Some unit
test(s) failed.

Total time: 15 minutes 35 seconds
[TASKS] Skipping publisher since build result is FAILURE
Publishing Javadoc
Archiving artifacts
Recording test results
Skipping Cobertura coverage report as build was not UNSTABLE or better ...


Mime
View raw message