incubator-cassandra-dev mailing list archives

Site index · List index
Message view « Date » · « Thread »
Top « Date » · « Thread »
From Apache Hudson Server <hud...@hudson.apache.org>
Subject Build failed in Hudson: Cassandra #520
Date Thu, 26 Aug 2010 06:23:21 GMT
See <https://hudson.apache.org/hudson/job/Cassandra/520/changes>

Changes:

[eevans] relocate src/cassandra.avpr to build/internode.avpr

Patch by eevans

[jbellis] Allow multiple mutations per key to arrive during individual write calls.  patch
by Stu Hood; reviewed by jbellis for CASSANDRA-1315

[jbellis] Use Avro objects as input to CFOutputFormat.  patch by Stu Hood; reviewed by jbellis
for CASSANDRA-1315

[eevans] Separate authentication and authorization into ClientState object

Patch by Stu Hood; reviewed by eevans for CASSANDRA-1237

[eevans] Add configuration for IAuthority, and handle SimpleAuthenticator upgraders

Patch by Stu Hood; reviewed by eevans for CASSANDRA-1237

[eevans] Factor out reflection-based class construction.

Patch by Stu Hood; reviewed by eevans for CASSANDRA-1237

[eevans] Add IAuthority, and split login into authenticate/authorize

Patch by Stu Hood; reviewed by eevans for CASSANDRA-1237

[eevans] Remove AccessLevel return value from login, since authorization will be moving to
call-time

Patch by Stu Hood; reviewed by eevans for CASSANDRA-1237

[jbellis] fix EH.max.  patch by jbellis and brandonwilliams for CASSANDRA-1413

[jbellis] Add CfDef.default_validation_class.  patch by jhermes; reviewed by jbellis for CASSANDRA-891

[jbellis] merge from 0.6

[jbellis] replace casts to ANTS with IEndpointSnitch, which incorporates all the rack/dc methods
now.  patch by jbellis; reviewed by Sylvain Lebresne for CASSANDRA-1429

[jbellis] extract newSystemTable method and r/m unused code in CFMetaData.  patch by jbellis

[jbellis] clean up column iterators, primarily replacing sstable w/ metadata in parameters.
 patch by jbellis

[jbellis] clean up SSTableNamesIterator and SSTableSliceIterator.  patch by jbellis

[jbellis] add XX:CMSInitiatingOccupancyFraction=80 to default GC options; add comments to
thread priority options.  patch by jbellis

[jbellis] allow loading cassandra.yaml from url specified by cassandra.config system property.
 patch by jbellis; reviewed by gdusbabek for CASSANDRA-1126

[jbellis] remove keyspace argument from multiget_count.  patch by Jon Hermes; reviewed by
jbellis for CASSANDRA-1422

[gdusbabek] config-converter properly handles snitches and framed support. patch by Jon Hermes,
reivewed by Gary Dusbabek. CASSANDRA-1420

[gdusbabek] config-converter properly handles snitches and framed support. patch by Jon Hermes,
reivewed by Gary Dusbabek. CASSANDRA-1420

[jbellis] merge from 0.6

[brandonwilliams] Expose compaction thread priority in yaml, make default MIN_PRIORITY, add
needed JVM opts.  Patch by brandonwilliams, reviewed by jbellis for CASSANDRA-1181

------------------------------------------
[...truncated 1521 lines...]
    [junit] Cobertura: Loaded information on 911 classes.
    [junit] Cobertura: Saved information on 911 classes.
    [junit] Testsuite: org.apache.cassandra.db.clock.TimestampReconcilerTest
    [junit] Tests run: 2, Failures: 0, Errors: 0, Time elapsed: 0.125 sec
    [junit] 
    [junit] Cobertura: Loaded information on 911 classes.
    [junit] Cobertura: Saved information on 911 classes.
    [junit] Testsuite: org.apache.cassandra.db.commitlog.CommitLogHeaderTest
    [junit] Tests run: 3, Failures: 0, Errors: 0, Time elapsed: 0.467 sec
    [junit] 
    [junit] Cobertura: Loaded information on 911 classes.
    [junit] Cobertura: Saved information on 911 classes.
    [junit] Testsuite: org.apache.cassandra.db.marshal.IntegerTypeTest
    [junit] Tests run: 10, Failures: 0, Errors: 0, Time elapsed: 1.401 sec
    [junit] 
    [junit] Cobertura: Loaded information on 911 classes.
    [junit] Cobertura: Saved information on 911 classes.
    [junit] Testsuite: org.apache.cassandra.db.marshal.TimeUUIDTypeTest
    [junit] Tests run: 4, Failures: 0, Errors: 0, Time elapsed: 0.182 sec
    [junit] 
    [junit] Cobertura: Loaded information on 911 classes.
    [junit] Cobertura: Saved information on 911 classes.
    [junit] Testsuite: org.apache.cassandra.db.marshal.TypeCompareTest
    [junit] Tests run: 5, Failures: 0, Errors: 0, Time elapsed: 0.245 sec
    [junit] 
    [junit] Cobertura: Loaded information on 911 classes.
    [junit] Cobertura: Saved information on 911 classes.
    [junit] Testsuite: org.apache.cassandra.dht.BootStrapperTest
    [junit] Tests run: 4, Failures: 0, Errors: 0, Time elapsed: 2.646 sec
    [junit] 
    [junit] Cobertura: Loaded information on 911 classes.
    [junit] Cobertura: Saved information on 911 classes.
    [junit] Testsuite: org.apache.cassandra.dht.BoundsTest
    [junit] Tests run: 4, Failures: 0, Errors: 0, Time elapsed: 0.469 sec
    [junit] 
    [junit] Cobertura: Loaded information on 911 classes.
    [junit] Cobertura: Saved information on 911 classes.
    [junit] Testsuite: org.apache.cassandra.dht.ByteOrderedPartitionerTest
    [junit] Tests run: 5, Failures: 0, Errors: 0, Time elapsed: 11.839 sec
    [junit] 
    [junit] Cobertura: Loaded information on 911 classes.
    [junit] Cobertura: Saved information on 911 classes.
    [junit] Testsuite: org.apache.cassandra.dht.CollatingOrderPreservingPartitionerTest
    [junit] Tests run: 7, Failures: 0, Errors: 0, Time elapsed: 14.046 sec
    [junit] 
    [junit] Cobertura: Loaded information on 911 classes.
    [junit] Cobertura: Saved information on 911 classes.
    [junit] Testsuite: org.apache.cassandra.dht.OrderPreservingPartitionerTest
    [junit] Tests run: 6, Failures: 0, Errors: 0, Time elapsed: 8.123 sec
    [junit] 
    [junit] Cobertura: Loaded information on 911 classes.
    [junit] Cobertura: Saved information on 911 classes.
    [junit] Testsuite: org.apache.cassandra.dht.RandomPartitionerTest
    [junit] Tests run: 5, Failures: 0, Errors: 0, Time elapsed: 3.466 sec
    [junit] 
    [junit] Cobertura: Loaded information on 911 classes.
    [junit] Cobertura: Saved information on 911 classes.
    [junit] Testsuite: org.apache.cassandra.dht.RangeTest
    [junit] Tests run: 12, Failures: 0, Errors: 0, Time elapsed: 0.487 sec
    [junit] 
    [junit] Cobertura: Loaded information on 911 classes.
    [junit] Cobertura: Saved information on 911 classes.
    [junit] Testsuite: org.apache.cassandra.gms.ArrivalWindowTest
    [junit] Tests run: 1, Failures: 0, Errors: 0, Time elapsed: 0.133 sec
    [junit] 
    [junit] Cobertura: Loaded information on 911 classes.
    [junit] Cobertura: Saved information on 911 classes.
    [junit] Testsuite: org.apache.cassandra.gms.GossipDigestTest
    [junit] Tests run: 1, Failures: 0, Errors: 0, Time elapsed: 0.067 sec
    [junit] 
    [junit] Cobertura: Loaded information on 911 classes.
    [junit] Cobertura: Saved information on 911 classes.
    [junit] Testsuite: org.apache.cassandra.hadoop.ColumnFamilyInputFormatTest
    [junit] Tests run: 1, Failures: 0, Errors: 0, Time elapsed: 0.212 sec
    [junit] 
    [junit] Cobertura: Loaded information on 911 classes.
    [junit] Cobertura: Saved information on 911 classes.
    [junit] Testsuite: org.apache.cassandra.hadoop.ColumnFamilyOutputFormatTest
    [junit] Tests run: 1, Failures: 0, Errors: 0, Time elapsed: 5.295 sec
    [junit] 
    [junit] ------------- Standard Error -----------------
    [junit]  WARN 06:20:26,769 Unknown mlockall error 0
    [junit] ------------- ---------------- ---------------
    [junit] Cobertura: Loaded information on 911 classes.
    [junit] Cobertura: Saved information on 911 classes.
    [junit] Testsuite: org.apache.cassandra.io.BloomFilterTrackerTest
    [junit] Tests run: 3, Failures: 0, Errors: 0, Time elapsed: 0.403 sec
    [junit] 
    [junit] Cobertura: Loaded information on 911 classes.
    [junit] Cobertura: Saved information on 911 classes.
    [junit] Testsuite: org.apache.cassandra.io.LazilyCompactedRowTest
    [junit] Tests run: 5, Failures: 0, Errors: 0, Time elapsed: 5.81 sec
    [junit] 
    [junit] Cobertura: Loaded information on 911 classes.
    [junit] Cobertura: Saved information on 911 classes.
    [junit] Testsuite: org.apache.cassandra.io.sstable.LegacySSTableTest
    [junit] Tests run: 1, Failures: 0, Errors: 0, Time elapsed: 3.748 sec
    [junit] 
    [junit] Cobertura: Loaded information on 911 classes.
    [junit] Cobertura: Saved information on 911 classes.
    [junit] Testsuite: org.apache.cassandra.io.sstable.SSTableReaderTest
    [junit] Tests run: 3, Failures: 0, Errors: 0, Time elapsed: 1.622 sec
    [junit] 
    [junit] Cobertura: Loaded information on 911 classes.
    [junit] Cobertura: Saved information on 911 classes.
    [junit] Testsuite: org.apache.cassandra.io.sstable.SSTableTest
    [junit] Tests run: 2, Failures: 0, Errors: 0, Time elapsed: 6.993 sec
    [junit] 
    [junit] Cobertura: Loaded information on 911 classes.
    [junit] Cobertura: Saved information on 911 classes.
    [junit] Testsuite: org.apache.cassandra.io.sstable.SSTableWriterTest
    [junit] Tests run: 1, Failures: 0, Errors: 0, Time elapsed: 0.784 sec
    [junit] 
    [junit] Cobertura: Loaded information on 911 classes.
    [junit] Cobertura: Saved information on 911 classes.
    [junit] Testsuite: org.apache.cassandra.io.util.BufferedRandomAccessFileTest
    [junit] Tests run: 4, Failures: 0, Errors: 0, Time elapsed: 0.107 sec
    [junit] 
    [junit] Cobertura: Loaded information on 911 classes.
    [junit] Cobertura: Saved information on 911 classes.
    [junit] Testsuite: org.apache.cassandra.locator.DynamicEndpointSnitchTest
    [junit] Tests run: 1, Failures: 0, Errors: 0, Time elapsed: 1.138 sec
    [junit] 
    [junit] Cobertura: Loaded information on 911 classes.
    [junit] Cobertura: Saved information on 911 classes.
    [junit] Testsuite: org.apache.cassandra.locator.NetworkTopologyStrategyTest
    [junit] Tests run: 1, Failures: 0, Errors: 0, Time elapsed: 0.189 sec
    [junit] 
    [junit] Cobertura: Loaded information on 911 classes.
    [junit] Cobertura: Saved information on 911 classes.
    [junit] Testsuite: org.apache.cassandra.locator.OldNetworkTopologyStrategyTest
    [junit] Tests run: 3, Failures: 0, Errors: 0, Time elapsed: 0.359 sec
    [junit] 
    [junit] Cobertura: Loaded information on 911 classes.
    [junit] Cobertura: Saved information on 911 classes.
    [junit] Testsuite: org.apache.cassandra.locator.ReplicationStrategyEndpointCacheTest
    [junit] Tests run: 2, Failures: 0, Errors: 0, Time elapsed: 0.499 sec
    [junit] 
    [junit] Cobertura: Loaded information on 911 classes.
    [junit] Cobertura: Saved information on 911 classes.
    [junit] Testsuite: org.apache.cassandra.locator.SimpleStrategyTest
    [junit] Tests run: 4, Failures: 0, Errors: 0, Time elapsed: 0.564 sec
    [junit] 
    [junit] Cobertura: Loaded information on 911 classes.
    [junit] Cobertura: Saved information on 911 classes.
    [junit] Testsuite: org.apache.cassandra.service.AntiEntropyServiceTest
    [junit] Tests run: 7, Failures: 0, Errors: 0, Time elapsed: 3.84 sec
    [junit] 
    [junit] Cobertura: Loaded information on 911 classes.
    [junit] Cobertura: Saved information on 911 classes.
    [junit] Testsuite: org.apache.cassandra.service.CassandraServerTest
    [junit] Tests run: 1, Failures: 0, Errors: 0, Time elapsed: 0.401 sec
    [junit] 
    [junit] Cobertura: Loaded information on 911 classes.
    [junit] Cobertura: Saved information on 911 classes.
    [junit] Testsuite: org.apache.cassandra.service.EmbeddedCassandraServiceTest
    [junit] Tests run: 1, Failures: 0, Errors: 0, Time elapsed: 1.014 sec
    [junit] 
    [junit] ------------- Standard Error -----------------
    [junit]  WARN 06:21:46,849 Unknown mlockall error 0
    [junit] ------------- ---------------- ---------------
    [junit] Cobertura: Loaded information on 911 classes.
    [junit] Cobertura: Saved information on 911 classes.
    [junit] Testsuite: org.apache.cassandra.service.MoveTest
    [junit] Tests run: 6, Failures: 0, Errors: 0, Time elapsed: 1.37 sec
    [junit] 
    [junit] ------------- Standard Error -----------------
    [junit]  WARN 06:21:52,151 Node /127.0.0.3 'leaving' token mismatch. Long network partition?
    [junit] ------------- ---------------- ---------------
    [junit] Cobertura: Loaded information on 911 classes.
    [junit] Cobertura: Saved information on 911 classes.
    [junit] Testsuite: org.apache.cassandra.service.ReadResponseResolverTest
    [junit] Tests run: 5, Failures: 0, Errors: 0, Time elapsed: 0.52 sec
    [junit] 
    [junit] Cobertura: Loaded information on 911 classes.
    [junit] Cobertura: Saved information on 911 classes.
    [junit] Testsuite: org.apache.cassandra.service.StorageServiceClientTest
    [junit] Tests run: 1, Failures: 0, Errors: 0, Time elapsed: 5.516 sec
    [junit] 
    [junit] Cobertura: Loaded information on 911 classes.
    [junit] Cobertura: Saved information on 911 classes.
    [junit] Testsuite: org.apache.cassandra.service.StorageServiceServerTest
    [junit] Tests run: 3, Failures: 0, Errors: 0, Time elapsed: 0.817 sec
    [junit] 
    [junit] Cobertura: Loaded information on 911 classes.
    [junit] Cobertura: Saved information on 911 classes.
    [junit] Testsuite: org.apache.cassandra.streaming.BootstrapTest
    [junit] Tests run: 1, Failures: 0, Errors: 0, Time elapsed: 0.554 sec
    [junit] 
    [junit] Cobertura: Loaded information on 911 classes.
    [junit] Cobertura: Saved information on 911 classes.
    [junit] Testsuite: org.apache.cassandra.streaming.StreamingTransferTest
    [junit] Tests run: 2, Failures: 0, Errors: 0, Time elapsed: 0.753 sec
    [junit] 
    [junit] Cobertura: Loaded information on 911 classes.
    [junit] Cobertura: Saved information on 911 classes.
    [junit] Testsuite: org.apache.cassandra.tools.SSTableExportTest
    [junit] Tests run: 4, Failures: 0, Errors: 0, Time elapsed: 0.787 sec
    [junit] 
    [junit] Cobertura: Loaded information on 911 classes.
    [junit] Cobertura: Saved information on 911 classes.
    [junit] Testsuite: org.apache.cassandra.tools.SSTableImportTest
    [junit] Tests run: 2, Failures: 0, Errors: 0, Time elapsed: 0.778 sec
    [junit] 
    [junit] Cobertura: Loaded information on 911 classes.
    [junit] Cobertura: Saved information on 911 classes.
    [junit] Testsuite: org.apache.cassandra.utils.BloomFilterTest
    [junit] Tests run: 6, Failures: 0, Errors: 0, Time elapsed: 3.437 sec
    [junit] 
    [junit] Cobertura: Loaded information on 911 classes.
    [junit] Cobertura: Saved information on 911 classes.
    [junit] Testsuite: org.apache.cassandra.utils.BoundedStatsDequeTest
    [junit] Tests run: 1, Failures: 0, Errors: 0, Time elapsed: 0.069 sec
    [junit] 
    [junit] Cobertura: Loaded information on 911 classes.
    [junit] Cobertura: Saved information on 911 classes.
    [junit] Testsuite: org.apache.cassandra.utils.EstimatedHistogramTest
    [junit] Tests run: 1, Failures: 0, Errors: 0, Time elapsed: 0.082 sec
    [junit] 
    [junit] Cobertura: Loaded information on 911 classes.
    [junit] Cobertura: Saved information on 911 classes.
    [junit] Testsuite: org.apache.cassandra.utils.FBUtilitiesTest
    [junit] Tests run: 5, Failures: 0, Errors: 0, Time elapsed: 0.174 sec
    [junit] 
    [junit] Cobertura: Loaded information on 911 classes.
    [junit] Cobertura: Saved information on 911 classes.
    [junit] Testsuite: org.apache.cassandra.utils.FilterTest
    [junit] Tests run: 1, Failures: 0, Errors: 0, Time elapsed: 2.047 sec
    [junit] 
    [junit] Cobertura: Loaded information on 911 classes.
    [junit] Cobertura: Saved information on 911 classes.
    [junit] Testsuite: org.apache.cassandra.utils.MerkleTreeTest
    [junit] Tests run: 14, Failures: 0, Errors: 0, Time elapsed: 0.613 sec
    [junit] 
    [junit] Cobertura: Loaded information on 911 classes.
    [junit] Cobertura: Saved information on 911 classes.

BUILD FAILED
<https://hudson.apache.org/hudson/job/Cassandra/ws/cassandra/build.xml>:435: The following
error occurred while executing this line:
<https://hudson.apache.org/hudson/job/Cassandra/ws/cassandra/build.xml>:430: Some unit
test(s) failed.

Total time: 15 minutes 28 seconds
[TASKS] Skipping publisher since build result is FAILURE
Publishing Javadoc
Archiving artifacts
Recording test results
Skipping Cobertura coverage report as build was not UNSTABLE or better ...
Error updating JIRA issues. Saving issues for next build.
com.atlassian.jira.exception.DataAccessException: org.ofbiz.core.entity.GenericDataSourceException:
Unable to esablish a connection with the database. (Connection refused. Check that the hostname
and port are correct and that the postmaster is accepting TCP/IP connections.)


Mime
View raw message