incubator-cassandra-dev mailing list archives

Site index · List index
Message view « Date » · « Thread »
Top « Date » · « Thread »
From Apache Hudson Server <hud...@hudson.zones.apache.org>
Subject Build failed in Hudson: Cassandra #440
Date Wed, 19 May 2010 12:41:38 GMT
See <http://hudson.zones.apache.org/hudson/job/Cassandra/440/changes>

Changes:

[jbellis] log warning if we overwrite the ip associated with a token with another.  patch
by Stu Hood; reviewed by jbellis for CASSANDRA-872

[jbellis] fix DSS to generate unique racks when possible
patch by jbellis; reviewed by Jeremy Hanna for CASSANDRA-1103

[jbellis] simplify out doneDataCenterIter variable
patch by jbellis; reviewed by Jeremy Hanna for CASSANDRA-1103

[jbellis] clean up DSS: inline getNaturalEndpointsInternal, remove reload-on-every-call, r/m
redundant dcEndpints variable
patch by jbellis; reviewed by Jeremy Hanna for CASSANDRA-1103

[eevans] renamed get_api_version to describe_version (avro)

Patch by eevans

[eevans] avro implementation of describe_cluster_name()

Patch by eevans

------------------------------------------
[...truncated 1229 lines...]
    [junit] 
    [junit] Cobertura: Loaded information on 794 classes.
    [junit] Cobertura: Saved information on 794 classes.
    [junit] Testsuite: org.apache.cassandra.db.RemoveColumnTest
    [junit] Tests run: 1, Failures: 0, Errors: 0, Time elapsed: 1.19 sec
    [junit] 
    [junit] Cobertura: Loaded information on 794 classes.
    [junit] Cobertura: Saved information on 794 classes.
    [junit] Testsuite: org.apache.cassandra.db.RemoveSubColumnTest
    [junit] Tests run: 1, Failures: 0, Errors: 0, Time elapsed: 1.155 sec
    [junit] 
    [junit] Cobertura: Loaded information on 794 classes.
    [junit] Cobertura: Saved information on 794 classes.
    [junit] Testsuite: org.apache.cassandra.db.RemoveSuperColumnTest
    [junit] Tests run: 4, Failures: 0, Errors: 0, Time elapsed: 1.338 sec
    [junit] 
    [junit] Cobertura: Loaded information on 794 classes.
    [junit] Cobertura: Saved information on 794 classes.
    [junit] Testsuite: org.apache.cassandra.db.RowTest
    [junit] Tests run: 3, Failures: 0, Errors: 0, Time elapsed: 0.486 sec
    [junit] 
    [junit] Cobertura: Loaded information on 794 classes.
    [junit] Cobertura: Saved information on 794 classes.
    [junit] Testsuite: org.apache.cassandra.db.SuperColumnTest
    [junit] Tests run: 1, Failures: 0, Errors: 0, Time elapsed: 0.146 sec
    [junit] 
    [junit] Cobertura: Loaded information on 794 classes.
    [junit] Cobertura: Saved information on 794 classes.
    [junit] Testsuite: org.apache.cassandra.db.SystemTableTest
    [junit] Tests run: 2, Failures: 0, Errors: 0, Time elapsed: 0.606 sec
    [junit] 
    [junit] Cobertura: Loaded information on 794 classes.
    [junit] Cobertura: Saved information on 794 classes.
    [junit] Testsuite: org.apache.cassandra.db.TableTest
    [junit] Tests run: 10, Failures: 0, Errors: 0, Time elapsed: 4.753 sec
    [junit] 
    [junit] Cobertura: Loaded information on 794 classes.
    [junit] Cobertura: Saved information on 794 classes.
    [junit] Testsuite: org.apache.cassandra.db.TimeSortTest
    [junit] Tests run: 2, Failures: 0, Errors: 0, Time elapsed: 5.423 sec
    [junit] 
    [junit] Cobertura: Loaded information on 794 classes.
    [junit] Cobertura: Saved information on 794 classes.
    [junit] Testsuite: org.apache.cassandra.db.commitlog.CommitLogHeaderTest
    [junit] Tests run: 4, Failures: 0, Errors: 0, Time elapsed: 0.512 sec
    [junit] 
    [junit] Cobertura: Loaded information on 794 classes.
    [junit] Cobertura: Saved information on 794 classes.
    [junit] Testsuite: org.apache.cassandra.db.marshal.TimeUUIDTypeTest
    [junit] Tests run: 4, Failures: 0, Errors: 0, Time elapsed: 0.544 sec
    [junit] 
    [junit] Cobertura: Loaded information on 794 classes.
    [junit] Cobertura: Saved information on 794 classes.
    [junit] Testsuite: org.apache.cassandra.db.marshal.TypeCompareTest
    [junit] Tests run: 4, Failures: 0, Errors: 0, Time elapsed: 0.214 sec
    [junit] 
    [junit] Cobertura: Loaded information on 794 classes.
    [junit] Cobertura: Saved information on 794 classes.
    [junit] Testsuite: org.apache.cassandra.dht.BootStrapperTest
    [junit] Tests run: 3, Failures: 0, Errors: 0, Time elapsed: 1.61 sec
    [junit] 
    [junit] Cobertura: Loaded information on 794 classes.
    [junit] Cobertura: Saved information on 794 classes.
    [junit] Testsuite: org.apache.cassandra.dht.BoundsTest
    [junit] Tests run: 4, Failures: 0, Errors: 0, Time elapsed: 0.523 sec
    [junit] 
    [junit] Cobertura: Loaded information on 794 classes.
    [junit] Cobertura: Saved information on 794 classes.
    [junit] Testsuite: org.apache.cassandra.dht.ByteOrderedPartitionerTest
    [junit] Tests run: 6, Failures: 0, Errors: 0, Time elapsed: 10.721 sec
    [junit] 
    [junit] Cobertura: Loaded information on 794 classes.
    [junit] Cobertura: Saved information on 794 classes.
    [junit] Testsuite: org.apache.cassandra.dht.CollatingOrderPreservingPartitionerTest
    [junit] Tests run: 8, Failures: 0, Errors: 0, Time elapsed: 12.374 sec
    [junit] 
    [junit] Cobertura: Loaded information on 794 classes.
    [junit] Cobertura: Saved information on 794 classes.
    [junit] Testsuite: org.apache.cassandra.dht.OrderPreservingPartitionerTest
    [junit] Tests run: 7, Failures: 0, Errors: 0, Time elapsed: 7.726 sec
    [junit] 
    [junit] Cobertura: Loaded information on 794 classes.
    [junit] Cobertura: Saved information on 794 classes.
    [junit] Testsuite: org.apache.cassandra.dht.RandomPartitionerTest
    [junit] Tests run: 6, Failures: 0, Errors: 0, Time elapsed: 3.387 sec
    [junit] 
    [junit] Cobertura: Loaded information on 794 classes.
    [junit] Cobertura: Saved information on 794 classes.
    [junit] Testsuite: org.apache.cassandra.dht.RangeTest
    [junit] Tests run: 12, Failures: 0, Errors: 0, Time elapsed: 0.488 sec
    [junit] 
    [junit] Cobertura: Loaded information on 794 classes.
    [junit] Cobertura: Saved information on 794 classes.
    [junit] Testsuite: org.apache.cassandra.gms.ArrivalWindowTest
    [junit] Tests run: 1, Failures: 0, Errors: 0, Time elapsed: 0.182 sec
    [junit] 
    [junit] Cobertura: Loaded information on 794 classes.
    [junit] Cobertura: Saved information on 794 classes.
    [junit] Testsuite: org.apache.cassandra.gms.GossipDigestTest
    [junit] Tests run: 1, Failures: 0, Errors: 0, Time elapsed: 0.099 sec
    [junit] 
    [junit] Cobertura: Loaded information on 794 classes.
    [junit] Cobertura: Saved information on 794 classes.
    [junit] Testsuite: org.apache.cassandra.io.StreamingTest
    [junit] Tests run: 1, Failures: 0, Errors: 0, Time elapsed: 0.711 sec
    [junit] 
    [junit] Cobertura: Loaded information on 794 classes.
    [junit] Cobertura: Saved information on 794 classes.
    [junit] Testsuite: org.apache.cassandra.io.sstable.LegacySSTableTest
    [junit] Tests run: 1, Failures: 0, Errors: 0, Time elapsed: 3.482 sec
    [junit] 
    [junit] Cobertura: Loaded information on 794 classes.
    [junit] Cobertura: Saved information on 794 classes.
    [junit] Testsuite: org.apache.cassandra.io.sstable.SSTableReaderTest
    [junit] Tests run: 1, Failures: 0, Errors: 0, Time elapsed: 1.34 sec
    [junit] 
    [junit] Cobertura: Loaded information on 794 classes.
    [junit] Cobertura: Saved information on 794 classes.
    [junit] Testsuite: org.apache.cassandra.io.sstable.SSTableTest
    [junit] Tests run: 2, Failures: 0, Errors: 0, Time elapsed: 6.066 sec
    [junit] 
    [junit] Cobertura: Loaded information on 794 classes.
    [junit] Cobertura: Saved information on 794 classes.
    [junit] Testsuite: org.apache.cassandra.io.util.BufferedRandomAccessFileTest
    [junit] Tests run: 1, Failures: 0, Errors: 0, Time elapsed: 0.099 sec
    [junit] 
    [junit] Cobertura: Loaded information on 794 classes.
    [junit] Cobertura: Saved information on 794 classes.
    [junit] Testsuite: org.apache.cassandra.locator.DatacenterShardStrategyTest
    [junit] Tests run: 1, Failures: 1, Errors: 0, Time elapsed: 0.427 sec
    [junit] 
    [junit] ------------- Standard Error -----------------
    [junit] ERROR 12:39:35,968 Could not find end point information for 127.0.0.1, will use
default.
    [junit] ------------- ---------------- ---------------
    [junit] Testcase: testProperties(org.apache.cassandra.locator.DatacenterShardStrategyTest):
FAILED
    [junit] null
    [junit] junit.framework.AssertionFailedError
    [junit] 	at org.apache.cassandra.locator.DatacenterShardStrategyTest.testProperties(DatacenterShardStrategyTest.java:36)
    [junit] 
    [junit] 
    [junit] Cobertura: Loaded information on 794 classes.
    [junit] Cobertura: Saved information on 794 classes.
    [junit] Test org.apache.cassandra.locator.DatacenterShardStrategyTest FAILED
    [junit] Testsuite: org.apache.cassandra.locator.RackAwareStrategyTest
    [junit] Tests run: 3, Failures: 0, Errors: 0, Time elapsed: 0.44 sec
    [junit] 
    [junit] Cobertura: Loaded information on 794 classes.
    [junit] Cobertura: Saved information on 794 classes.
    [junit] Testsuite: org.apache.cassandra.locator.RackUnawareStrategyTest
    [junit] Tests run: 4, Failures: 0, Errors: 0, Time elapsed: 0.592 sec
    [junit] 
    [junit] Cobertura: Loaded information on 794 classes.
    [junit] Cobertura: Saved information on 794 classes.
    [junit] Testsuite: org.apache.cassandra.service.AntiEntropyServiceTest
    [junit] Tests run: 10, Failures: 0, Errors: 0, Time elapsed: 11.86 sec
    [junit] 
    [junit] Cobertura: Loaded information on 794 classes.
    [junit] Cobertura: Saved information on 794 classes.
    [junit] Testsuite: org.apache.cassandra.service.CassandraServerTest
    [junit] Tests run: 1, Failures: 0, Errors: 0, Time elapsed: 0.481 sec
    [junit] 
    [junit] Cobertura: Loaded information on 794 classes.
    [junit] Cobertura: Saved information on 794 classes.
    [junit] Testsuite: org.apache.cassandra.service.EmbeddedCassandraServiceTest
    [junit] Tests run: 1, Failures: 0, Errors: 0, Time elapsed: 1.003 sec
    [junit] 
    [junit] ------------- Standard Error -----------------
    [junit]  WARN 12:40:05,187 Couldn't detect any schema definitions in local storage. I
hope you've got a plan.
    [junit] ------------- ---------------- ---------------
    [junit] Cobertura: Loaded information on 794 classes.
    [junit] Cobertura: Saved information on 794 classes.
    [junit] Testsuite: org.apache.cassandra.service.MoveTest
    [junit] Tests run: 6, Failures: 0, Errors: 0, Time elapsed: 0.884 sec
    [junit] 
    [junit] ------------- Standard Error -----------------
    [junit]  WARN 12:40:09,480 Node /127.0.0.3 'leaving' token mismatch. Long network partition?
    [junit] ------------- ---------------- ---------------
    [junit] Cobertura: Loaded information on 794 classes.
    [junit] Cobertura: Saved information on 794 classes.
    [junit] Testsuite: org.apache.cassandra.service.ReadResponseResolverTest
    [junit] Tests run: 5, Failures: 0, Errors: 0, Time elapsed: 0.554 sec
    [junit] 
    [junit] Cobertura: Loaded information on 794 classes.
    [junit] Cobertura: Saved information on 794 classes.
    [junit] Testsuite: org.apache.cassandra.service.StorageServiceClientTest
    [junit] Tests run: 1, Failures: 0, Errors: 0, Time elapsed: 5.544 sec
    [junit] 
    [junit] Cobertura: Loaded information on 794 classes.
    [junit] Cobertura: Saved information on 794 classes.
    [junit] Testsuite: org.apache.cassandra.service.StorageServiceServerTest
    [junit] Tests run: 2, Failures: 0, Errors: 0, Time elapsed: 0.707 sec
    [junit] 
    [junit] Cobertura: Loaded information on 794 classes.
    [junit] Cobertura: Saved information on 794 classes.
    [junit] Testsuite: org.apache.cassandra.streaming.BootstrapTest
    [junit] Tests run: 1, Failures: 0, Errors: 0, Time elapsed: 0.534 sec
    [junit] 
    [junit] Cobertura: Loaded information on 794 classes.
    [junit] Cobertura: Saved information on 794 classes.
    [junit] Testsuite: org.apache.cassandra.tools.SSTableExportTest
    [junit] Tests run: 4, Failures: 0, Errors: 0, Time elapsed: 0.852 sec
    [junit] 
    [junit] Cobertura: Loaded information on 794 classes.
    [junit] Cobertura: Saved information on 794 classes.
    [junit] Testsuite: org.apache.cassandra.tools.SSTableImportTest
    [junit] Tests run: 2, Failures: 0, Errors: 0, Time elapsed: 0.696 sec
    [junit] 
    [junit] Cobertura: Loaded information on 794 classes.
    [junit] Cobertura: Saved information on 794 classes.
    [junit] Testsuite: org.apache.cassandra.utils.BloomFilterTest
    [junit] Tests run: 6, Failures: 0, Errors: 0, Time elapsed: 2.939 sec
    [junit] 
    [junit] Cobertura: Loaded information on 794 classes.
    [junit] Cobertura: Saved information on 794 classes.
    [junit] Testsuite: org.apache.cassandra.utils.BoundedStatsDequeTest
    [junit] Tests run: 1, Failures: 0, Errors: 0, Time elapsed: 0.074 sec
    [junit] 
    [junit] Cobertura: Loaded information on 794 classes.
    [junit] Cobertura: Saved information on 794 classes.
    [junit] Testsuite: org.apache.cassandra.utils.EstimatedHistogramTest
    [junit] Tests run: 1, Failures: 0, Errors: 0, Time elapsed: 0.09 sec
    [junit] 
    [junit] Cobertura: Loaded information on 794 classes.
    [junit] Cobertura: Saved information on 794 classes.
    [junit] Testsuite: org.apache.cassandra.utils.FBUtilitiesTest
    [junit] Tests run: 2, Failures: 0, Errors: 0, Time elapsed: 0.178 sec
    [junit] 
    [junit] Cobertura: Loaded information on 794 classes.
    [junit] Cobertura: Saved information on 794 classes.
    [junit] Testsuite: org.apache.cassandra.utils.FilterTest
    [junit] Tests run: 1, Failures: 0, Errors: 0, Time elapsed: 1.79 sec
    [junit] 
    [junit] Cobertura: Loaded information on 794 classes.
    [junit] Cobertura: Saved information on 794 classes.
    [junit] Testsuite: org.apache.cassandra.utils.MerkleTreeTest
    [junit] Tests run: 14, Failures: 0, Errors: 0, Time elapsed: 0.658 sec
    [junit] 
    [junit] Cobertura: Loaded information on 794 classes.
    [junit] Cobertura: Saved information on 794 classes.

BUILD FAILED
<http://hudson.zones.apache.org/hudson/job/Cassandra/ws/cassandra/build.xml>:395: The
following error occurred while executing this line:
<http://hudson.zones.apache.org/hudson/job/Cassandra/ws/cassandra/build.xml>:390: Some
unit test(s) failed.

Total time: 10 minutes 34 seconds
Publishing Javadoc
Archiving artifacts
Recording test results
Skipping Cobertura coverage report as build was not UNSTABLE or better ...


Mime
View raw message