incubator-cassandra-dev mailing list archives

Site index · List index
Message view « Date » · « Thread »
Top « Date » · « Thread »
From Apache Hudson Server <hud...@hudson.zones.apache.org>
Subject Build failed in Hudson: Cassandra #320
Date Mon, 11 Jan 2010 12:49:24 GMT
See <http://hudson.zones.apache.org/hudson/job/Cassandra/320/changes>

Changes:

[jbellis] better stress.py fix.  patch by jbellis

------------------------------------------
[...truncated 851 lines...]
    [junit] WARN   handleException, Problem reading from socket connected to : java.nio.channels.SocketChannel[connected
local=/127.0.0.1:45059 remote=/127.0.0.1:7010]
    [junit] java.io.IOException: Reached an EOL or something bizzare occured. Reading from:
/127.0.0.1 BufferSizeRemaining: 16
    [junit] 	at org.apache.cassandra.net.io.StartState.doRead(StartState.java:44)
    [junit] 	at org.apache.cassandra.net.io.ProtocolState.read(ProtocolState.java:39)
    [junit] 	at org.apache.cassandra.net.io.TcpReader.read(TcpReader.java:95)
    [junit] 	at org.apache.cassandra.net.TcpConnection$ReadWorkItem.run(TcpConnection.java:438)
    [junit] 	at java.util.concurrent.ThreadPoolExecutor$Worker.runTask(ThreadPoolExecutor.java:886)
    [junit] 	at java.util.concurrent.ThreadPoolExecutor$Worker.run(ThreadPoolExecutor.java:908)
    [junit] 	at java.lang.Thread.run(Thread.java:619)
    [junit] ------------- ---------------- ---------------
    [junit] Cobertura: Loaded information on 590 classes.
    [junit] Cobertura: Saved information on 590 classes.
    [junit] Testsuite: org.apache.cassandra.locator.RackUnawareStrategyTest
    [junit] Tests run: 3, Failures: 0, Errors: 0, Time elapsed: 0.383 sec
    [junit] 
    [junit] Exception in thread "Thread-0" java.lang.ExceptionInInitializerError
    [junit] 	at java.io.File.deleteOnExit(File.java:939)
    [junit] 	at net.sourceforge.cobertura.util.FileLocker.<init>(FileLocker.java:80)
    [junit] 	at net.sourceforge.cobertura.coveragedata.ProjectData.saveGlobalProjectData(ProjectData.java:230)
    [junit] 	at net.sourceforge.cobertura.coveragedata.SaveTimer.run(SaveTimer.java:31)
    [junit] 	at java.lang.Thread.run(Thread.java:619)
    [junit] Caused by: java.lang.IllegalStateException: Shutdown in progress
    [junit] 	at java.lang.Shutdown.add(Shutdown.java:62)
    [junit] 	at java.lang.System$2.registerShutdownHook(System.java:1146)
    [junit] 	at java.io.DeleteOnExitHook.<clinit>(DeleteOnExitHook.java:20)
    [junit] 	... 5 more
    [junit] Testsuite: org.apache.cassandra.service.AntiEntropyServiceTest
    [junit] Tests run: 8, Failures: 0, Errors: 0, Time elapsed: 7.927 sec
    [junit] 
    [junit] ------------- Standard Output ---------------
    [junit] ERROR  connect, Encountered IOException on connection: java.nio.channels.SocketChannel[closed]
    [junit] java.net.ConnectException: Connection refused
    [junit] 	at sun.nio.ch.SocketChannelImpl.checkConnect(Native Method)
    [junit] 	at sun.nio.ch.SocketChannelImpl.finishConnect(SocketChannelImpl.java:574)
    [junit] 	at org.apache.cassandra.net.TcpConnection.connect(TcpConnection.java:335)
    [junit] 	at org.apache.cassandra.net.SelectorManager.doProcess(SelectorManager.java:143)
    [junit] 	at org.apache.cassandra.net.SelectorManager.run(SelectorManager.java:107)
    [junit] ERROR  connect, Encountered IOException on connection: java.nio.channels.SocketChannel[closed]
    [junit] java.net.ConnectException: Connection refused
    [junit] 	at sun.nio.ch.SocketChannelImpl.checkConnect(Native Method)
    [junit] 	at sun.nio.ch.SocketChannelImpl.finishConnect(SocketChannelImpl.java:574)
    [junit] 	at org.apache.cassandra.net.TcpConnection.connect(TcpConnection.java:335)
    [junit] 	at org.apache.cassandra.net.SelectorManager.doProcess(SelectorManager.java:143)
    [junit] 	at org.apache.cassandra.net.SelectorManager.run(SelectorManager.java:107)
    [junit] ERROR  connect, Encountered IOException on connection: java.nio.channels.SocketChannel[closed]
    [junit] java.net.ConnectException: Connection refused
    [junit] 	at sun.nio.ch.SocketChannelImpl.checkConnect(Native Method)
    [junit] 	at sun.nio.ch.SocketChannelImpl.finishConnect(SocketChannelImpl.java:574)
    [junit] 	at org.apache.cassandra.net.TcpConnection.connect(TcpConnection.java:335)
    [junit] 	at org.apache.cassandra.net.SelectorManager.doProcess(SelectorManager.java:143)
    [junit] 	at org.apache.cassandra.net.SelectorManager.run(SelectorManager.java:107)
    [junit] ERROR  connect, Encountered IOException on connection: java.nio.channels.SocketChannel[closed]
    [junit] java.net.ConnectException: Connection refused
    [junit] 	at sun.nio.ch.SocketChannelImpl.checkConnect(Native Method)
    [junit] 	at sun.nio.ch.SocketChannelImpl.finishConnect(SocketChannelImpl.java:574)
    [junit] 	at org.apache.cassandra.net.TcpConnection.connect(TcpConnection.java:335)
    [junit] 	at org.apache.cassandra.net.SelectorManager.doProcess(SelectorManager.java:143)
    [junit] 	at org.apache.cassandra.net.SelectorManager.run(SelectorManager.java:107)
    [junit] ERROR  connect, Encountered IOException on connection: java.nio.channels.SocketChannel[closed]
    [junit] java.net.ConnectException: Connection refused
    [junit] 	at sun.nio.ch.SocketChannelImpl.checkConnect(Native Method)
    [junit] 	at sun.nio.ch.SocketChannelImpl.finishConnect(SocketChannelImpl.java:574)
    [junit] 	at org.apache.cassandra.net.TcpConnection.connect(TcpConnection.java:335)
    [junit] 	at org.apache.cassandra.net.SelectorManager.doProcess(SelectorManager.java:143)
    [junit] 	at org.apache.cassandra.net.SelectorManager.run(SelectorManager.java:107)
    [junit] ERROR  connect, Encountered IOException on connection: java.nio.channels.SocketChannel[closed]
    [junit] java.net.ConnectException: Connection refused
    [junit] 	at sun.nio.ch.SocketChannelImpl.checkConnect(Native Method)
    [junit] 	at sun.nio.ch.SocketChannelImpl.finishConnect(SocketChannelImpl.java:574)
    [junit] 	at org.apache.cassandra.net.TcpConnection.connect(TcpConnection.java:335)
    [junit] 	at org.apache.cassandra.net.SelectorManager.doProcess(SelectorManager.java:143)
    [junit] 	at org.apache.cassandra.net.SelectorManager.run(SelectorManager.java:107)
    [junit] ------------- ---------------- ---------------
    [junit] Exception in thread "Thread-1" java.lang.ExceptionInInitializerError
    [junit] 	at java.io.File.deleteOnExit(File.java:939)
    [junit] 	at net.sourceforge.cobertura.util.FileLocker.<init>(FileLocker.java:80)
    [junit] 	at net.sourceforge.cobertura.coveragedata.ProjectData.saveGlobalProjectData(ProjectData.java:230)
    [junit] 	at net.sourceforge.cobertura.coveragedata.SaveTimer.run(SaveTimer.java:31)
    [junit] 	at java.lang.Thread.run(Thread.java:619)
    [junit] Caused by: java.lang.IllegalStateException: Shutdown in progress
    [junit] 	at java.lang.Shutdown.add(Shutdown.java:62)
    [junit] 	at java.lang.System$2.registerShutdownHook(System.java:1146)
    [junit] 	at java.io.DeleteOnExitHook.<clinit>(DeleteOnExitHook.java:20)
    [junit] 	... 5 more
    [junit] Testsuite: org.apache.cassandra.service.CassandraServerTest
    [junit] Tests run: 1, Failures: 0, Errors: 0, Time elapsed: 0.286 sec
    [junit] 
    [junit] Exception in thread "Thread-1" java.lang.ExceptionInInitializerError
    [junit] 	at java.io.File.deleteOnExit(File.java:939)
    [junit] 	at net.sourceforge.cobertura.util.FileLocker.<init>(FileLocker.java:80)
    [junit] 	at net.sourceforge.cobertura.coveragedata.ProjectData.saveGlobalProjectData(ProjectData.java:230)
    [junit] 	at net.sourceforge.cobertura.coveragedata.SaveTimer.run(SaveTimer.java:31)
    [junit] 	at java.lang.Thread.run(Thread.java:619)
    [junit] Caused by: java.lang.IllegalStateException: Shutdown in progress
    [junit] 	at java.lang.Shutdown.add(Shutdown.java:62)
    [junit] 	at java.lang.System$2.registerShutdownHook(System.java:1146)
    [junit] 	at java.io.DeleteOnExitHook.<clinit>(DeleteOnExitHook.java:20)
    [junit] 	... 5 more
    [junit] Testsuite: org.apache.cassandra.service.MoveTest
    [junit] Tests run: 6, Failures: 0, Errors: 0, Time elapsed: 0.692 sec
    [junit] 
    [junit] ------------- Standard Output ---------------
    [junit] WARN   handleStateLeaving, Node /127.0.0.3 'leaving' token mismatch. Long network
partition?
    [junit] ------------- ---------------- ---------------
    [junit] Exception in thread "Thread-0" java.lang.ExceptionInInitializerError
    [junit] 	at java.io.File.deleteOnExit(File.java:939)
    [junit] 	at net.sourceforge.cobertura.util.FileLocker.<init>(FileLocker.java:80)
    [junit] 	at net.sourceforge.cobertura.coveragedata.ProjectData.saveGlobalProjectData(ProjectData.java:230)
    [junit] 	at net.sourceforge.cobertura.coveragedata.SaveTimer.run(SaveTimer.java:31)
    [junit] 	at java.lang.Thread.run(Thread.java:619)
    [junit] Caused by: java.lang.IllegalStateException: Shutdown in progress
    [junit] 	at java.lang.Shutdown.add(Shutdown.java:62)
    [junit] 	at java.lang.System$2.registerShutdownHook(System.java:1146)
    [junit] 	at java.io.DeleteOnExitHook.<clinit>(DeleteOnExitHook.java:20)
    [junit] 	... 5 more
    [junit] Testsuite: org.apache.cassandra.service.ReadResponseResolverTest
    [junit] Tests run: 5, Failures: 0, Errors: 0, Time elapsed: 0.346 sec
    [junit] 
    [junit] Exception in thread "Thread-0" java.lang.ExceptionInInitializerError
    [junit] 	at java.io.File.deleteOnExit(File.java:939)
    [junit] 	at net.sourceforge.cobertura.util.FileLocker.<init>(FileLocker.java:80)
    [junit] 	at net.sourceforge.cobertura.coveragedata.ProjectData.saveGlobalProjectData(ProjectData.java:230)
    [junit] 	at net.sourceforge.cobertura.coveragedata.SaveTimer.run(SaveTimer.java:31)
    [junit] 	at java.lang.Thread.run(Thread.java:619)
    [junit] Caused by: java.lang.IllegalStateException: Shutdown in progress
    [junit] 	at java.lang.Shutdown.add(Shutdown.java:62)
    [junit] 	at java.lang.System$2.registerShutdownHook(System.java:1146)
    [junit] 	at java.io.DeleteOnExitHook.<clinit>(DeleteOnExitHook.java:20)
    [junit] 	... 5 more
    [junit] Testsuite: org.apache.cassandra.service.StorageServiceTest
    [junit] Tests run: 2, Failures: 0, Errors: 0, Time elapsed: 0.626 sec
    [junit] 
    [junit] Exception in thread "Thread-1" java.lang.ExceptionInInitializerError
    [junit] 	at java.io.File.deleteOnExit(File.java:939)
    [junit] 	at net.sourceforge.cobertura.util.FileLocker.<init>(FileLocker.java:80)
    [junit] 	at net.sourceforge.cobertura.coveragedata.ProjectData.saveGlobalProjectData(ProjectData.java:230)
    [junit] 	at net.sourceforge.cobertura.coveragedata.SaveTimer.run(SaveTimer.java:31)
    [junit] 	at java.lang.Thread.run(Thread.java:619)
    [junit] Caused by: java.lang.IllegalStateException: Shutdown in progress
    [junit] 	at java.lang.Shutdown.add(Shutdown.java:62)
    [junit] 	at java.lang.System$2.registerShutdownHook(System.java:1146)
    [junit] 	at java.io.DeleteOnExitHook.<clinit>(DeleteOnExitHook.java:20)
    [junit] 	... 5 more
    [junit] Testsuite: org.apache.cassandra.tools.SSTableExportTest
    [junit] Tests run: 3, Failures: 0, Errors: 0, Time elapsed: 0.662 sec
    [junit] 
    [junit] Exception in thread "Thread-0" java.lang.ExceptionInInitializerError
    [junit] 	at java.io.File.deleteOnExit(File.java:939)
    [junit] 	at net.sourceforge.cobertura.util.FileLocker.<init>(FileLocker.java:80)
    [junit] 	at net.sourceforge.cobertura.coveragedata.ProjectData.saveGlobalProjectData(ProjectData.java:230)
    [junit] 	at net.sourceforge.cobertura.coveragedata.SaveTimer.run(SaveTimer.java:31)
    [junit] 	at java.lang.Thread.run(Thread.java:619)
    [junit] Caused by: java.lang.IllegalStateException: Shutdown in progress
    [junit] 	at java.lang.Shutdown.add(Shutdown.java:62)
    [junit] 	at java.lang.System$2.registerShutdownHook(System.java:1146)
    [junit] 	at java.io.DeleteOnExitHook.<clinit>(DeleteOnExitHook.java:20)
    [junit] 	... 5 more
    [junit] Testsuite: org.apache.cassandra.tools.SSTableImportTest
    [junit] Tests run: 2, Failures: 0, Errors: 0, Time elapsed: 0.443 sec
    [junit] 
    [junit] Exception in thread "Thread-0" java.lang.ExceptionInInitializerError
    [junit] 	at java.io.File.deleteOnExit(File.java:939)
    [junit] 	at net.sourceforge.cobertura.util.FileLocker.<init>(FileLocker.java:80)
    [junit] 	at net.sourceforge.cobertura.coveragedata.ProjectData.saveGlobalProjectData(ProjectData.java:230)
    [junit] 	at net.sourceforge.cobertura.coveragedata.SaveTimer.run(SaveTimer.java:31)
    [junit] 	at java.lang.Thread.run(Thread.java:619)
    [junit] Caused by: java.lang.IllegalStateException: Shutdown in progress
    [junit] 	at java.lang.Shutdown.add(Shutdown.java:62)
    [junit] 	at java.lang.System$2.registerShutdownHook(System.java:1146)
    [junit] 	at java.io.DeleteOnExitHook.<clinit>(DeleteOnExitHook.java:20)
    [junit] 	... 5 more
    [junit] Testsuite: org.apache.cassandra.utils.BloomFilterTest
    [junit] Tests run: 5, Failures: 0, Errors: 0, Time elapsed: 2.261 sec
    [junit] 
    [junit] Exception in thread "Thread-0" java.lang.ExceptionInInitializerError
    [junit] 	at java.io.File.deleteOnExit(File.java:939)
    [junit] 	at net.sourceforge.cobertura.util.FileLocker.<init>(FileLocker.java:80)
    [junit] 	at net.sourceforge.cobertura.coveragedata.ProjectData.saveGlobalProjectData(ProjectData.java:230)
    [junit] 	at net.sourceforge.cobertura.coveragedata.SaveTimer.run(SaveTimer.java:31)
    [junit] 	at java.lang.Thread.run(Thread.java:619)
    [junit] Caused by: java.lang.IllegalStateException: Shutdown in progress
    [junit] 	at java.lang.Shutdown.add(Shutdown.java:62)
    [junit] 	at java.lang.System$2.registerShutdownHook(System.java:1146)
    [junit] 	at java.io.DeleteOnExitHook.<clinit>(DeleteOnExitHook.java:20)
    [junit] 	... 5 more
    [junit] Testsuite: org.apache.cassandra.utils.BoundedStatsDequeTest
    [junit] Tests run: 1, Failures: 0, Errors: 0, Time elapsed: 0.065 sec
    [junit] 
    [junit] Exception in thread "Thread-0" java.lang.ExceptionInInitializerError
    [junit] 	at java.io.File.deleteOnExit(File.java:939)
    [junit] 	at net.sourceforge.cobertura.util.FileLocker.<init>(FileLocker.java:80)
    [junit] 	at net.sourceforge.cobertura.coveragedata.ProjectData.saveGlobalProjectData(ProjectData.java:230)
    [junit] 	at net.sourceforge.cobertura.coveragedata.SaveTimer.run(SaveTimer.java:31)
    [junit] 	at java.lang.Thread.run(Thread.java:619)
    [junit] Caused by: java.lang.IllegalStateException: Shutdown in progress
    [junit] 	at java.lang.Shutdown.add(Shutdown.java:62)
    [junit] 	at java.lang.System$2.registerShutdownHook(System.java:1146)
    [junit] 	at java.io.DeleteOnExitHook.<clinit>(DeleteOnExitHook.java:20)
    [junit] 	... 5 more
    [junit] Testsuite: org.apache.cassandra.utils.FBUtilitiesTest
    [junit] Tests run: 2, Failures: 0, Errors: 0, Time elapsed: 0.127 sec
    [junit] 
    [junit] Exception in thread "Thread-0" java.lang.ExceptionInInitializerError
    [junit] 	at java.io.File.deleteOnExit(File.java:939)
    [junit] 	at net.sourceforge.cobertura.util.FileLocker.<init>(FileLocker.java:80)
    [junit] 	at net.sourceforge.cobertura.coveragedata.ProjectData.saveGlobalProjectData(ProjectData.java:230)
    [junit] 	at net.sourceforge.cobertura.coveragedata.SaveTimer.run(SaveTimer.java:31)
    [junit] 	at java.lang.Thread.run(Thread.java:619)
    [junit] Caused by: java.lang.IllegalStateException: Shutdown in progress
    [junit] 	at java.lang.Shutdown.add(Shutdown.java:62)
    [junit] 	at java.lang.System$2.registerShutdownHook(System.java:1146)
    [junit] 	at java.io.DeleteOnExitHook.<clinit>(DeleteOnExitHook.java:20)
    [junit] 	... 5 more
    [junit] Testsuite: org.apache.cassandra.utils.FilterTest
    [junit] Tests run: 1, Failures: 0, Errors: 0, Time elapsed: 1.404 sec
    [junit] 
    [junit] Exception in thread "Thread-0" java.lang.ExceptionInInitializerError
    [junit] 	at java.io.File.deleteOnExit(File.java:939)
    [junit] 	at net.sourceforge.cobertura.util.FileLocker.<init>(FileLocker.java:80)
    [junit] 	at net.sourceforge.cobertura.coveragedata.ProjectData.saveGlobalProjectData(ProjectData.java:230)
    [junit] 	at net.sourceforge.cobertura.coveragedata.SaveTimer.run(SaveTimer.java:31)
    [junit] 	at java.lang.Thread.run(Thread.java:619)
    [junit] Caused by: java.lang.IllegalStateException: Shutdown in progress
    [junit] 	at java.lang.Shutdown.add(Shutdown.java:62)
    [junit] 	at java.lang.System$2.registerShutdownHook(System.java:1146)
    [junit] 	at java.io.DeleteOnExitHook.<clinit>(DeleteOnExitHook.java:20)
    [junit] 	... 5 more
    [junit] Testsuite: org.apache.cassandra.utils.MerkleTreeTest
    [junit] Tests run: 14, Failures: 0, Errors: 0, Time elapsed: 0.243 sec
    [junit] 
    [junit] Exception in thread "Thread-1" java.lang.ExceptionInInitializerError
    [junit] 	at java.io.File.deleteOnExit(File.java:939)
    [junit] 	at net.sourceforge.cobertura.util.FileLocker.<init>(FileLocker.java:80)
    [junit] 	at net.sourceforge.cobertura.coveragedata.ProjectData.saveGlobalProjectData(ProjectData.java:230)
    [junit] 	at net.sourceforge.cobertura.coveragedata.SaveTimer.run(SaveTimer.java:31)
    [junit] 	at java.lang.Thread.run(Thread.java:619)
    [junit] Caused by: java.lang.IllegalStateException: Shutdown in progress
    [junit] 	at java.lang.Shutdown.add(Shutdown.java:62)
    [junit] 	at java.lang.System$2.registerShutdownHook(System.java:1146)
    [junit] 	at java.io.DeleteOnExitHook.<clinit>(DeleteOnExitHook.java:20)
    [junit] 	... 5 more

BUILD FAILED
<http://hudson.zones.apache.org/hudson/job/Cassandra/ws/cassandra/build.xml>:253: Some
test(s) failed.

Total time: 2 minutes 45 seconds
Publishing Javadoc
Archiving artifacts
Recording test results


Mime
View raw message