incubator-cassandra-dev mailing list archives

Site index · List index
Message view « Date » · « Thread »
Top « Date » · « Thread »
From Apache Hudson Server <hud...@hudson.zones.apache.org>
Subject Build failed in Hudson: Cassandra #274
Date Tue, 01 Dec 2009 12:35:04 GMT
See <http://hudson.zones.apache.org/hudson/job/Cassandra/274/changes>

Changes:

[eevans] include missing maven dependencies

Patch by Adam Fisk; reviewed by eevans for CASSANDRA-588

[eevans] more flexible handling of JAVA_HOME in startup scripts

Patch by Kay Kay and eevans for CASSANDRA-589

[jbellis] skip the system table (keyspace) for cleanup, it's local-only.  patch by jbellis;
reviewed by Stu Hood for CASSANDRA-579

[eevans] use json-simple method that propagates exceptions

------------------------------------------
[...truncated 1030 lines...]
    [junit] Tests run: 7, Failures: 0, Errors: 0, Time elapsed: 12.729 sec
    [junit] 
    [junit] Exception in thread "Thread-0" java.lang.ExceptionInInitializerError
    [junit] 	at java.io.File.deleteOnExit(File.java:939)
    [junit] 	at net.sourceforge.cobertura.util.FileLocker.<init>(FileLocker.java:80)
    [junit] 	at net.sourceforge.cobertura.coveragedata.ProjectData.saveGlobalProjectData(ProjectData.java:230)
    [junit] 	at net.sourceforge.cobertura.coveragedata.SaveTimer.run(SaveTimer.java:31)
    [junit] 	at java.lang.Thread.run(Thread.java:619)
    [junit] Caused by: java.lang.IllegalStateException: Shutdown in progress
    [junit] 	at java.lang.Shutdown.add(Shutdown.java:62)
    [junit] 	at java.lang.System$2.registerShutdownHook(System.java:1146)
    [junit] 	at java.io.DeleteOnExitHook.<clinit>(DeleteOnExitHook.java:20)
    [junit] 	... 5 more
    [junit] Testsuite: org.apache.cassandra.dht.RandomPartitionerTest
    [junit] Tests run: 1, Failures: 0, Errors: 0, Time elapsed: 0.126 sec
    [junit] 
    [junit] Exception in thread "Thread-0" java.lang.ExceptionInInitializerError
    [junit] 	at java.io.File.deleteOnExit(File.java:939)
    [junit] 	at net.sourceforge.cobertura.util.FileLocker.<init>(FileLocker.java:80)
    [junit] 	at net.sourceforge.cobertura.coveragedata.ProjectData.saveGlobalProjectData(ProjectData.java:230)
    [junit] 	at net.sourceforge.cobertura.coveragedata.SaveTimer.run(SaveTimer.java:31)
    [junit] 	at java.lang.Thread.run(Thread.java:619)
    [junit] Caused by: java.lang.IllegalStateException: Shutdown in progress
    [junit] 	at java.lang.Shutdown.add(Shutdown.java:62)
    [junit] 	at java.lang.System$2.registerShutdownHook(System.java:1146)
    [junit] 	at java.io.DeleteOnExitHook.<clinit>(DeleteOnExitHook.java:20)
    [junit] 	... 5 more
    [junit] Testsuite: org.apache.cassandra.dht.RangeTest
    [junit] Tests run: 2, Failures: 0, Errors: 0, Time elapsed: 0.082 sec
    [junit] 
    [junit] Exception in thread "Thread-0" java.lang.ExceptionInInitializerError
    [junit] 	at java.io.File.deleteOnExit(File.java:939)
    [junit] 	at net.sourceforge.cobertura.util.FileLocker.<init>(FileLocker.java:80)
    [junit] 	at net.sourceforge.cobertura.coveragedata.ProjectData.saveGlobalProjectData(ProjectData.java:230)
    [junit] 	at net.sourceforge.cobertura.coveragedata.SaveTimer.run(SaveTimer.java:31)
    [junit] 	at java.lang.Thread.run(Thread.java:619)
    [junit] Caused by: java.lang.IllegalStateException: Shutdown in progress
    [junit] 	at java.lang.Shutdown.add(Shutdown.java:62)
    [junit] 	at java.lang.System$2.registerShutdownHook(System.java:1146)
    [junit] 	at java.io.DeleteOnExitHook.<clinit>(DeleteOnExitHook.java:20)
    [junit] 	... 5 more
    [junit] Testsuite: org.apache.cassandra.gms.ArrivalWindowTest
    [junit] Tests run: 1, Failures: 0, Errors: 0, Time elapsed: 0.112 sec
    [junit] 
    [junit] Exception in thread "Thread-0" java.lang.ExceptionInInitializerError
    [junit] 	at java.io.File.deleteOnExit(File.java:939)
    [junit] 	at net.sourceforge.cobertura.util.FileLocker.<init>(FileLocker.java:80)
    [junit] 	at net.sourceforge.cobertura.coveragedata.ProjectData.saveGlobalProjectData(ProjectData.java:230)
    [junit] 	at net.sourceforge.cobertura.coveragedata.SaveTimer.run(SaveTimer.java:31)
    [junit] 	at java.lang.Thread.run(Thread.java:619)
    [junit] Caused by: java.lang.IllegalStateException: Shutdown in progress
    [junit] 	at java.lang.Shutdown.add(Shutdown.java:62)
    [junit] 	at java.lang.System$2.registerShutdownHook(System.java:1146)
    [junit] 	at java.io.DeleteOnExitHook.<clinit>(DeleteOnExitHook.java:20)
    [junit] 	... 5 more
    [junit] Testsuite: org.apache.cassandra.gms.GossipDigestTest
    [junit] Tests run: 1, Failures: 0, Errors: 0, Time elapsed: 0.067 sec
    [junit] 
    [junit] Exception in thread "Thread-0" java.lang.ExceptionInInitializerError
    [junit] 	at java.io.File.deleteOnExit(File.java:939)
    [junit] 	at net.sourceforge.cobertura.util.FileLocker.<init>(FileLocker.java:80)
    [junit] 	at net.sourceforge.cobertura.coveragedata.ProjectData.saveGlobalProjectData(ProjectData.java:230)
    [junit] 	at net.sourceforge.cobertura.coveragedata.SaveTimer.run(SaveTimer.java:31)
    [junit] 	at java.lang.Thread.run(Thread.java:619)
    [junit] Caused by: java.lang.IllegalStateException: Shutdown in progress
    [junit] 	at java.lang.Shutdown.add(Shutdown.java:62)
    [junit] 	at java.lang.System$2.registerShutdownHook(System.java:1146)
    [junit] 	at java.io.DeleteOnExitHook.<clinit>(DeleteOnExitHook.java:20)
    [junit] 	... 5 more
    [junit] Testsuite: org.apache.cassandra.io.DataInputBufferTest
    [junit] Tests run: 1, Failures: 0, Errors: 0, Time elapsed: 0.066 sec
    [junit] 
    [junit] Exception in thread "Thread-0" java.lang.ExceptionInInitializerError
    [junit] 	at java.io.File.deleteOnExit(File.java:939)
    [junit] 	at net.sourceforge.cobertura.util.FileLocker.<init>(FileLocker.java:80)
    [junit] 	at net.sourceforge.cobertura.coveragedata.ProjectData.saveGlobalProjectData(ProjectData.java:230)
    [junit] 	at net.sourceforge.cobertura.coveragedata.SaveTimer.run(SaveTimer.java:31)
    [junit] 	at java.lang.Thread.run(Thread.java:619)
    [junit] Caused by: java.lang.IllegalStateException: Shutdown in progress
    [junit] 	at java.lang.Shutdown.add(Shutdown.java:62)
    [junit] 	at java.lang.System$2.registerShutdownHook(System.java:1146)
    [junit] 	at java.io.DeleteOnExitHook.<clinit>(DeleteOnExitHook.java:20)
    [junit] 	... 5 more
    [junit] Testsuite: org.apache.cassandra.io.SSTableTest
    [junit] Tests run: 2, Failures: 0, Errors: 0, Time elapsed: 2.677 sec
    [junit] 
    [junit] Exception in thread "Thread-1" java.lang.ExceptionInInitializerError
    [junit] 	at java.io.File.deleteOnExit(File.java:939)
    [junit] 	at net.sourceforge.cobertura.util.FileLocker.<init>(FileLocker.java:80)
    [junit] 	at net.sourceforge.cobertura.coveragedata.ProjectData.saveGlobalProjectData(ProjectData.java:230)
    [junit] 	at net.sourceforge.cobertura.coveragedata.SaveTimer.run(SaveTimer.java:31)
    [junit] 	at java.lang.Thread.run(Thread.java:619)
    [junit] Caused by: java.lang.IllegalStateException: Shutdown in progress
    [junit] 	at java.lang.Shutdown.add(Shutdown.java:62)
    [junit] 	at java.lang.System$2.registerShutdownHook(System.java:1146)
    [junit] 	at java.io.DeleteOnExitHook.<clinit>(DeleteOnExitHook.java:20)
    [junit] 	... 5 more
    [junit] Testsuite: org.apache.cassandra.locator.RackUnawareStrategyTest
    [junit] Tests run: 3, Failures: 0, Errors: 0, Time elapsed: 0.432 sec
    [junit] 
    [junit] Exception in thread "Thread-0" java.lang.ExceptionInInitializerError
    [junit] 	at java.io.File.deleteOnExit(File.java:939)
    [junit] 	at net.sourceforge.cobertura.util.FileLocker.<init>(FileLocker.java:80)
    [junit] 	at net.sourceforge.cobertura.coveragedata.ProjectData.saveGlobalProjectData(ProjectData.java:230)
    [junit] 	at net.sourceforge.cobertura.coveragedata.SaveTimer.run(SaveTimer.java:31)
    [junit] 	at java.lang.Thread.run(Thread.java:619)
    [junit] Caused by: java.lang.IllegalStateException: Shutdown in progress
    [junit] 	at java.lang.Shutdown.add(Shutdown.java:62)
    [junit] 	at java.lang.System$2.registerShutdownHook(System.java:1146)
    [junit] 	at java.io.DeleteOnExitHook.<clinit>(DeleteOnExitHook.java:20)
    [junit] 	... 5 more
    [junit] Testsuite: org.apache.cassandra.net.CompactEndPointSerializationHelperTest
    [junit] Tests run: 1, Failures: 0, Errors: 0, Time elapsed: 0.402 sec
    [junit] 
    [junit] ------------- Standard Output ---------------
    [junit] 4
    [junit] /127.0.0.1
    [junit] ------------- ---------------- ---------------
    [junit] Exception in thread "Thread-0" java.lang.ExceptionInInitializerError
    [junit] 	at java.io.File.deleteOnExit(File.java:939)
    [junit] 	at net.sourceforge.cobertura.util.FileLocker.<init>(FileLocker.java:80)
    [junit] 	at net.sourceforge.cobertura.coveragedata.ProjectData.saveGlobalProjectData(ProjectData.java:230)
    [junit] 	at net.sourceforge.cobertura.coveragedata.SaveTimer.run(SaveTimer.java:31)
    [junit] 	at java.lang.Thread.run(Thread.java:619)
    [junit] Caused by: java.lang.IllegalStateException: Shutdown in progress
    [junit] 	at java.lang.Shutdown.add(Shutdown.java:62)
    [junit] 	at java.lang.System$2.registerShutdownHook(System.java:1146)
    [junit] 	at java.io.DeleteOnExitHook.<clinit>(DeleteOnExitHook.java:20)
    [junit] 	... 5 more
    [junit] Testsuite: org.apache.cassandra.service.CassandraServerTest
    [junit] Tests run: 1, Failures: 0, Errors: 0, Time elapsed: 0.341 sec
    [junit] 
    [junit] Exception in thread "Thread-1" java.lang.ExceptionInInitializerError
    [junit] 	at java.io.File.deleteOnExit(File.java:939)
    [junit] 	at net.sourceforge.cobertura.util.FileLocker.<init>(FileLocker.java:80)
    [junit] 	at net.sourceforge.cobertura.coveragedata.ProjectData.saveGlobalProjectData(ProjectData.java:230)
    [junit] 	at net.sourceforge.cobertura.coveragedata.SaveTimer.run(SaveTimer.java:31)
    [junit] 	at java.lang.Thread.run(Thread.java:619)
    [junit] Caused by: java.lang.IllegalStateException: Shutdown in progress
    [junit] 	at java.lang.Shutdown.add(Shutdown.java:62)
    [junit] 	at java.lang.System$2.registerShutdownHook(System.java:1146)
    [junit] 	at java.io.DeleteOnExitHook.<clinit>(DeleteOnExitHook.java:20)
    [junit] 	... 5 more
    [junit] Testsuite: org.apache.cassandra.service.ReadResponseResolverTest
    [junit] Tests run: 5, Failures: 0, Errors: 0, Time elapsed: 0.392 sec
    [junit] 
    [junit] Exception in thread "Thread-0" java.lang.ExceptionInInitializerError
    [junit] 	at java.io.File.deleteOnExit(File.java:939)
    [junit] 	at net.sourceforge.cobertura.util.FileLocker.<init>(FileLocker.java:80)
    [junit] 	at net.sourceforge.cobertura.coveragedata.ProjectData.saveGlobalProjectData(ProjectData.java:230)
    [junit] 	at net.sourceforge.cobertura.coveragedata.SaveTimer.run(SaveTimer.java:31)
    [junit] 	at java.lang.Thread.run(Thread.java:619)
    [junit] Caused by: java.lang.IllegalStateException: Shutdown in progress
    [junit] 	at java.lang.Shutdown.add(Shutdown.java:62)
    [junit] 	at java.lang.System$2.registerShutdownHook(System.java:1146)
    [junit] 	at java.io.DeleteOnExitHook.<clinit>(DeleteOnExitHook.java:20)
    [junit] 	... 5 more
    [junit] Testsuite: org.apache.cassandra.tools.SSTableExportTest
    [junit] Tests run: 2, Failures: 0, Errors: 0, Time elapsed: 0.531 sec
    [junit] 
    [junit] Exception in thread "Thread-0" java.lang.ExceptionInInitializerError
    [junit] 	at java.io.File.deleteOnExit(File.java:939)
    [junit] 	at net.sourceforge.cobertura.util.FileLocker.<init>(FileLocker.java:80)
    [junit] 	at net.sourceforge.cobertura.coveragedata.ProjectData.saveGlobalProjectData(ProjectData.java:230)
    [junit] 	at net.sourceforge.cobertura.coveragedata.SaveTimer.run(SaveTimer.java:31)
    [junit] 	at java.lang.Thread.run(Thread.java:619)
    [junit] Caused by: java.lang.IllegalStateException: Shutdown in progress
    [junit] 	at java.lang.Shutdown.add(Shutdown.java:62)
    [junit] 	at java.lang.System$2.registerShutdownHook(System.java:1146)
    [junit] 	at java.io.DeleteOnExitHook.<clinit>(DeleteOnExitHook.java:20)
    [junit] 	... 5 more
    [junit] Testsuite: org.apache.cassandra.tools.SSTableImportTest
    [junit] Tests run: 2, Failures: 0, Errors: 0, Time elapsed: 0.532 sec
    [junit] 
    [junit] Exception in thread "Thread-0" java.lang.ExceptionInInitializerError
    [junit] 	at java.io.File.deleteOnExit(File.java:939)
    [junit] 	at net.sourceforge.cobertura.util.FileLocker.<init>(FileLocker.java:80)
    [junit] 	at net.sourceforge.cobertura.coveragedata.ProjectData.saveGlobalProjectData(ProjectData.java:230)
    [junit] 	at net.sourceforge.cobertura.coveragedata.SaveTimer.run(SaveTimer.java:31)
    [junit] 	at java.lang.Thread.run(Thread.java:619)
    [junit] Caused by: java.lang.IllegalStateException: Shutdown in progress
    [junit] 	at java.lang.Shutdown.add(Shutdown.java:62)
    [junit] 	at java.lang.System$2.registerShutdownHook(System.java:1146)
    [junit] 	at java.io.DeleteOnExitHook.<clinit>(DeleteOnExitHook.java:20)
    [junit] 	... 5 more
    [junit] Testsuite: org.apache.cassandra.utils.BloomFilterTest
    [junit] Tests run: 5, Failures: 0, Errors: 0, Time elapsed: 2.228 sec
    [junit] 
    [junit] Exception in thread "Thread-0" java.lang.ExceptionInInitializerError
    [junit] 	at java.io.File.deleteOnExit(File.java:939)
    [junit] 	at net.sourceforge.cobertura.util.FileLocker.<init>(FileLocker.java:80)
    [junit] 	at net.sourceforge.cobertura.coveragedata.ProjectData.saveGlobalProjectData(ProjectData.java:230)
    [junit] 	at net.sourceforge.cobertura.coveragedata.SaveTimer.run(SaveTimer.java:31)
    [junit] 	at java.lang.Thread.run(Thread.java:619)
    [junit] Caused by: java.lang.IllegalStateException: Shutdown in progress
    [junit] 	at java.lang.Shutdown.add(Shutdown.java:62)
    [junit] 	at java.lang.System$2.registerShutdownHook(System.java:1146)
    [junit] 	at java.io.DeleteOnExitHook.<clinit>(DeleteOnExitHook.java:20)
    [junit] 	... 5 more
    [junit] Testsuite: org.apache.cassandra.utils.BoundedStatsDequeTest
    [junit] Tests run: 1, Failures: 0, Errors: 0, Time elapsed: 0.063 sec
    [junit] 
    [junit] Exception in thread "Thread-0" java.lang.ExceptionInInitializerError
    [junit] 	at java.io.File.deleteOnExit(File.java:939)
    [junit] 	at net.sourceforge.cobertura.util.FileLocker.<init>(FileLocker.java:80)
    [junit] 	at net.sourceforge.cobertura.coveragedata.ProjectData.saveGlobalProjectData(ProjectData.java:230)
    [junit] 	at net.sourceforge.cobertura.coveragedata.SaveTimer.run(SaveTimer.java:31)
    [junit] 	at java.lang.Thread.run(Thread.java:619)
    [junit] Caused by: java.lang.IllegalStateException: Shutdown in progress
    [junit] 	at java.lang.Shutdown.add(Shutdown.java:62)
    [junit] 	at java.lang.System$2.registerShutdownHook(System.java:1146)
    [junit] 	at java.io.DeleteOnExitHook.<clinit>(DeleteOnExitHook.java:20)
    [junit] 	... 5 more
    [junit] Testsuite: org.apache.cassandra.utils.FBUtilitiesTest
    [junit] Tests run: 2, Failures: 0, Errors: 0, Time elapsed: 0.108 sec
    [junit] 
    [junit] Exception in thread "Thread-0" java.lang.ExceptionInInitializerError
    [junit] 	at java.io.File.deleteOnExit(File.java:939)
    [junit] 	at net.sourceforge.cobertura.util.FileLocker.<init>(FileLocker.java:80)
    [junit] 	at net.sourceforge.cobertura.coveragedata.ProjectData.saveGlobalProjectData(ProjectData.java:230)
    [junit] 	at net.sourceforge.cobertura.coveragedata.SaveTimer.run(SaveTimer.java:31)
    [junit] 	at java.lang.Thread.run(Thread.java:619)
    [junit] Caused by: java.lang.IllegalStateException: Shutdown in progress
    [junit] 	at java.lang.Shutdown.add(Shutdown.java:62)
    [junit] 	at java.lang.System$2.registerShutdownHook(System.java:1146)
    [junit] 	at java.io.DeleteOnExitHook.<clinit>(DeleteOnExitHook.java:20)
    [junit] 	... 5 more
    [junit] Testsuite: org.apache.cassandra.utils.FilterTest
    [junit] Tests run: 1, Failures: 0, Errors: 0, Time elapsed: 1.365 sec
    [junit] 
    [junit] Exception in thread "Thread-0" java.lang.ExceptionInInitializerError
    [junit] 	at java.io.File.deleteOnExit(File.java:939)
    [junit] 	at net.sourceforge.cobertura.util.FileLocker.<init>(FileLocker.java:80)
    [junit] 	at net.sourceforge.cobertura.coveragedata.ProjectData.saveGlobalProjectData(ProjectData.java:230)
    [junit] 	at net.sourceforge.cobertura.coveragedata.SaveTimer.run(SaveTimer.java:31)
    [junit] 	at java.lang.Thread.run(Thread.java:619)
    [junit] Caused by: java.lang.IllegalStateException: Shutdown in progress
    [junit] 	at java.lang.Shutdown.add(Shutdown.java:62)
    [junit] 	at java.lang.System$2.registerShutdownHook(System.java:1146)
    [junit] 	at java.io.DeleteOnExitHook.<clinit>(DeleteOnExitHook.java:20)
    [junit] 	... 5 more

BUILD FAILED
<http://hudson.zones.apache.org/hudson/job/Cassandra/ws/cassandra/build.xml>:243: Some
test(s) failed.

Total time: 3 minutes 43 seconds
Publishing Javadoc
Archiving artifacts
Recording test results


Mime
View raw message