incubator-cassandra-dev mailing list archives

Site index · List index
Message view « Date » · « Thread »
Top « Date » · « Thread »
From Apache Hudson Server <hud...@hudson.zones.apache.org>
Subject Build failed in Hudson: Cassandra #287
Date Mon, 14 Dec 2009 12:33:59 GMT
See <http://hudson.zones.apache.org/hudson/job/Cassandra/287/>

------------------------------------------
[...truncated 837 lines...]
    [junit] 	at sun.nio.ch.ServerSocketAdaptor.bind(ServerSocketAdaptor.java:59)
    [junit] 	at sun.nio.ch.ServerSocketAdaptor.bind(ServerSocketAdaptor.java:52)
    [junit] 	at org.apache.cassandra.net.MessagingService.listen(MessagingService.java:195)
    [junit] 	at org.apache.cassandra.service.StorageService.initServer(StorageService.java:268)
    [junit] 	at org.apache.cassandra.io.StreamingTest.testTransferTable(StreamingTest.java:46)
    [junit] 
    [junit] 
    [junit] Exception in thread "Thread-1" java.lang.ExceptionInInitializerError
    [junit] 	at java.io.File.deleteOnExit(File.java:939)
    [junit] 	at net.sourceforge.cobertura.util.FileLocker.<init>(FileLocker.java:80)
    [junit] 	at net.sourceforge.cobertura.coveragedata.ProjectData.saveGlobalProjectData(ProjectData.java:230)
    [junit] 	at net.sourceforge.cobertura.coveragedata.SaveTimer.run(SaveTimer.java:31)
    [junit] 	at java.lang.Thread.run(Thread.java:619)
    [junit] Caused by: java.lang.IllegalStateException: Shutdown in progress
    [junit] 	at java.lang.Shutdown.add(Shutdown.java:62)
    [junit] 	at java.lang.System$2.registerShutdownHook(System.java:1146)
    [junit] 	at java.io.DeleteOnExitHook.<clinit>(DeleteOnExitHook.java:20)
    [junit] 	... 5 more
    [junit] Test org.apache.cassandra.io.StreamingTest FAILED
    [junit] Testsuite: org.apache.cassandra.locator.RackUnawareStrategyTest
    [junit] Tests run: 3, Failures: 0, Errors: 0, Time elapsed: 0.369 sec
    [junit] 
    [junit] Exception in thread "Thread-0" java.lang.ExceptionInInitializerError
    [junit] 	at java.io.File.deleteOnExit(File.java:939)
    [junit] 	at net.sourceforge.cobertura.util.FileLocker.<init>(FileLocker.java:80)
    [junit] 	at net.sourceforge.cobertura.coveragedata.ProjectData.saveGlobalProjectData(ProjectData.java:230)
    [junit] 	at net.sourceforge.cobertura.coveragedata.SaveTimer.run(SaveTimer.java:31)
    [junit] 	at java.lang.Thread.run(Thread.java:619)
    [junit] Caused by: java.lang.IllegalStateException: Shutdown in progress
    [junit] 	at java.lang.Shutdown.add(Shutdown.java:62)
    [junit] 	at java.lang.System$2.registerShutdownHook(System.java:1146)
    [junit] 	at java.io.DeleteOnExitHook.<clinit>(DeleteOnExitHook.java:20)
    [junit] 	... 5 more
    [junit] Testsuite: org.apache.cassandra.service.AntiEntropyServiceTest
    [junit] Tests run: 1, Failures: 0, Errors: 1, Time elapsed: 0 sec
    [junit] 
    [junit] Null Test: 	Caused an ERROR
    [junit] null
    [junit] java.lang.ExceptionInInitializerError
    [junit] 	at java.lang.Class.forName0(Native Method)
    [junit] 	at java.lang.Class.forName(Class.java:169)
    [junit] Caused by: java.lang.RuntimeException: java.net.BindException: Address already
in use
    [junit] 	at org.apache.cassandra.service.AntiEntropyServiceTest.<clinit>(AntiEntropyServiceTest.java:66)
    [junit] Caused by: java.net.BindException: Address already in use
    [junit] 	at sun.nio.ch.Net.bind(Native Method)
    [junit] 	at sun.nio.ch.ServerSocketChannelImpl.bind(ServerSocketChannelImpl.java:119)
    [junit] 	at sun.nio.ch.ServerSocketAdaptor.bind(ServerSocketAdaptor.java:59)
    [junit] 	at sun.nio.ch.ServerSocketAdaptor.bind(ServerSocketAdaptor.java:52)
    [junit] 	at org.apache.cassandra.net.MessagingService.listen(MessagingService.java:195)
    [junit] 	at org.apache.cassandra.service.StorageService.initServer(StorageService.java:268)
    [junit] 	at org.apache.cassandra.service.AntiEntropyServiceTest.<clinit>(AntiEntropyServiceTest.java:62)
    [junit] 
    [junit] 
    [junit] Exception in thread "Thread-1" java.lang.ExceptionInInitializerError
    [junit] 	at java.io.File.deleteOnExit(File.java:939)
    [junit] 	at net.sourceforge.cobertura.util.FileLocker.<init>(FileLocker.java:80)
    [junit] 	at net.sourceforge.cobertura.coveragedata.ProjectData.saveGlobalProjectData(ProjectData.java:230)
    [junit] 	at net.sourceforge.cobertura.coveragedata.SaveTimer.run(SaveTimer.java:31)
    [junit] 	at java.lang.Thread.run(Thread.java:619)
    [junit] Caused by: java.lang.IllegalStateException: Shutdown in progress
    [junit] 	at java.lang.Shutdown.add(Shutdown.java:62)
    [junit] 	at java.lang.System$2.registerShutdownHook(System.java:1146)
    [junit] 	at java.io.DeleteOnExitHook.<clinit>(DeleteOnExitHook.java:20)
    [junit] 	... 5 more
    [junit] Test org.apache.cassandra.service.AntiEntropyServiceTest FAILED
    [junit] Testsuite: org.apache.cassandra.service.CassandraServerTest
    [junit] Tests run: 1, Failures: 0, Errors: 0, Time elapsed: 0.312 sec
    [junit] 
    [junit] Exception in thread "Thread-1" java.lang.ExceptionInInitializerError
    [junit] 	at java.io.File.deleteOnExit(File.java:939)
    [junit] 	at net.sourceforge.cobertura.util.FileLocker.<init>(FileLocker.java:80)
    [junit] 	at net.sourceforge.cobertura.coveragedata.ProjectData.saveGlobalProjectData(ProjectData.java:230)
    [junit] 	at net.sourceforge.cobertura.coveragedata.SaveTimer.run(SaveTimer.java:31)
    [junit] 	at java.lang.Thread.run(Thread.java:619)
    [junit] Caused by: java.lang.IllegalStateException: Shutdown in progress
    [junit] 	at java.lang.Shutdown.add(Shutdown.java:62)
    [junit] 	at java.lang.System$2.registerShutdownHook(System.java:1146)
    [junit] 	at java.io.DeleteOnExitHook.<clinit>(DeleteOnExitHook.java:20)
    [junit] 	... 5 more
    [junit] Testsuite: org.apache.cassandra.service.ReadResponseResolverTest
    [junit] Tests run: 5, Failures: 0, Errors: 0, Time elapsed: 0.334 sec
    [junit] 
    [junit] Exception in thread "Thread-0" java.lang.ExceptionInInitializerError
    [junit] 	at java.io.File.deleteOnExit(File.java:939)
    [junit] 	at net.sourceforge.cobertura.util.FileLocker.<init>(FileLocker.java:80)
    [junit] 	at net.sourceforge.cobertura.coveragedata.ProjectData.saveGlobalProjectData(ProjectData.java:230)
    [junit] 	at net.sourceforge.cobertura.coveragedata.SaveTimer.run(SaveTimer.java:31)
    [junit] 	at java.lang.Thread.run(Thread.java:619)
    [junit] Caused by: java.lang.IllegalStateException: Shutdown in progress
    [junit] 	at java.lang.Shutdown.add(Shutdown.java:62)
    [junit] 	at java.lang.System$2.registerShutdownHook(System.java:1146)
    [junit] 	at java.io.DeleteOnExitHook.<clinit>(DeleteOnExitHook.java:20)
    [junit] 	... 5 more
    [junit] Testsuite: org.apache.cassandra.service.StorageServiceTest
    [junit] Tests run: 2, Failures: 0, Errors: 2, Time elapsed: 0.538 sec
    [junit] 
    [junit] Testcase: testClientOnlyMode(org.apache.cassandra.service.StorageServiceTest):
Caused an ERROR
    [junit] Address already in use
    [junit] java.net.BindException: Address already in use
    [junit] 	at sun.nio.ch.Net.bind(Native Method)
    [junit] 	at sun.nio.ch.ServerSocketChannelImpl.bind(ServerSocketChannelImpl.java:119)
    [junit] 	at sun.nio.ch.ServerSocketAdaptor.bind(ServerSocketAdaptor.java:59)
    [junit] 	at sun.nio.ch.ServerSocketAdaptor.bind(ServerSocketAdaptor.java:52)
    [junit] 	at org.apache.cassandra.net.MessagingService.listen(MessagingService.java:195)
    [junit] 	at org.apache.cassandra.service.StorageService.initClient(StorageService.java:250)
    [junit] 	at org.apache.cassandra.service.StorageServiceTest.testClientOnlyMode(StorageServiceTest.java:39)
    [junit] 
    [junit] 
    [junit] Testcase: testRegularMode(org.apache.cassandra.service.StorageServiceTest):	Caused
an ERROR
    [junit] Address already in use
    [junit] java.net.BindException: Address already in use
    [junit] 	at sun.nio.ch.Net.bind(Native Method)
    [junit] 	at sun.nio.ch.ServerSocketChannelImpl.bind(ServerSocketChannelImpl.java:119)
    [junit] 	at sun.nio.ch.ServerSocketAdaptor.bind(ServerSocketAdaptor.java:59)
    [junit] 	at sun.nio.ch.ServerSocketAdaptor.bind(ServerSocketAdaptor.java:52)
    [junit] 	at org.apache.cassandra.net.MessagingService.listen(MessagingService.java:195)
    [junit] 	at org.apache.cassandra.service.StorageService.initServer(StorageService.java:268)
    [junit] 	at org.apache.cassandra.service.StorageServiceTest.testRegularMode(StorageServiceTest.java:55)
    [junit] 
    [junit] 
    [junit] Exception in thread "Thread-1" java.lang.ExceptionInInitializerError
    [junit] 	at java.io.File.deleteOnExit(File.java:939)
    [junit] 	at net.sourceforge.cobertura.util.FileLocker.<init>(FileLocker.java:80)
    [junit] 	at net.sourceforge.cobertura.coveragedata.ProjectData.saveGlobalProjectData(ProjectData.java:230)
    [junit] 	at net.sourceforge.cobertura.coveragedata.SaveTimer.run(SaveTimer.java:31)
    [junit] 	at java.lang.Thread.run(Thread.java:619)
    [junit] Caused by: java.lang.IllegalStateException: Shutdown in progress
    [junit] 	at java.lang.Shutdown.add(Shutdown.java:62)
    [junit] 	at java.lang.System$2.registerShutdownHook(System.java:1146)
    [junit] 	at java.io.DeleteOnExitHook.<clinit>(DeleteOnExitHook.java:20)
    [junit] 	... 5 more
    [junit] Test org.apache.cassandra.service.StorageServiceTest FAILED
    [junit] Testsuite: org.apache.cassandra.tools.SSTableExportTest
    [junit] Tests run: 2, Failures: 0, Errors: 0, Time elapsed: 0.47 sec
    [junit] 
    [junit] Exception in thread "Thread-0" java.lang.ExceptionInInitializerError
    [junit] 	at java.io.File.deleteOnExit(File.java:939)
    [junit] 	at net.sourceforge.cobertura.util.FileLocker.<init>(FileLocker.java:80)
    [junit] 	at net.sourceforge.cobertura.coveragedata.ProjectData.saveGlobalProjectData(ProjectData.java:230)
    [junit] 	at net.sourceforge.cobertura.coveragedata.SaveTimer.run(SaveTimer.java:31)
    [junit] 	at java.lang.Thread.run(Thread.java:619)
    [junit] Caused by: java.lang.IllegalStateException: Shutdown in progress
    [junit] 	at java.lang.Shutdown.add(Shutdown.java:62)
    [junit] 	at java.lang.System$2.registerShutdownHook(System.java:1146)
    [junit] 	at java.io.DeleteOnExitHook.<clinit>(DeleteOnExitHook.java:20)
    [junit] 	... 5 more
    [junit] Testsuite: org.apache.cassandra.tools.SSTableImportTest
    [junit] Tests run: 2, Failures: 0, Errors: 1, Time elapsed: 0.428 sec
    [junit] 
    [junit] Testcase: testImportSuperCf(org.apache.cassandra.tools.SSTableImportTest):	Caused
an ERROR
    [junit] Invalid localDeleteTime read: -1926165436
    [junit] java.io.IOException: Invalid localDeleteTime read: -1926165436
    [junit] 	at org.apache.cassandra.db.SuperColumnSerializer.deserialize(SuperColumn.java:368)
    [junit] 	at org.apache.cassandra.db.SuperColumnSerializer.deserialize(SuperColumn.java:325)
    [junit] 	at org.apache.cassandra.db.filter.SSTableNamesIterator.<init>(SSTableNamesIterator.java:103)
    [junit] 	at org.apache.cassandra.db.filter.NamesQueryFilter.getSSTableColumnIterator(NamesQueryFilter.java:69)
    [junit] 	at org.apache.cassandra.tools.SSTableImportTest.testImportSuperCf(SSTableImportTest.java:63)
    [junit] 
    [junit] 
    [junit] Exception in thread "Thread-0" java.lang.ExceptionInInitializerError
    [junit] 	at java.io.File.deleteOnExit(File.java:939)
    [junit] 	at net.sourceforge.cobertura.util.FileLocker.<init>(FileLocker.java:80)
    [junit] 	at net.sourceforge.cobertura.coveragedata.ProjectData.saveGlobalProjectData(ProjectData.java:230)
    [junit] 	at net.sourceforge.cobertura.coveragedata.SaveTimer.run(SaveTimer.java:31)
    [junit] 	at java.lang.Thread.run(Thread.java:619)
    [junit] Caused by: java.lang.IllegalStateException: Shutdown in progress
    [junit] 	at java.lang.Shutdown.add(Shutdown.java:62)
    [junit] 	at java.lang.System$2.registerShutdownHook(System.java:1146)
    [junit] 	at java.io.DeleteOnExitHook.<clinit>(DeleteOnExitHook.java:20)
    [junit] 	... 5 more
    [junit] Test org.apache.cassandra.tools.SSTableImportTest FAILED
    [junit] Testsuite: org.apache.cassandra.utils.BloomFilterTest
    [junit] Tests run: 5, Failures: 0, Errors: 0, Time elapsed: 2.195 sec
    [junit] 
    [junit] Exception in thread "Thread-0" java.lang.ExceptionInInitializerError
    [junit] 	at java.io.File.deleteOnExit(File.java:939)
    [junit] 	at net.sourceforge.cobertura.util.FileLocker.<init>(FileLocker.java:80)
    [junit] 	at net.sourceforge.cobertura.coveragedata.ProjectData.saveGlobalProjectData(ProjectData.java:230)
    [junit] 	at net.sourceforge.cobertura.coveragedata.SaveTimer.run(SaveTimer.java:31)
    [junit] 	at java.lang.Thread.run(Thread.java:619)
    [junit] Caused by: java.lang.IllegalStateException: Shutdown in progress
    [junit] 	at java.lang.Shutdown.add(Shutdown.java:62)
    [junit] 	at java.lang.System$2.registerShutdownHook(System.java:1146)
    [junit] 	at java.io.DeleteOnExitHook.<clinit>(DeleteOnExitHook.java:20)
    [junit] 	... 5 more
    [junit] Testsuite: org.apache.cassandra.utils.BoundedStatsDequeTest
    [junit] Tests run: 1, Failures: 0, Errors: 0, Time elapsed: 0.063 sec
    [junit] 
    [junit] Exception in thread "Thread-0" java.lang.ExceptionInInitializerError
    [junit] 	at java.io.File.deleteOnExit(File.java:939)
    [junit] 	at net.sourceforge.cobertura.util.FileLocker.<init>(FileLocker.java:80)
    [junit] 	at net.sourceforge.cobertura.coveragedata.ProjectData.saveGlobalProjectData(ProjectData.java:230)
    [junit] 	at net.sourceforge.cobertura.coveragedata.SaveTimer.run(SaveTimer.java:31)
    [junit] 	at java.lang.Thread.run(Thread.java:619)
    [junit] Caused by: java.lang.IllegalStateException: Shutdown in progress
    [junit] 	at java.lang.Shutdown.add(Shutdown.java:62)
    [junit] 	at java.lang.System$2.registerShutdownHook(System.java:1146)
    [junit] 	at java.io.DeleteOnExitHook.<clinit>(DeleteOnExitHook.java:20)
    [junit] 	... 5 more
    [junit] Testsuite: org.apache.cassandra.utils.FBUtilitiesTest
    [junit] Tests run: 2, Failures: 0, Errors: 0, Time elapsed: 0.121 sec
    [junit] 
    [junit] Exception in thread "Thread-0" java.lang.ExceptionInInitializerError
    [junit] 	at java.io.File.deleteOnExit(File.java:939)
    [junit] 	at net.sourceforge.cobertura.util.FileLocker.<init>(FileLocker.java:80)
    [junit] 	at net.sourceforge.cobertura.coveragedata.ProjectData.saveGlobalProjectData(ProjectData.java:230)
    [junit] 	at net.sourceforge.cobertura.coveragedata.SaveTimer.run(SaveTimer.java:31)
    [junit] 	at java.lang.Thread.run(Thread.java:619)
    [junit] Caused by: java.lang.IllegalStateException: Shutdown in progress
    [junit] 	at java.lang.Shutdown.add(Shutdown.java:62)
    [junit] 	at java.lang.System$2.registerShutdownHook(System.java:1146)
    [junit] 	at java.io.DeleteOnExitHook.<clinit>(DeleteOnExitHook.java:20)
    [junit] 	... 5 more
    [junit] Testsuite: org.apache.cassandra.utils.FilterTest
    [junit] Tests run: 1, Failures: 0, Errors: 0, Time elapsed: 1.368 sec
    [junit] 
    [junit] Exception in thread "Thread-0" java.lang.ExceptionInInitializerError
    [junit] 	at java.io.File.deleteOnExit(File.java:939)
    [junit] 	at net.sourceforge.cobertura.util.FileLocker.<init>(FileLocker.java:80)
    [junit] 	at net.sourceforge.cobertura.coveragedata.ProjectData.saveGlobalProjectData(ProjectData.java:230)
    [junit] 	at net.sourceforge.cobertura.coveragedata.SaveTimer.run(SaveTimer.java:31)
    [junit] 	at java.lang.Thread.run(Thread.java:619)
    [junit] Caused by: java.lang.IllegalStateException: Shutdown in progress
    [junit] 	at java.lang.Shutdown.add(Shutdown.java:62)
    [junit] 	at java.lang.System$2.registerShutdownHook(System.java:1146)
    [junit] 	at java.io.DeleteOnExitHook.<clinit>(DeleteOnExitHook.java:20)
    [junit] 	... 5 more
    [junit] Testsuite: org.apache.cassandra.utils.MerkleTreeTest
    [junit] Tests run: 14, Failures: 0, Errors: 0, Time elapsed: 0.947 sec
    [junit] 
    [junit] Exception in thread "Thread-1" java.lang.ExceptionInInitializerError
    [junit] 	at java.io.File.deleteOnExit(File.java:939)
    [junit] 	at net.sourceforge.cobertura.util.FileLocker.<init>(FileLocker.java:80)
    [junit] 	at net.sourceforge.cobertura.coveragedata.ProjectData.saveGlobalProjectData(ProjectData.java:230)
    [junit] 	at net.sourceforge.cobertura.coveragedata.SaveTimer.run(SaveTimer.java:31)
    [junit] 	at java.lang.Thread.run(Thread.java:619)
    [junit] Caused by: java.lang.IllegalStateException: Shutdown in progress
    [junit] 	at java.lang.Shutdown.add(Shutdown.java:62)
    [junit] 	at java.lang.System$2.registerShutdownHook(System.java:1146)
    [junit] 	at java.io.DeleteOnExitHook.<clinit>(DeleteOnExitHook.java:20)
    [junit] 	... 5 more

BUILD FAILED
<http://hudson.zones.apache.org/hudson/job/Cassandra/ws/cassandra/build.xml>:246: Some
test(s) failed.

Total time: 2 minutes 40 seconds
Publishing Javadoc
Archiving artifacts
Recording test results


Mime
View raw message