incubator-cassandra-dev mailing list archives

Site index · List index
Message view « Date » · « Thread »
Top « Date » · « Thread »
From Apache Hudson Server <hud...@hudson.zones.apache.org>
Subject Build failed in Hudson: Cassandra #275
Date Wed, 02 Dec 2009 12:34:25 GMT
See <http://hudson.zones.apache.org/hudson/job/Cassandra/275/changes>

Changes:

[eevans] update test for new Super4 column family definition

[jbellis] use size of sstables as load, instead of naively counting everything in the data
directories
patch by jbellis; reviewed by Stu Hood for CASSANDRA-554

[eevans] CASSANDRA-591 remove unused setters

------------------------------------------
[...truncated 1030 lines...]
    [junit] Tests run: 7, Failures: 0, Errors: 0, Time elapsed: 12.01 sec
    [junit] 
    [junit] Exception in thread "Thread-0" java.lang.ExceptionInInitializerError
    [junit] 	at java.io.File.deleteOnExit(File.java:939)
    [junit] 	at net.sourceforge.cobertura.util.FileLocker.<init>(FileLocker.java:80)
    [junit] 	at net.sourceforge.cobertura.coveragedata.ProjectData.saveGlobalProjectData(ProjectData.java:230)
    [junit] 	at net.sourceforge.cobertura.coveragedata.SaveTimer.run(SaveTimer.java:31)
    [junit] 	at java.lang.Thread.run(Thread.java:619)
    [junit] Caused by: java.lang.IllegalStateException: Shutdown in progress
    [junit] 	at java.lang.Shutdown.add(Shutdown.java:62)
    [junit] 	at java.lang.System$2.registerShutdownHook(System.java:1146)
    [junit] 	at java.io.DeleteOnExitHook.<clinit>(DeleteOnExitHook.java:20)
    [junit] 	... 5 more
    [junit] Testsuite: org.apache.cassandra.dht.RandomPartitionerTest
    [junit] Tests run: 1, Failures: 0, Errors: 0, Time elapsed: 0.12 sec
    [junit] 
    [junit] Exception in thread "Thread-0" java.lang.ExceptionInInitializerError
    [junit] 	at java.io.File.deleteOnExit(File.java:939)
    [junit] 	at net.sourceforge.cobertura.util.FileLocker.<init>(FileLocker.java:80)
    [junit] 	at net.sourceforge.cobertura.coveragedata.ProjectData.saveGlobalProjectData(ProjectData.java:230)
    [junit] 	at net.sourceforge.cobertura.coveragedata.SaveTimer.run(SaveTimer.java:31)
    [junit] 	at java.lang.Thread.run(Thread.java:619)
    [junit] Caused by: java.lang.IllegalStateException: Shutdown in progress
    [junit] 	at java.lang.Shutdown.add(Shutdown.java:62)
    [junit] 	at java.lang.System$2.registerShutdownHook(System.java:1146)
    [junit] 	at java.io.DeleteOnExitHook.<clinit>(DeleteOnExitHook.java:20)
    [junit] 	... 5 more
    [junit] Testsuite: org.apache.cassandra.dht.RangeTest
    [junit] Tests run: 2, Failures: 0, Errors: 0, Time elapsed: 0.065 sec
    [junit] 
    [junit] Exception in thread "Thread-0" java.lang.ExceptionInInitializerError
    [junit] 	at java.io.File.deleteOnExit(File.java:939)
    [junit] 	at net.sourceforge.cobertura.util.FileLocker.<init>(FileLocker.java:80)
    [junit] 	at net.sourceforge.cobertura.coveragedata.ProjectData.saveGlobalProjectData(ProjectData.java:230)
    [junit] 	at net.sourceforge.cobertura.coveragedata.SaveTimer.run(SaveTimer.java:31)
    [junit] 	at java.lang.Thread.run(Thread.java:619)
    [junit] Caused by: java.lang.IllegalStateException: Shutdown in progress
    [junit] 	at java.lang.Shutdown.add(Shutdown.java:62)
    [junit] 	at java.lang.System$2.registerShutdownHook(System.java:1146)
    [junit] 	at java.io.DeleteOnExitHook.<clinit>(DeleteOnExitHook.java:20)
    [junit] 	... 5 more
    [junit] Testsuite: org.apache.cassandra.gms.ArrivalWindowTest
    [junit] Tests run: 1, Failures: 0, Errors: 0, Time elapsed: 0.106 sec
    [junit] 
    [junit] Exception in thread "Thread-0" java.lang.ExceptionInInitializerError
    [junit] 	at java.io.File.deleteOnExit(File.java:939)
    [junit] 	at net.sourceforge.cobertura.util.FileLocker.<init>(FileLocker.java:80)
    [junit] 	at net.sourceforge.cobertura.coveragedata.ProjectData.saveGlobalProjectData(ProjectData.java:230)
    [junit] 	at net.sourceforge.cobertura.coveragedata.SaveTimer.run(SaveTimer.java:31)
    [junit] 	at java.lang.Thread.run(Thread.java:619)
    [junit] Caused by: java.lang.IllegalStateException: Shutdown in progress
    [junit] 	at java.lang.Shutdown.add(Shutdown.java:62)
    [junit] 	at java.lang.System$2.registerShutdownHook(System.java:1146)
    [junit] 	at java.io.DeleteOnExitHook.<clinit>(DeleteOnExitHook.java:20)
    [junit] 	... 5 more
    [junit] Testsuite: org.apache.cassandra.gms.GossipDigestTest
    [junit] Tests run: 1, Failures: 0, Errors: 0, Time elapsed: 0.063 sec
    [junit] 
    [junit] Exception in thread "Thread-0" java.lang.ExceptionInInitializerError
    [junit] 	at java.io.File.deleteOnExit(File.java:939)
    [junit] 	at net.sourceforge.cobertura.util.FileLocker.<init>(FileLocker.java:80)
    [junit] 	at net.sourceforge.cobertura.coveragedata.ProjectData.saveGlobalProjectData(ProjectData.java:230)
    [junit] 	at net.sourceforge.cobertura.coveragedata.SaveTimer.run(SaveTimer.java:31)
    [junit] 	at java.lang.Thread.run(Thread.java:619)
    [junit] Caused by: java.lang.IllegalStateException: Shutdown in progress
    [junit] 	at java.lang.Shutdown.add(Shutdown.java:62)
    [junit] 	at java.lang.System$2.registerShutdownHook(System.java:1146)
    [junit] 	at java.io.DeleteOnExitHook.<clinit>(DeleteOnExitHook.java:20)
    [junit] 	... 5 more
    [junit] Testsuite: org.apache.cassandra.io.DataInputBufferTest
    [junit] Tests run: 1, Failures: 0, Errors: 0, Time elapsed: 0.062 sec
    [junit] 
    [junit] Exception in thread "Thread-0" java.lang.ExceptionInInitializerError
    [junit] 	at java.io.File.deleteOnExit(File.java:939)
    [junit] 	at net.sourceforge.cobertura.util.FileLocker.<init>(FileLocker.java:80)
    [junit] 	at net.sourceforge.cobertura.coveragedata.ProjectData.saveGlobalProjectData(ProjectData.java:230)
    [junit] 	at net.sourceforge.cobertura.coveragedata.SaveTimer.run(SaveTimer.java:31)
    [junit] 	at java.lang.Thread.run(Thread.java:619)
    [junit] Caused by: java.lang.IllegalStateException: Shutdown in progress
    [junit] 	at java.lang.Shutdown.add(Shutdown.java:62)
    [junit] 	at java.lang.System$2.registerShutdownHook(System.java:1146)
    [junit] 	at java.io.DeleteOnExitHook.<clinit>(DeleteOnExitHook.java:20)
    [junit] 	... 5 more
    [junit] Testsuite: org.apache.cassandra.io.SSTableTest
    [junit] Tests run: 2, Failures: 0, Errors: 0, Time elapsed: 2.423 sec
    [junit] 
    [junit] Exception in thread "Thread-1" java.lang.ExceptionInInitializerError
    [junit] 	at java.io.File.deleteOnExit(File.java:939)
    [junit] 	at net.sourceforge.cobertura.util.FileLocker.<init>(FileLocker.java:80)
    [junit] 	at net.sourceforge.cobertura.coveragedata.ProjectData.saveGlobalProjectData(ProjectData.java:230)
    [junit] 	at net.sourceforge.cobertura.coveragedata.SaveTimer.run(SaveTimer.java:31)
    [junit] 	at java.lang.Thread.run(Thread.java:619)
    [junit] Caused by: java.lang.IllegalStateException: Shutdown in progress
    [junit] 	at java.lang.Shutdown.add(Shutdown.java:62)
    [junit] 	at java.lang.System$2.registerShutdownHook(System.java:1146)
    [junit] 	at java.io.DeleteOnExitHook.<clinit>(DeleteOnExitHook.java:20)
    [junit] 	... 5 more
    [junit] Testsuite: org.apache.cassandra.locator.RackUnawareStrategyTest
    [junit] Tests run: 3, Failures: 0, Errors: 0, Time elapsed: 0.418 sec
    [junit] 
    [junit] Exception in thread "Thread-0" java.lang.ExceptionInInitializerError
    [junit] 	at java.io.File.deleteOnExit(File.java:939)
    [junit] 	at net.sourceforge.cobertura.util.FileLocker.<init>(FileLocker.java:80)
    [junit] 	at net.sourceforge.cobertura.coveragedata.ProjectData.saveGlobalProjectData(ProjectData.java:230)
    [junit] 	at net.sourceforge.cobertura.coveragedata.SaveTimer.run(SaveTimer.java:31)
    [junit] 	at java.lang.Thread.run(Thread.java:619)
    [junit] Caused by: java.lang.IllegalStateException: Shutdown in progress
    [junit] 	at java.lang.Shutdown.add(Shutdown.java:62)
    [junit] 	at java.lang.System$2.registerShutdownHook(System.java:1146)
    [junit] 	at java.io.DeleteOnExitHook.<clinit>(DeleteOnExitHook.java:20)
    [junit] 	... 5 more
    [junit] Testsuite: org.apache.cassandra.net.CompactEndPointSerializationHelperTest
    [junit] Tests run: 1, Failures: 0, Errors: 0, Time elapsed: 0.359 sec
    [junit] 
    [junit] ------------- Standard Output ---------------
    [junit] 4
    [junit] /127.0.0.1
    [junit] ------------- ---------------- ---------------
    [junit] Exception in thread "Thread-0" java.lang.ExceptionInInitializerError
    [junit] 	at java.io.File.deleteOnExit(File.java:939)
    [junit] 	at net.sourceforge.cobertura.util.FileLocker.<init>(FileLocker.java:80)
    [junit] 	at net.sourceforge.cobertura.coveragedata.ProjectData.saveGlobalProjectData(ProjectData.java:230)
    [junit] 	at net.sourceforge.cobertura.coveragedata.SaveTimer.run(SaveTimer.java:31)
    [junit] 	at java.lang.Thread.run(Thread.java:619)
    [junit] Caused by: java.lang.IllegalStateException: Shutdown in progress
    [junit] 	at java.lang.Shutdown.add(Shutdown.java:62)
    [junit] 	at java.lang.System$2.registerShutdownHook(System.java:1146)
    [junit] 	at java.io.DeleteOnExitHook.<clinit>(DeleteOnExitHook.java:20)
    [junit] 	... 5 more
    [junit] Testsuite: org.apache.cassandra.service.CassandraServerTest
    [junit] Tests run: 1, Failures: 0, Errors: 0, Time elapsed: 0.317 sec
    [junit] 
    [junit] Exception in thread "Thread-1" java.lang.ExceptionInInitializerError
    [junit] 	at java.io.File.deleteOnExit(File.java:939)
    [junit] 	at net.sourceforge.cobertura.util.FileLocker.<init>(FileLocker.java:80)
    [junit] 	at net.sourceforge.cobertura.coveragedata.ProjectData.saveGlobalProjectData(ProjectData.java:230)
    [junit] 	at net.sourceforge.cobertura.coveragedata.SaveTimer.run(SaveTimer.java:31)
    [junit] 	at java.lang.Thread.run(Thread.java:619)
    [junit] Caused by: java.lang.IllegalStateException: Shutdown in progress
    [junit] 	at java.lang.Shutdown.add(Shutdown.java:62)
    [junit] 	at java.lang.System$2.registerShutdownHook(System.java:1146)
    [junit] 	at java.io.DeleteOnExitHook.<clinit>(DeleteOnExitHook.java:20)
    [junit] 	... 5 more
    [junit] Testsuite: org.apache.cassandra.service.ReadResponseResolverTest
    [junit] Tests run: 5, Failures: 0, Errors: 0, Time elapsed: 0.38 sec
    [junit] 
    [junit] Exception in thread "Thread-0" java.lang.ExceptionInInitializerError
    [junit] 	at java.io.File.deleteOnExit(File.java:939)
    [junit] 	at net.sourceforge.cobertura.util.FileLocker.<init>(FileLocker.java:80)
    [junit] 	at net.sourceforge.cobertura.coveragedata.ProjectData.saveGlobalProjectData(ProjectData.java:230)
    [junit] 	at net.sourceforge.cobertura.coveragedata.SaveTimer.run(SaveTimer.java:31)
    [junit] 	at java.lang.Thread.run(Thread.java:619)
    [junit] Caused by: java.lang.IllegalStateException: Shutdown in progress
    [junit] 	at java.lang.Shutdown.add(Shutdown.java:62)
    [junit] 	at java.lang.System$2.registerShutdownHook(System.java:1146)
    [junit] 	at java.io.DeleteOnExitHook.<clinit>(DeleteOnExitHook.java:20)
    [junit] 	... 5 more
    [junit] Testsuite: org.apache.cassandra.tools.SSTableExportTest
    [junit] Tests run: 2, Failures: 0, Errors: 0, Time elapsed: 0.549 sec
    [junit] 
    [junit] Exception in thread "Thread-0" java.lang.ExceptionInInitializerError
    [junit] 	at java.io.File.deleteOnExit(File.java:939)
    [junit] 	at net.sourceforge.cobertura.util.FileLocker.<init>(FileLocker.java:80)
    [junit] 	at net.sourceforge.cobertura.coveragedata.ProjectData.saveGlobalProjectData(ProjectData.java:230)
    [junit] 	at net.sourceforge.cobertura.coveragedata.SaveTimer.run(SaveTimer.java:31)
    [junit] 	at java.lang.Thread.run(Thread.java:619)
    [junit] Caused by: java.lang.IllegalStateException: Shutdown in progress
    [junit] 	at java.lang.Shutdown.add(Shutdown.java:62)
    [junit] 	at java.lang.System$2.registerShutdownHook(System.java:1146)
    [junit] 	at java.io.DeleteOnExitHook.<clinit>(DeleteOnExitHook.java:20)
    [junit] 	... 5 more
    [junit] Testsuite: org.apache.cassandra.tools.SSTableImportTest
    [junit] Tests run: 2, Failures: 0, Errors: 0, Time elapsed: 0.486 sec
    [junit] 
    [junit] Exception in thread "Thread-0" java.lang.ExceptionInInitializerError
    [junit] 	at java.io.File.deleteOnExit(File.java:939)
    [junit] 	at net.sourceforge.cobertura.util.FileLocker.<init>(FileLocker.java:80)
    [junit] 	at net.sourceforge.cobertura.coveragedata.ProjectData.saveGlobalProjectData(ProjectData.java:230)
    [junit] 	at net.sourceforge.cobertura.coveragedata.SaveTimer.run(SaveTimer.java:31)
    [junit] 	at java.lang.Thread.run(Thread.java:619)
    [junit] Caused by: java.lang.IllegalStateException: Shutdown in progress
    [junit] 	at java.lang.Shutdown.add(Shutdown.java:62)
    [junit] 	at java.lang.System$2.registerShutdownHook(System.java:1146)
    [junit] 	at java.io.DeleteOnExitHook.<clinit>(DeleteOnExitHook.java:20)
    [junit] 	... 5 more
    [junit] Testsuite: org.apache.cassandra.utils.BloomFilterTest
    [junit] Tests run: 5, Failures: 0, Errors: 0, Time elapsed: 2.2 sec
    [junit] 
    [junit] Exception in thread "Thread-0" java.lang.ExceptionInInitializerError
    [junit] 	at java.io.File.deleteOnExit(File.java:939)
    [junit] 	at net.sourceforge.cobertura.util.FileLocker.<init>(FileLocker.java:80)
    [junit] 	at net.sourceforge.cobertura.coveragedata.ProjectData.saveGlobalProjectData(ProjectData.java:230)
    [junit] 	at net.sourceforge.cobertura.coveragedata.SaveTimer.run(SaveTimer.java:31)
    [junit] 	at java.lang.Thread.run(Thread.java:619)
    [junit] Caused by: java.lang.IllegalStateException: Shutdown in progress
    [junit] 	at java.lang.Shutdown.add(Shutdown.java:62)
    [junit] 	at java.lang.System$2.registerShutdownHook(System.java:1146)
    [junit] 	at java.io.DeleteOnExitHook.<clinit>(DeleteOnExitHook.java:20)
    [junit] 	... 5 more
    [junit] Testsuite: org.apache.cassandra.utils.BoundedStatsDequeTest
    [junit] Tests run: 1, Failures: 0, Errors: 0, Time elapsed: 0.063 sec
    [junit] 
    [junit] Exception in thread "Thread-0" java.lang.ExceptionInInitializerError
    [junit] 	at java.io.File.deleteOnExit(File.java:939)
    [junit] 	at net.sourceforge.cobertura.util.FileLocker.<init>(FileLocker.java:80)
    [junit] 	at net.sourceforge.cobertura.coveragedata.ProjectData.saveGlobalProjectData(ProjectData.java:230)
    [junit] 	at net.sourceforge.cobertura.coveragedata.SaveTimer.run(SaveTimer.java:31)
    [junit] 	at java.lang.Thread.run(Thread.java:619)
    [junit] Caused by: java.lang.IllegalStateException: Shutdown in progress
    [junit] 	at java.lang.Shutdown.add(Shutdown.java:62)
    [junit] 	at java.lang.System$2.registerShutdownHook(System.java:1146)
    [junit] 	at java.io.DeleteOnExitHook.<clinit>(DeleteOnExitHook.java:20)
    [junit] 	... 5 more
    [junit] Testsuite: org.apache.cassandra.utils.FBUtilitiesTest
    [junit] Tests run: 2, Failures: 0, Errors: 0, Time elapsed: 0.109 sec
    [junit] 
    [junit] Exception in thread "Thread-0" java.lang.ExceptionInInitializerError
    [junit] 	at java.io.File.deleteOnExit(File.java:939)
    [junit] 	at net.sourceforge.cobertura.util.FileLocker.<init>(FileLocker.java:80)
    [junit] 	at net.sourceforge.cobertura.coveragedata.ProjectData.saveGlobalProjectData(ProjectData.java:230)
    [junit] 	at net.sourceforge.cobertura.coveragedata.SaveTimer.run(SaveTimer.java:31)
    [junit] 	at java.lang.Thread.run(Thread.java:619)
    [junit] Caused by: java.lang.IllegalStateException: Shutdown in progress
    [junit] 	at java.lang.Shutdown.add(Shutdown.java:62)
    [junit] 	at java.lang.System$2.registerShutdownHook(System.java:1146)
    [junit] 	at java.io.DeleteOnExitHook.<clinit>(DeleteOnExitHook.java:20)
    [junit] 	... 5 more
    [junit] Testsuite: org.apache.cassandra.utils.FilterTest
    [junit] Tests run: 1, Failures: 0, Errors: 0, Time elapsed: 1.361 sec
    [junit] 
    [junit] Exception in thread "Thread-0" java.lang.ExceptionInInitializerError
    [junit] 	at java.io.File.deleteOnExit(File.java:939)
    [junit] 	at net.sourceforge.cobertura.util.FileLocker.<init>(FileLocker.java:80)
    [junit] 	at net.sourceforge.cobertura.coveragedata.ProjectData.saveGlobalProjectData(ProjectData.java:230)
    [junit] 	at net.sourceforge.cobertura.coveragedata.SaveTimer.run(SaveTimer.java:31)
    [junit] 	at java.lang.Thread.run(Thread.java:619)
    [junit] Caused by: java.lang.IllegalStateException: Shutdown in progress
    [junit] 	at java.lang.Shutdown.add(Shutdown.java:62)
    [junit] 	at java.lang.System$2.registerShutdownHook(System.java:1146)
    [junit] 	at java.io.DeleteOnExitHook.<clinit>(DeleteOnExitHook.java:20)
    [junit] 	... 5 more

BUILD FAILED
<http://hudson.zones.apache.org/hudson/job/Cassandra/ws/cassandra/build.xml>:243: Some
test(s) failed.

Total time: 2 minutes 50 seconds
Publishing Javadoc
Archiving artifacts
Recording test results


Mime
View raw message