incubator-cassandra-dev mailing list archives

Site index · List index
Message view « Date » · « Thread »
Top « Date » · « Thread »
From Apache Hudson Server <hud...@hudson.zones.apache.org>
Subject Build failed in Hudson: Cassandra #62
Date Wed, 06 May 2009 15:25:52 GMT
See http://hudson.zones.apache.org/hudson/job/Cassandra/62/

------------------------------------------
[...truncated 274 lines...]
  [javadoc] Loading source file http://hudson.zones.apache.org/hudson/job/Cassandra/ws/cassandra/src/java/org/apache/cassandra/net/SelectionKeyHandler.java...

  [javadoc] Loading source file http://hudson.zones.apache.org/hudson/job/Cassandra/ws/cassandra/src/java/org/apache/cassandra/net/SelectorManager.java...

  [javadoc] Loading source file http://hudson.zones.apache.org/hudson/job/Cassandra/ws/cassandra/src/java/org/apache/cassandra/net/TcpConnection.java...

  [javadoc] Loading source file http://hudson.zones.apache.org/hudson/job/Cassandra/ws/cassandra/src/java/org/apache/cassandra/net/TcpConnectionHandler.java...

  [javadoc] Loading source file http://hudson.zones.apache.org/hudson/job/Cassandra/ws/cassandra/src/java/org/apache/cassandra/net/TcpConnectionManager.java...

  [javadoc] Loading source file http://hudson.zones.apache.org/hudson/job/Cassandra/ws/cassandra/src/java/org/apache/cassandra/net/UdpConnection.java...

  [javadoc] Loading source file http://hudson.zones.apache.org/hudson/job/Cassandra/ws/cassandra/src/java/org/apache/cassandra/net/http/ColumnFamilyFormatter.java...

  [javadoc] Loading source file http://hudson.zones.apache.org/hudson/job/Cassandra/ws/cassandra/src/java/org/apache/cassandra/net/http/HTMLFormatter.java...

  [javadoc] Loading source file http://hudson.zones.apache.org/hudson/job/Cassandra/ws/cassandra/src/java/org/apache/cassandra/net/http/HttpConnection.java...

  [javadoc] Loading source file http://hudson.zones.apache.org/hudson/job/Cassandra/ws/cassandra/src/java/org/apache/cassandra/net/http/HttpConnectionHandler.java...

  [javadoc] Loading source file http://hudson.zones.apache.org/hudson/job/Cassandra/ws/cassandra/src/java/org/apache/cassandra/net/http/HttpHeaderParser.java...

  [javadoc] Loading source file http://hudson.zones.apache.org/hudson/job/Cassandra/ws/cassandra/src/java/org/apache/cassandra/net/http/HttpParsingException.java...

  [javadoc] Loading source file http://hudson.zones.apache.org/hudson/job/Cassandra/ws/cassandra/src/java/org/apache/cassandra/net/http/HttpProtocolConstants.java...

  [javadoc] Loading source file http://hudson.zones.apache.org/hudson/job/Cassandra/ws/cassandra/src/java/org/apache/cassandra/net/http/HttpRequest.java...

  [javadoc] Loading source file http://hudson.zones.apache.org/hudson/job/Cassandra/ws/cassandra/src/java/org/apache/cassandra/net/http/HttpRequestHandler.java...

  [javadoc] Loading source file http://hudson.zones.apache.org/hudson/job/Cassandra/ws/cassandra/src/java/org/apache/cassandra/net/http/HttpResponse.java...

  [javadoc] Loading source file http://hudson.zones.apache.org/hudson/job/Cassandra/ws/cassandra/src/java/org/apache/cassandra/net/http/HttpStartLineParser.java...

  [javadoc] Loading source file http://hudson.zones.apache.org/hudson/job/Cassandra/ws/cassandra/src/java/org/apache/cassandra/net/http/HttpWriteResponse.java...

  [javadoc] Loading source file http://hudson.zones.apache.org/hudson/job/Cassandra/ws/cassandra/src/java/org/apache/cassandra/net/io/ContentLengthState.java...

  [javadoc] Loading source file http://hudson.zones.apache.org/hudson/job/Cassandra/ws/cassandra/src/java/org/apache/cassandra/net/io/ContentState.java...

  [javadoc] Loading source file http://hudson.zones.apache.org/hudson/job/Cassandra/ws/cassandra/src/java/org/apache/cassandra/net/io/ContentStreamState.java...

  [javadoc] Loading source file http://hudson.zones.apache.org/hudson/job/Cassandra/ws/cassandra/src/java/org/apache/cassandra/net/io/DoneState.java...

  [javadoc] Loading source file http://hudson.zones.apache.org/hudson/job/Cassandra/ws/cassandra/src/java/org/apache/cassandra/net/io/FastSerializer.java...

  [javadoc] Loading source file http://hudson.zones.apache.org/hudson/job/Cassandra/ws/cassandra/src/java/org/apache/cassandra/net/io/ISerializer.java...

  [javadoc] Loading source file http://hudson.zones.apache.org/hudson/job/Cassandra/ws/cassandra/src/java/org/apache/cassandra/net/io/IStreamComplete.java...

  [javadoc] Loading source file http://hudson.zones.apache.org/hudson/job/Cassandra/ws/cassandra/src/java/org/apache/cassandra/net/io/ProtocolHeaderState.java...

  [javadoc] Loading source file http://hudson.zones.apache.org/hudson/job/Cassandra/ws/cassandra/src/java/org/apache/cassandra/net/io/ProtocolState.java...

  [javadoc] Loading source file http://hudson.zones.apache.org/hudson/job/Cassandra/ws/cassandra/src/java/org/apache/cassandra/net/io/ReadNotCompleteException.java...

  [javadoc] Loading source file http://hudson.zones.apache.org/hudson/job/Cassandra/ws/cassandra/src/java/org/apache/cassandra/net/io/SerializerAttribute.java...

  [javadoc] Loading source file http://hudson.zones.apache.org/hudson/job/Cassandra/ws/cassandra/src/java/org/apache/cassandra/net/io/SerializerType.java...

  [javadoc] Loading source file http://hudson.zones.apache.org/hudson/job/Cassandra/ws/cassandra/src/java/org/apache/cassandra/net/io/StartState.java...

  [javadoc] Loading source file http://hudson.zones.apache.org/hudson/job/Cassandra/ws/cassandra/src/java/org/apache/cassandra/net/io/StreamContextManager.java...

  [javadoc] Loading source file http://hudson.zones.apache.org/hudson/job/Cassandra/ws/cassandra/src/java/org/apache/cassandra/net/io/TcpReader.java...

  [javadoc] Loading source file http://hudson.zones.apache.org/hudson/job/Cassandra/ws/cassandra/src/java/org/apache/cassandra/net/sink/IMessageSink.java...

  [javadoc] Loading source file http://hudson.zones.apache.org/hudson/job/Cassandra/ws/cassandra/src/java/org/apache/cassandra/net/sink/SinkManager.java...

  [javadoc] Loading source file http://hudson.zones.apache.org/hudson/job/Cassandra/ws/cassandra/src/java/org/apache/cassandra/procedures/GroovyScriptRunner.java...

  [javadoc] Loading source file http://hudson.zones.apache.org/hudson/job/Cassandra/ws/cassandra/src/java/org/apache/cassandra/service/CassandraDaemon.java...

  [javadoc] Loading source file http://hudson.zones.apache.org/hudson/job/Cassandra/ws/cassandra/src/java/org/apache/cassandra/service/CassandraServer.java...

  [javadoc] Loading source file http://hudson.zones.apache.org/hudson/job/Cassandra/ws/cassandra/src/java/org/apache/cassandra/service/ConsistencyManager.java...

  [javadoc] Loading source file http://hudson.zones.apache.org/hudson/job/Cassandra/ws/cassandra/src/java/org/apache/cassandra/service/Constants.java...

  [javadoc] Loading source file http://hudson.zones.apache.org/hudson/job/Cassandra/ws/cassandra/src/java/org/apache/cassandra/service/DigestMismatchException.java...

  [javadoc] Loading source file http://hudson.zones.apache.org/hudson/job/Cassandra/ws/cassandra/src/java/org/apache/cassandra/service/IComponentShutdown.java...

  [javadoc] Loading source file http://hudson.zones.apache.org/hudson/job/Cassandra/ws/cassandra/src/java/org/apache/cassandra/service/IResponseResolver.java...

  [javadoc] Loading source file http://hudson.zones.apache.org/hudson/job/Cassandra/ws/cassandra/src/java/org/apache/cassandra/service/LeaderElector.java...

  [javadoc] Loading source file http://hudson.zones.apache.org/hudson/job/Cassandra/ws/cassandra/src/java/org/apache/cassandra/service/LoadDisseminator.java...

  [javadoc] Loading source file http://hudson.zones.apache.org/hudson/job/Cassandra/ws/cassandra/src/java/org/apache/cassandra/service/LoadInfo.java...

  [javadoc] Loading source file http://hudson.zones.apache.org/hudson/job/Cassandra/ws/cassandra/src/java/org/apache/cassandra/service/MultiQuorumResponseHandler.java...

  [javadoc] Loading source file http://hudson.zones.apache.org/hudson/job/Cassandra/ws/cassandra/src/java/org/apache/cassandra/service/QuorumResponseHandler.java...

  [javadoc] Loading source file http://hudson.zones.apache.org/hudson/job/Cassandra/ws/cassandra/src/java/org/apache/cassandra/service/RangeVerbHandler.java...

  [javadoc] Loading source file http://hudson.zones.apache.org/hudson/job/Cassandra/ws/cassandra/src/java/org/apache/cassandra/service/ReadRepairManager.java...

  [javadoc] Loading source file http://hudson.zones.apache.org/hudson/job/Cassandra/ws/cassandra/src/java/org/apache/cassandra/service/ReadResponseResolver.java...

  [javadoc] Loading source file http://hudson.zones.apache.org/hudson/job/Cassandra/ws/cassandra/src/java/org/apache/cassandra/service/StorageLoadBalancer.java...

  [javadoc] Loading source file http://hudson.zones.apache.org/hudson/job/Cassandra/ws/cassandra/src/java/org/apache/cassandra/service/StorageProxy.java...

  [javadoc] Loading source file http://hudson.zones.apache.org/hudson/job/Cassandra/ws/cassandra/src/java/org/apache/cassandra/service/StorageProxyMBean.java...

  [javadoc] Loading source file http://hudson.zones.apache.org/hudson/job/Cassandra/ws/cassandra/src/java/org/apache/cassandra/service/StorageService.java...

  [javadoc] Loading source file http://hudson.zones.apache.org/hudson/job/Cassandra/ws/cassandra/src/java/org/apache/cassandra/service/StorageServiceMBean.java...

  [javadoc] Loading source file http://hudson.zones.apache.org/hudson/job/Cassandra/ws/cassandra/src/java/org/apache/cassandra/service/StreamManager.java...

  [javadoc] Loading source file http://hudson.zones.apache.org/hudson/job/Cassandra/ws/cassandra/src/java/org/apache/cassandra/service/TokenUpdateVerbHandler.java...

  [javadoc] Loading source file http://hudson.zones.apache.org/hudson/job/Cassandra/ws/cassandra/src/java/org/apache/cassandra/service/WriteResponseResolver.java...

  [javadoc] Loading source file http://hudson.zones.apache.org/hudson/job/Cassandra/ws/cassandra/src/java/org/apache/cassandra/service/ZookeeperWatcher.java...

  [javadoc] Loading source file http://hudson.zones.apache.org/hudson/job/Cassandra/ws/cassandra/src/java/org/apache/cassandra/test/DBTest.java...

  [javadoc] Loading source file http://hudson.zones.apache.org/hudson/job/Cassandra/ws/cassandra/src/java/org/apache/cassandra/test/StressTest.java...

  [javadoc] Loading source file http://hudson.zones.apache.org/hudson/job/Cassandra/ws/cassandra/src/java/org/apache/cassandra/test/TestChoice.java...

  [javadoc] Loading source file http://hudson.zones.apache.org/hudson/job/Cassandra/ws/cassandra/src/java/org/apache/cassandra/test/TestRunner.java...

  [javadoc] Loading source file http://hudson.zones.apache.org/hudson/job/Cassandra/ws/cassandra/src/java/org/apache/cassandra/test/UtilsTest.java...

  [javadoc] Loading source file http://hudson.zones.apache.org/hudson/job/Cassandra/ws/cassandra/src/java/org/apache/cassandra/tools/AdminTool.java...

  [javadoc] Loading source file http://hudson.zones.apache.org/hudson/job/Cassandra/ws/cassandra/src/java/org/apache/cassandra/tools/IndexBuilder.java...

  [javadoc] Loading source file http://hudson.zones.apache.org/hudson/job/Cassandra/ws/cassandra/src/java/org/apache/cassandra/tools/KeyChecker.java...

  [javadoc] Loading source file http://hudson.zones.apache.org/hudson/job/Cassandra/ws/cassandra/src/java/org/apache/cassandra/tools/KeyExtracter.java...

  [javadoc] Loading source file http://hudson.zones.apache.org/hudson/job/Cassandra/ws/cassandra/src/java/org/apache/cassandra/tools/MembershipCleaner.java...

  [javadoc] Loading source file http://hudson.zones.apache.org/hudson/job/Cassandra/ws/cassandra/src/java/org/apache/cassandra/tools/MembershipCleanerVerbHandler.java...

  [javadoc] Loading source file http://hudson.zones.apache.org/hudson/job/Cassandra/ws/cassandra/src/java/org/apache/cassandra/tools/ThreadListBuilder.java...

  [javadoc] Loading source file http://hudson.zones.apache.org/hudson/job/Cassandra/ws/cassandra/src/java/org/apache/cassandra/tools/TokenUpdateVerbHandler.java...

  [javadoc] Loading source file http://hudson.zones.apache.org/hudson/job/Cassandra/ws/cassandra/src/java/org/apache/cassandra/tools/TokenUpdater.java...

  [javadoc] Loading source file http://hudson.zones.apache.org/hudson/job/Cassandra/ws/cassandra/src/java/org/apache/cassandra/utils/BasicUtilities.java...

  [javadoc] Loading source file http://hudson.zones.apache.org/hudson/job/Cassandra/ws/cassandra/src/java/org/apache/cassandra/utils/BitSetSerializer.java...

  [javadoc] Loading source file http://hudson.zones.apache.org/hudson/job/Cassandra/ws/cassandra/src/java/org/apache/cassandra/utils/BloomCalculations.java...

  [javadoc] Loading source file http://hudson.zones.apache.org/hudson/job/Cassandra/ws/cassandra/src/java/org/apache/cassandra/utils/BloomFilter.java...

  [javadoc] Loading source file http://hudson.zones.apache.org/hudson/job/Cassandra/ws/cassandra/src/java/org/apache/cassandra/utils/Cachetable.java...

  [javadoc] Loading source file http://hudson.zones.apache.org/hudson/job/Cassandra/ws/cassandra/src/java/org/apache/cassandra/utils/DestructivePQIterator.java...

  [javadoc] Loading source file http://hudson.zones.apache.org/hudson/job/Cassandra/ws/cassandra/src/java/org/apache/cassandra/utils/FBUtilities.java...

  [javadoc] Loading source file http://hudson.zones.apache.org/hudson/job/Cassandra/ws/cassandra/src/java/org/apache/cassandra/utils/FastHash.java...

  [javadoc] Loading source file http://hudson.zones.apache.org/hudson/job/Cassandra/ws/cassandra/src/java/org/apache/cassandra/utils/FastHashMap.java...

  [javadoc] Loading source file http://hudson.zones.apache.org/hudson/job/Cassandra/ws/cassandra/src/java/org/apache/cassandra/utils/FastLinkedHashMap.java...

  [javadoc] Loading source file http://hudson.zones.apache.org/hudson/job/Cassandra/ws/cassandra/src/java/org/apache/cassandra/utils/FastObjectHash.java...

  [javadoc] Loading source file http://hudson.zones.apache.org/hudson/job/Cassandra/ws/cassandra/src/java/org/apache/cassandra/utils/FileUtils.java...

  [javadoc] Loading source file http://hudson.zones.apache.org/hudson/job/Cassandra/ws/cassandra/src/java/org/apache/cassandra/utils/Filter.java...

  [javadoc] Loading source file http://hudson.zones.apache.org/hudson/job/Cassandra/ws/cassandra/src/java/org/apache/cassandra/utils/GuidGenerator.java...

  [javadoc] Loading source file http://hudson.zones.apache.org/hudson/job/Cassandra/ws/cassandra/src/java/org/apache/cassandra/utils/HashingSchemes.java...

  [javadoc] Loading source file http://hudson.zones.apache.org/hudson/job/Cassandra/ws/cassandra/src/java/org/apache/cassandra/utils/ICacheExpungeHook.java...

  [javadoc] Loading source file http://hudson.zones.apache.org/hudson/job/Cassandra/ws/cassandra/src/java/org/apache/cassandra/utils/ICachetable.java...

  [javadoc] Loading source file http://hudson.zones.apache.org/hudson/job/Cassandra/ws/cassandra/src/java/org/apache/cassandra/utils/Log4jLogger.java...

  [javadoc] Loading source file http://hudson.zones.apache.org/hudson/job/Cassandra/ws/cassandra/src/java/org/apache/cassandra/utils/LogUtil.java...

  [javadoc] Loading source file http://hudson.zones.apache.org/hudson/job/Cassandra/ws/cassandra/src/java/org/apache/cassandra/utils/MurmurHash.java...

  [javadoc] Loading source file http://hudson.zones.apache.org/hudson/job/Cassandra/ws/cassandra/src/java/org/apache/cassandra/utils/PrimeFinder.java...

  [javadoc] Loading source file http://hudson.zones.apache.org/hudson/job/Cassandra/ws/cassandra/src/java/org/apache/cassandra/utils/SafeMessageDigest.java...

  [javadoc] Loading source file http://hudson.zones.apache.org/hudson/job/Cassandra/ws/cassandra/src/java/org/apache/cassandra/utils/XMLUtils.java...

  [javadoc] Constructing Javadoc information...
  [javadoc] Standard Doclet version 1.6.0_11
  [javadoc] Building tree for all the packages and classes...
  [javadoc] http://hudson.zones.apache.org/hudson/job/Cassandra/ws/cassandra/src/java/org/apache/cassandra/concurrent/ContinuationsExecutor.java
:299: warning - Tag @link: reference not found: ExecutorService
  [javadoc] http://hudson.zones.apache.org/hudson/job/Cassandra/ws/cassandra/src/java/org/apache/cassandra/concurrent/ContinuationsExecutor.java
:299: warning - Tag @link: reference not found: SynchronousQueue
  [javadoc] http://hudson.zones.apache.org/hudson/job/Cassandra/ws/cassandra/src/java/org/apache/cassandra/concurrent/ContinuationsExecutor.java
:299: warning - Tag @link: reference not found: LinkedBlockingQueue
  [javadoc] http://hudson.zones.apache.org/hudson/job/Cassandra/ws/cassandra/src/java/org/apache/cassandra/concurrent/ContinuationsExecutor.java
:299: warning - Tag @link: reference not found: ArrayBlockingQueue
  [javadoc] http://hudson.zones.apache.org/hudson/job/Cassandra/ws/cassandra/src/java/org/apache/cassandra/concurrent/ContinuationsExecutor.java
:2109: warning - Tag @link: reference not found: FutureTask
  [javadoc] http://hudson.zones.apache.org/hudson/job/Cassandra/ws/cassandra/src/java/org/apache/cassandra/service/StorageProxy.java
:429: warning - @return tag has no arguments.
  [javadoc] http://hudson.zones.apache.org/hudson/job/Cassandra/ws/cassandra/src/java/org/apache/cassandra/service/StorageProxy.java
:429: warning - @param argument "tablename" is not a parameter name.
  [javadoc] http://hudson.zones.apache.org/hudson/job/Cassandra/ws/cassandra/src/java/org/apache/cassandra/service/StorageProxy.java
:429: warning - @param argument "columnFamily" is not a parameter name.
  [javadoc] http://hudson.zones.apache.org/hudson/job/Cassandra/ws/cassandra/src/java/org/apache/cassandra/service/StorageProxy.java
:429: warning - @param argument "start" is not a parameter name.
  [javadoc] http://hudson.zones.apache.org/hudson/job/Cassandra/ws/cassandra/src/java/org/apache/cassandra/service/StorageProxy.java
:429: warning - @param argument "count" is not a parameter name.
  [javadoc] http://hudson.zones.apache.org/hudson/job/Cassandra/ws/cassandra/src/java/org/apache/cassandra/service/StorageProxy.java
:634: warning - @param argument "tablename" is not a parameter name.
  [javadoc] http://hudson.zones.apache.org/hudson/job/Cassandra/ws/cassandra/src/java/org/apache/cassandra/service/StorageProxy.java
:634: warning - @param argument "columnFamily" is not a parameter name.
  [javadoc] http://hudson.zones.apache.org/hudson/job/Cassandra/ws/cassandra/src/java/org/apache/cassandra/service/StorageProxy.java
:634: warning - @param argument "columns" is not a parameter name.
  [javadoc] http://hudson.zones.apache.org/hudson/job/Cassandra/ws/cassandra/src/java/org/apache/cassandra/service/StorageServiceMBean.java
:60: warning - @param argument "sources" is not a parameter name.
  [javadoc] http://hudson.zones.apache.org/hudson/job/Cassandra/ws/cassandra/src/java/org/apache/cassandra/concurrent/ContinuationsExecutor.java
:299: warning - Tag @link: reference not found: ExecutorService
  [javadoc] http://hudson.zones.apache.org/hudson/job/Cassandra/ws/cassandra/src/java/org/apache/cassandra/concurrent/ContinuationsExecutor.java
:299: warning - Tag @link: reference not found: ExecutorService
  [javadoc] Building index for all the packages and classes...
  [javadoc] http://hudson.zones.apache.org/hudson/job/Cassandra/ws/cassandra/src/java/org/apache/cassandra/concurrent/ContinuationsExecutor.java
:299: warning - Tag @link: reference not found: ExecutorService
  [javadoc] Building index for all classes...
  [javadoc] Generating http://hudson.zones.apache.org/hudson/job/Cassandra/ws/cassandra/build/javadoc/stylesheet.css...

  [javadoc] 17 warnings

release:
    [mkdir] Created dir: http://hudson.zones.apache.org/hudson/job/Cassandra/ws/cassandra/build/dist

     [copy] Copying 23 files to http://hudson.zones.apache.org/hudson/job/Cassandra/ws/cassandra/build/dist/lib

     [copy] Copying 792 files to http://hudson.zones.apache.org/hudson/job/Cassandra/ws/cassandra/build/dist/javadoc

     [copy] Copying 4 files to http://hudson.zones.apache.org/hudson/job/Cassandra/ws/cassandra/build/dist/bin

     [copy] Copying 2 files to http://hudson.zones.apache.org/hudson/job/Cassandra/ws/cassandra/build/dist/conf

     [copy] Copying 1 file to http://hudson.zones.apache.org/hudson/job/Cassandra/ws/cassandra/build/dist/interface

     [copy] Copying 3 files to http://hudson.zones.apache.org/hudson/job/Cassandra/ws/cassandra/build/dist

      [tar] Building tar: http://hudson.zones.apache.org/hudson/job/Cassandra/62/artifact/cassandra/build/cassandra-0.3.0-dev.tgz


build-subprojects:

init:

check-gen-cli-grammar:

gen-cli-grammar:

check-gen-cql-grammar:

gen-cql-grammar:

build-project:
     [echo] cassandra: http://hudson.zones.apache.org/hudson/job/Cassandra/ws/cassandra/build.xml


build:

build-test:
    [javac] Compiling 22 source files to http://hudson.zones.apache.org/hudson/job/Cassandra/ws/cassandra/build/test/classes

    [javac] Note: http://hudson.zones.apache.org/hudson/job/Cassandra/ws/cassandra/test/unit/org/apache/cassandra/io/SSTableTest.java
 uses unchecked or unsafe operations.
    [javac] Note: Recompile with -Xlint:unchecked for details.

test:
     [echo] running tests
    [mkdir] Created dir: http://hudson.zones.apache.org/hudson/job/Cassandra/ws/cassandra/build/test/cassandra

   [testng] [Parser] Running:
   [testng]   Ant suite
   [testng] 
   [testng] WARN   run, Warning : Unable to delete file http://hudson.zones.apache.org/hudson/job/Cassandra/ws/cassandra/build/test/cassandra/commitlog/CommitLog-Table1-1241624707382.log

   [testng] WARN   run, Warning : Unable to delete file http://hudson.zones.apache.org/hudson/job/Cassandra/ws/cassandra/build/test/cassandra/commitlog/CommitLog-Table1-1241624708003.log

   [testng] WARN   run, Warning : Unable to delete file http://hudson.zones.apache.org/hudson/job/Cassandra/ws/cassandra/build/test/cassandra/commitlog/CommitLog-Table1-1241624708011.log

   [testng] WARN   run, Warning : Unable to delete file http://hudson.zones.apache.org/hudson/job/Cassandra/ws/cassandra/build/test/cassandra/commitlog/CommitLog-Table1-1241624708019.log

   [testng] WARN   run, Warning : Unable to delete file http://hudson.zones.apache.org/hudson/job/Cassandra/ws/cassandra/build/test/cassandra/commitlog/CommitLog-Table1-1241624708035.log

   [testng] WARN   run, Warning : Unable to delete file http://hudson.zones.apache.org/hudson/job/Cassandra/ws/cassandra/build/test/cassandra/commitlog/CommitLog-Table1-1241624708848.log

   [testng] WARN   run, Warning : Unable to delete file http://hudson.zones.apache.org/hudson/job/Cassandra/ws/cassandra/build/test/cassandra/commitlog/CommitLog-Table1-1241624708852.log

   [testng] WARN   run, Warning : Unable to delete file http://hudson.zones.apache.org/hudson/job/Cassandra/ws/cassandra/build/test/cassandra/commitlog/CommitLog-Table1-1241624708864.log

   [testng] WARN   run, Warning : Unable to delete file http://hudson.zones.apache.org/hudson/job/Cassandra/ws/cassandra/build/test/cassandra/commitlog/CommitLog-Table1-1241624708915.log

   [testng] WARN   run, Warning : Unable to delete file http://hudson.zones.apache.org/hudson/job/Cassandra/ws/cassandra/build/test/cassandra/commitlog/CommitLog-Table1-1241624708970.log

   [testng] WARN   run, Warning : Unable to delete file http://hudson.zones.apache.org/hudson/job/Cassandra/ws/cassandra/build/test/cassandra/commitlog/CommitLog-Table1-1241624708983.log

   [testng] WARN   run, Warning : Unable to delete file http://hudson.zones.apache.org/hudson/job/Cassandra/ws/cassandra/build/test/cassandra/commitlog/CommitLog-Table1-1241624708990.log

   [testng] WARN   run, Warning : Unable to delete file http://hudson.zones.apache.org/hudson/job/Cassandra/ws/cassandra/build/test/cassandra/commitlog/CommitLog-Table1-1241624708997.log

   [testng] PASSED: testShouldHaveConfigFileNameAvailable
   [testng] PASSED: testGT
   [testng] PASSED: testLT
   [testng] PASSED: testTimeSort
   [testng] PASSED: testRemoveColumnFamilyWithFlush1
   [testng] PASSED: testRemoveColumnFamilyWithFlush2
   [testng] PASSED: testRemoveSubColumn
   [testng] PASSED: testGetCompactionBuckets
   [testng] PASSED: testNameSort
   [testng] PASSED: testRemoveColumn
   [testng] PASSED: testCompaction
   [testng] PASSED: testRemoveColumnFamily
   [testng] PASSED: testGetColumnCount
   [testng] PASSED: testMergeAndAdd
   [testng] PASSED: testManyColumns
   [testng] PASSED: testSingleColumn
   [testng] PASSED: testTimestamp
   [testng] PASSED: testMain
   [testng] PASSED: testMain
   [testng] PASSED: testRangeFilterOnColumns
   [testng] PASSED: testRangeFilterOnSuperColumns
   [testng] PASSED: testRangeFilterOnColumnsWithCount
   [testng] PASSED: testMakeReadMessage
   [testng] PASSED: testGetColumn
   [testng] PASSED: testDoRecovery
   [testng] PASSED: testDiffColumnFamily
   [testng] PASSED: testRepair
   [testng] PASSED: testDiffSuperColumn
   [testng] PASSED: testMissingSubcolumn
   [testng] PASSED: testMain
   [testng] PASSED: testOpen
   [testng] PASSED: testGetRowSuperColumnOffsetCount
   [testng] PASSED: testGetRowOffsetCount
   [testng] PASSED: testGetRowSingleColumn
   [testng] PASSED: testGetRowOffsetCountFromDisk
   [testng] PASSED: testRange
   [testng] PASSED: testSmall
   [testng] PASSED: testSingleWrite
   [testng] PASSED: testManyWrites
   [testng] PASSED: testSerialize
   [testng] PASSED: testFalsePositivesRandom
   [testng] PASSED: testFalsePositivesInt
   [testng] PASSED: testWords
   [testng] PASSED: testOne
   [testng] PASSED: testManyRandom
   [testng] FAILED: testRemoveSuperColumn
   [testng] java.lang.IndexOutOfBoundsException: Index: 1, Size: 1
   [testng] 	at java.util.ArrayList.RangeCheck(ArrayList.java:547)
   [testng] 	at java.util.ArrayList.get(ArrayList.java:322)
   [testng] 	at org.apache.cassandra.db.ColumnFamilyStoreTest.testRemoveSuperColumn(ColumnFamilyStoreTest.java:261)
   [testng] ... Removed 22 stack frames
   [testng] FAILED: testGetColumnWithWrongBF
   [testng] java.lang.IndexOutOfBoundsException: Index: 0, Size: 0
   [testng] 	at java.util.ArrayList.RangeCheck(ArrayList.java:547)
   [testng] 	at java.util.ArrayList.get(ArrayList.java:322)
   [testng] 	at org.apache.cassandra.db.ColumnFamilyStoreTest.testGetColumnWithWrongBF(ColumnFamilyStoreTest.java:431)
   [testng] ... Removed 22 stack frames
   [testng] 
   [testng] ===============================================
   [testng]     Ant test
   [testng]     Tests run: 47, Failures: 2, Skips: 0
   [testng] ===============================================
   [testng] 
   [testng] 
   [testng] ===============================================
   [testng] Ant suite
   [testng] Total tests run: 47, Failures: 2, Skips: 0
   [testng] ===============================================
   [testng] 

BUILD FAILED
http://hudson.zones.apache.org/hudson/job/Cassandra/ws/cassandra/build.xml :195: The tests
failed.

Total time: 19 seconds
Publishing Javadoc
Recording test results


Mime
View raw message