incubator-bval-commits mailing list archives

Site index · List index
Message view « Date » · « Thread »
Top « Date » · « Thread »
From Apache Hudson Server <hud...@hudson.apache.org>
Subject Build failed in Hudson: BeanValidation-trunk-linux-tck-deploy #56
Date Wed, 27 Oct 2010 05:10:18 GMT
See <https://hudson.apache.org/hudson/job/BeanValidation-trunk-linux-tck-deploy/56/changes>

Changes:

[dwoods] BVAL-84 Need slf4j-simple for testcase logging on IBM SDK....

[dwoods] BVAL-84 CNFEX org.slf4j.impl.StaticLoggerBinder building xstream and guice.  Patch
contributed by Albert Lee.

------------------------------------------
[...truncated 2378 lines...]
[ERROR] Artifact: org.jboss.deployers:jboss-deployers-vfs-spi:jar:2.0.7.GA has no file.
[ERROR] Artifact: org.jboss.ejb3:jboss-ejb3:pom:1.1.5 has no file.
[ERROR] Artifact: org.jboss.ejb3:jboss-ejb3-as-int:jar:1.1.5 has no file.
[ERROR] Artifact: org.jboss.ejb3:jboss-ejb3-cache:jar:1.0.0 has no file.
[ERROR] Artifact: org.jboss.ejb3:jboss-ejb3-common:jar:client:1.0.0 has no file.
[ERROR] Artifact: org.jboss.ejb3:jboss-ejb3-common:jar:1.0.0 has no file.
[ERROR] Artifact: org.jboss.ejb3:jboss-ejb3-core:jar:client:1.1.5 has no file.
[ERROR] Artifact: org.jboss.ejb3:jboss-ejb3-core:jar:1.1.5 has no file.
[ERROR] Artifact: org.jboss.ejb3:jboss-ejb3-deployers:jar:1.0.0 has no file.
[ERROR] Artifact: org.jboss.ejb3:jboss-ejb3-endpoint:jar:0.1.0 has no file.
[ERROR] Artifact: org.jboss.ejb3:jboss-ejb3-ext-api:jar:1.0.0 has no file.
[ERROR] Artifact: org.jboss.ejb3:jboss-ejb3-ext-api-impl:jar:1.0.0 has no file.
[ERROR] Artifact: org.jboss.ejb3:jboss-ejb3-interceptors:jar:1.0.2 has no file.
[ERROR] Artifact: org.jboss.ejb3:jboss-ejb3-mc-int:jar:1.0.1 has no file.
[ERROR] Artifact: org.jboss.ejb3:jboss-ejb3-metadata:jar:1.0.0 has no file.
[ERROR] Artifact: org.jboss.ejb3:jboss-ejb3-proxy-clustered:jar:client:1.0.1 has no file.
[ERROR] Artifact: org.jboss.ejb3:jboss-ejb3-proxy-clustered:jar:1.0.1 has no file.
[ERROR] Artifact: org.jboss.ejb3:jboss-ejb3-proxy-impl:jar:client:1.0.2 has no file.
[ERROR] Artifact: org.jboss.ejb3:jboss-ejb3-proxy-impl:jar:1.0.2 has no file.
[ERROR] Artifact: org.jboss.ejb3:jboss-ejb3-proxy-spi:jar:client:1.0.0 has no file.
[ERROR] Artifact: org.jboss.ejb3:jboss-ejb3-proxy-spi:jar:1.0.0 has no file.
[ERROR] Artifact: org.jboss.ejb3:jboss-ejb3-security:jar:client:1.0.0 has no file.
[ERROR] Artifact: org.jboss.ejb3:jboss-ejb3-security:jar:1.0.0 has no file.
[ERROR] Artifact: org.jboss.ejb3:jboss-ejb3-timerservice-spi:jar:1.0.0 has no file.
[ERROR] Artifact: org.jboss.ejb3:jboss-ejb3-transactions:jar:1.0.0 has no file.
[ERROR] Artifact: org.jboss.integration:jboss-classloading-spi:jar:5.1.0.GA has no file.
[ERROR] Artifact: org.jboss.integration:jboss-corba-ots-spi:jar:5.1.0.GA has no file.
[ERROR] Artifact: org.jboss.integration:jboss-deployment-spi:jar:5.1.0.GA has no file.
[ERROR] Artifact: org.jboss.integration:jboss-integration:jar:5.1.0.GA has no file.
[ERROR] Artifact: org.jboss.integration:jboss-jca-spi:jar:5.0.3.GA has no file.
[ERROR] Artifact: org.jboss.integration:jboss-profileservice-spi:jar:5.1.0.GA has no file.
[ERROR] Artifact: org.jboss.integration:jboss-transaction-spi:jar:5.1.0.GA has no file.
[ERROR] Artifact: org.jboss.javaee:jboss-ejb-api:jar:3.0.0.GA has no file.
[ERROR] Artifact: org.jboss.javaee:jboss-jacc-api:jar:1.1.0.GA_SP1 has no file.
[ERROR] Artifact: org.jboss.javaee:jboss-jad-api:jar:1.2.0.GA has no file.
[ERROR] Artifact: org.jboss.javaee:jboss-jaspi-api:jar:1.0.0.GA has no file.
[ERROR] Artifact: org.jboss.javaee:jboss-javaee:jar:5.0.1.GA has no file.
[ERROR] Artifact: org.jboss.javaee:jboss-jca-api:jar:1.5.0.GA has no file.
[ERROR] Artifact: org.jboss.javaee:jboss-jms-api:jar:1.1.0.GA has no file.
[ERROR] Artifact: org.jboss.javaee:jboss-transaction-api:jar:1.0.1.GA has no file.
[ERROR] Artifact: org.jboss.jbossas:jboss-as-aspects:jar:5.1.0.GA has no file.
[ERROR] Artifact: org.jboss.jbossas:jboss-as-client:pom:5.1.0.GA has no file.
[ERROR] Artifact: org.jboss.jbossas:jboss-as-cluster:jar:jboss-ha-legacy-client:5.1.0.GA has
no file.
[ERROR] Artifact: org.jboss.jbossas:jboss-as-cluster:jar:5.1.0.GA has no file.
[ERROR] Artifact: org.jboss.jbossas:jboss-as-connector:jar:5.1.0.GA has no file.
[ERROR] Artifact: org.jboss.jbossas:jboss-as-deployment:jar:5.1.0.GA has no file.
[ERROR] Artifact: org.jboss.jbossas:jboss-as-ejb3:jar:client:5.1.0.GA has no file.
[ERROR] Artifact: org.jboss.jbossas:jboss-as-iiop:jar:client:5.1.0.GA has no file.
[ERROR] Artifact: org.jboss.jbossas:jboss-as-iiop:jar:5.1.0.GA has no file.
[ERROR] Artifact: org.jboss.jbossas:jboss-as-j2se:jar:5.1.0.GA has no file.
[ERROR] Artifact: org.jboss.jbossas:jboss-as-j2se:test-jar:tests:5.1.0.GA has no file.
[ERROR] Artifact: org.jboss.jbossas:jboss-as-jmx:jar:5.1.0.GA has no file.
[ERROR] Artifact: org.jboss.jbossas:jboss-as-main:jar:client:5.1.0.GA has no file.
[ERROR] Artifact: org.jboss.jbossas:jboss-as-main:jar:5.1.0.GA has no file.
[ERROR] Artifact: org.jboss.jbossas:jboss-as-management:jar:jsr77-client:5.1.0.GA has no file.
[ERROR] Artifact: org.jboss.jbossas:jboss-as-mbeans:jar:5.1.0.GA has no file.
[ERROR] Artifact: org.jboss.jbossas:jboss-as-profileservice:jar:5.1.0.GA has no file.
[ERROR] Artifact: org.jboss.jbossas:jboss-as-security:jar:5.1.0.GA has no file.
[ERROR] Artifact: org.jboss.jbossas:jboss-as-server:jar:client:5.1.0.GA has no file.
[ERROR] Artifact: org.jboss.jbossas:jboss-as-server:jar:jmx-invoker-adaptor-client:5.1.0.GA
has no file.
[ERROR] Artifact: org.jboss.jbossas:jboss-as-server:jar:5.1.0.GA has no file.
[ERROR] Artifact: org.jboss.jbossas:jboss-as-system:jar:client:5.1.0.GA has no file.
[ERROR] Artifact: org.jboss.jbossas:jboss-as-system:jar:5.1.0.GA has no file.
[ERROR] Artifact: org.jboss.jbossas:jboss-as-system-jmx:jar:client:5.1.0.GA has no file.
[ERROR] Artifact: org.jboss.jbossas:jboss-as-system-jmx:jar:5.1.0.GA has no file.
[ERROR] Artifact: org.jboss.jbossas:jboss-server-manager:jar:1.0.2.GA has no file.
[ERROR] Artifact: org.jboss.jpa:jboss-jpa-deployers:jar:1.0.0 has no file.
[ERROR] Artifact: org.jboss.logbridge:jboss-logbridge:jar:1.0.0.GA has no file.
[ERROR] Artifact: org.jboss.logging:jboss-logging-jdk:jar:2.1.0.GA has no file.
[ERROR] Artifact: org.jboss.logging:jboss-logging-log4j:jar:2.1.0.GA has no file.
[ERROR] Artifact: org.jboss.logging:jboss-logging-spi:jar:2.1.0.GA has no file.
[ERROR] Artifact: org.jboss.logmanager:jboss-logmanager:jar:1.0.0.GA has no file.
[ERROR] Artifact: org.jboss.man:jboss-managed:jar:2.1.0.CR8 has no file.
[ERROR] Artifact: org.jboss.man:jboss-metatype:jar:2.1.0.SP1 has no file.
[ERROR] Artifact: org.jboss.metadata:jboss-metadata:jar:1.0.1.GA has no file.
[ERROR] Artifact: org.jboss.microcontainer:jboss-aop-mc-int:jar:2.0.6.GA has no file.
[ERROR] Artifact: org.jboss.microcontainer:jboss-dependency:jar:2.0.6.GA has no file.
[ERROR] Artifact: org.jboss.microcontainer:jboss-kernel:jar:2.0.6.GA has no file.
[ERROR] Artifact: org.jboss.naming:jnp-client:jar:5.0.3.GA has no file.
[ERROR] Artifact: org.jboss.naming:jnpserver:jar:5.0.3.GA has no file.
[ERROR] Artifact: org.jboss.remoting:jboss-remoting:jar:2.5.1 has no file.
[ERROR] Artifact: org.jboss.security:jboss-security-spi:jar:2.0.3.SP1 has no file.
[ERROR] Artifact: org.jboss.security:jbosssx:jar:2.0.3.SP1 has no file.
[ERROR] Artifact: org.jboss.security:jbosssx-client:jar:2.0.3.SP1 has no file.
[ERROR] Artifact: org.jboss.security:jbossxacml:jar:2.0.3 has no file.
[ERROR] Artifact: org.jboss.slf4j:slf4j-jboss-logging:jar:1.0.2.GA has no file.
[ERROR] Artifact: org.jboss.test:jboss-test:jar:1.1.4.GA has no file.
[ERROR] Artifact: org.jboss.test-audit:jboss-test-audit-api:jar:1.0.0 has no file.
[ERROR] Artifact: org.jboss.test-harness:jboss-test-harness:jar:1.0.0 has no file.
[ERROR] Artifact: org.jboss.test-harness:jboss-test-harness-api:jar:1.0.0 has no file.
[ERROR] Artifact: org.jboss.ws:jbossws-spi:jar:1.0.3.GA has no file.
[ERROR] Artifact: org.jboss.ws.native:jbossws-native-jaxrpc:jar:3.0.4.GA has no file.
[ERROR] Artifact: org.jboss.ws.native:jbossws-native-jaxws:jar:3.1.2.GA has no file.
[ERROR] Artifact: org.jboss.ws.native:jbossws-native-saaj:jar:3.1.2.GA has no file.
[ERROR] Artifact: org.slf4j:jcl-over-slf4j:jar:1.6.1 has no file.
[ERROR] Artifact: org.slf4j:slf4j-api:jar:1.6.1 has no file.
[ERROR] Artifact: oswego-concurrent:concurrent:jar:1.3.4-jboss-update1 has no file.
[ERROR] Artifact: qdox:qdox:jar:1.6.1 has no file.
[ERROR] Artifact: quartz:quartz:jar:1.6.0 has no file.
[ERROR] Artifact: stax:stax-api:jar:1.0 has no file.
[ERROR] Artifact: sun-jaxb:jaxb-api:jar:2.1.9-brew has no file.
[ERROR] Artifact: sun-jaxws:jaxws-api:jar:2.1.1 has no file.
[ERROR] Artifact: sun-jaxws:jsr181-api:jar:2.1.1 has no file.
[ERROR] Artifact: trove:trove:jar:2.1.1 has no file.
[ERROR] Artifact: wutka-dtdparser:dtdparser121:jar:1.2.1 has no file.
[ERROR] Artifact: xml-apis:xml-apis:jar:1.0.b2 has no file.
[WARNING] The repository url 'http://download.oracle.com/maven/' is invalid - Repository 'berkeleydb-je.repository'
will be blacklisted.
Downloading: http://repository.apache.org/snapshots/org/apache/bval/bval-core/0.3-incubating-SNAPSHOT/bval-core-0.3-incubating-SNAPSHOT.jar
[INFO] Unable to find resource 'org.apache.bval:bval-core:jar:0.3-incubating-SNAPSHOT' in
repository apache.snapshots (http://repository.apache.org/snapshots)
Downloading: http://repository.apache.org/snapshots/org/apache/bval/bval-jsr303/0.3-incubating-SNAPSHOT/bval-jsr303-0.3-incubating-SNAPSHOT.jar
[INFO] Unable to find resource 'org.apache.bval:bval-jsr303:jar:0.3-incubating-SNAPSHOT' in
repository apache.snapshots (http://repository.apache.org/snapshots)
[INFO] Generating "Source Repository" report.
[INFO] Generating "Plugin Management" report.
[INFO] Generating "Mailing Lists" report.
[INFO] Generating "Project Summary" report.
[INFO] Generating "About" report.
[INFO] Generating "JDepend" report.
[INFO] Generating "Project License" report.
[INFO] Generating "Dependency Convergence" report.
[HUDSON] Archiving site from <https://hudson.apache.org/hudson/job/BeanValidation-trunk-linux-tck-deploy/ws/trunk/bval-tck/target/site>
to /home/hudson/hudson/jobs/BeanValidation-trunk-linux-tck-deploy/site/bval-tck-runner
[INFO] [enforcer:enforce {execution: default}]
[INFO] [buildnumber:create {execution: default}]
[INFO] [remote-resources:process {execution: process-remote-resources}]
[INFO] [remote-resources:process {execution: default}]
[INFO] [resources:resources {execution: default-resources}]
[INFO] Using 'UTF-8' encoding to copy filtered resources.
[INFO] Copying 1 resource
[INFO] Copying 4 resources
[INFO] Copying 4 resources
[INFO] [compiler:compile {execution: default-compile}]
[INFO] Nothing to compile - all classes are up to date
[INFO] Preparing javadoc:javadoc
[WARNING] Removing: javadoc from forked lifecycle, to prevent recursive invocation.
[INFO] [enforcer:enforce {execution: default}]
[INFO] [buildnumber:create {execution: default}]
[WARNING] DEPRECATED [aggregate]: since 2.5. Use the goals <code>javadoc:aggregate</code>
and <code>javadoc:test-aggregate</code> instead.
[INFO] [javadoc:javadoc {execution: default}]
[INFO] [dependency:copy {execution: copy}]
[INFO] Configured Artifact: org.hibernate.jsr303.tck:jsr303-tck:suite:?:xml
[INFO] Configured Artifact: org.apache.geronimo.specs:geronimo-validation_1.0_spec:?:jar
[INFO] Configured Artifact: org.apache.bval:org.apache.bval.bundle:0.3-incubating-SNAPSHOT:jar
[INFO] Configured Artifact: commons-lang:commons-lang:?:jar
[INFO] Configured Artifact: commons-beanutils:commons-beanutils:?:jar
[INFO] Configured Artifact: com.thoughtworks.xstream:xstream:?:jar
[INFO] Configured Artifact: commons-collections:commons-collections:?:jar
[INFO] Configured Artifact: org.slf4j:slf4j-api:?:jar
[INFO] Configured Artifact: org.slf4j:jcl-over-slf4j:?:jar
[INFO] Configured Artifact: org.slf4j:slf4j-log4j12:?:jar
[INFO] org.hibernate.jsr303.tck:jsr303-tck:suite:1.0.3.GA:xml already exists in <https://hudson.apache.org/hudson/job/BeanValidation-trunk-linux-tck-deploy/ws/trunk/bval-tck/target/dependency>
[INFO] Copying geronimo-validation_1.0_spec-1.1.jar to <https://hudson.apache.org/hudson/job/BeanValidation-trunk-linux-tck-deploy/ws/trunk/bval-tck/target/dependency/lib/geronimo-validation_1.0_spec.jar>
[INFO] Copying org.apache.bval.bundle-0.3-incubating-SNAPSHOT.jar to <https://hudson.apache.org/hudson/job/BeanValidation-trunk-linux-tck-deploy/ws/trunk/bval-tck/target/dependency/lib/org.apache.bval.bundle.jar>
[INFO] Copying commons-lang-2.4.jar to <https://hudson.apache.org/hudson/job/BeanValidation-trunk-linux-tck-deploy/ws/trunk/bval-tck/target/dependency/lib/commons-lang.jar>
[INFO] Copying commons-beanutils-1.8.3.jar to <https://hudson.apache.org/hudson/job/BeanValidation-trunk-linux-tck-deploy/ws/trunk/bval-tck/target/dependency/lib/commons-beanutils.jar>
[INFO] Copying xstream-1.3.1.jar to <https://hudson.apache.org/hudson/job/BeanValidation-trunk-linux-tck-deploy/ws/trunk/bval-tck/target/dependency/lib/xstream.jar>
[INFO] Copying commons-collections-3.2.1.jar to <https://hudson.apache.org/hudson/job/BeanValidation-trunk-linux-tck-deploy/ws/trunk/bval-tck/target/dependency/lib/commons-collections.jar>
[INFO] Copying slf4j-api-1.6.1.jar to <https://hudson.apache.org/hudson/job/BeanValidation-trunk-linux-tck-deploy/ws/trunk/bval-tck/target/dependency/lib/slf4j-api.jar>
[INFO] Copying jcl-over-slf4j-1.6.1.jar to <https://hudson.apache.org/hudson/job/BeanValidation-trunk-linux-tck-deploy/ws/trunk/bval-tck/target/dependency/lib/jcl-over-slf4j.jar>
[INFO] Copying slf4j-log4j12-1.6.1.jar to <https://hudson.apache.org/hudson/job/BeanValidation-trunk-linux-tck-deploy/ws/trunk/bval-tck/target/dependency/lib/slf4j-log4j12.jar>
[INFO] [resources:testResources {execution: default-testResources}]
[INFO] Using 'UTF-8' encoding to copy filtered resources.
[INFO] Copying 2 resources
[INFO] Copying 4 resources
[INFO] Copying 4 resources
[INFO] [compiler:testCompile {execution: default-testCompile}]
[INFO] Nothing to compile - all classes are up to date
[WARNING] DEPRECATED [systemProperties]: Use systemPropertyVariables instead.
[INFO] [surefire:test {execution: default-test}]
[INFO] Surefire report directory: <https://hudson.apache.org/hudson/job/BeanValidation-trunk-linux-tck-deploy/ws/trunk/bval-tck/target/surefire-reports>

-------------------------------------------------------
 T E S T S
-------------------------------------------------------
Running TestSuite
SLF4J: Class path contains multiple SLF4J bindings.
SLF4J: Found binding in [jar:file:/home/hudson/.m2/repository/org/slf4j/slf4j-log4j12/1.6.1/slf4j-log4j12-1.6.1.jar!/org/slf4j/impl/StaticLoggerBinder.class]
SLF4J: Found binding in [jar:file:/home/hudson/.m2/repository/org/jboss/slf4j/slf4j-jboss-logging/1.0.2.GA/slf4j-jboss-logging-1.0.2.GA.jar!/org/slf4j/impl/StaticLoggerBinder.class]
SLF4J: See http://www.slf4j.org/codes.html#multiple_bindings for an explanation.
05:10:06,746 INFO  [xml.ValidationParser] Using org.hibernate.jsr303.tck.common.TCKValidationProvider
as validation provider.
05:10:07,717 INFO  [xml.ValidationParser] Using org.hibernate.jsr303.tck.tests.xmlconfiguration.XmlDefinedConstraintValidatorFactory
as constraint factory.
05:10:07,783 INFO  [xml.ValidationParser] Using org.hibernate.jsr303.tck.common.TCKValidationProvider
as validation provider.
05:10:08,077 INFO  [xml.ValidationParser] Using org.hibernate.jsr303.tck.tests.xmlconfiguration.XmlDefinedMessageInterpolator
as message interpolator.
05:10:08,259 INFO  [xml.ValidationParser] Using org.hibernate.jsr303.tck.tests.xmlconfiguration.XmlDefinedTraversableResolver
as traversable resolver.
05:10:08,447 INFO  [jsr303.ConfigurationImpl] ignoreXmlConfiguration == true
05:10:09,069 INFO  [jsr303.ConfigurationImpl] ignoreXmlConfiguration == true
05:10:09,173 INFO  [jsr303.ConfigurationImpl] ignoreXmlConfiguration == true
Cannot instantiate : class org.apache.bval.jsr303.ApacheValidatorFactory
[XmlMethodSelector] CLASSNAME:org.jboss.testharness.impl.testng.DisableIntegrationTestsMethodSelector
[XmlMethodSelector] SETTING PRIORITY:0
[XmlMethodSelector] CLASSNAME:org.jboss.testharness.impl.testng.ExcludeIncontainerUnderInvestigationMethodSelector
[XmlMethodSelector] SETTING PRIORITY:0
Tests run: 244, Failures: 0, Errors: 0, Skipped: 0, Time elapsed: 6.313 sec

Results :

Tests run: 244, Failures: 0, Errors: 0, Skipped: 0

[HUDSON] Recording test results
[INFO] Preparing surefire-report:report-only
[WARNING] Removing: report-only from forked lifecycle, to prevent recursive invocation.
[WARNING] Removing: javadoc from forked lifecycle, to prevent recursive invocation.
[INFO] [enforcer:enforce {execution: default}]
[INFO] [buildnumber:create {execution: default}]
[INFO] [surefire-report:report-only {execution: generate-test-report}]
[WARNING] Unable to locate Test Source XRef to link to - DISABLED
[INFO] [jar:jar {execution: default-jar}]
[INFO] Building jar: <https://hudson.apache.org/hudson/job/BeanValidation-trunk-linux-tck-deploy/ws/trunk/bval-tck/target/bval-tck-runner-0.3-incubating-SNAPSHOT.jar>
[INFO] [javadoc:jar {execution: attach-javadoc}]
[INFO] [apache-rat:check {execution: default}]
[INFO] Exclude: README.txt
[INFO] Exclude: CHANGES.txt
[INFO] Exclude: release.properties
[INFO] Exclude: DEPENDENCIES
[INFO] Exclude: **/.*/**
[INFO] Exclude: **/*.log
[INFO] Exclude: **/maven-eclipse.xml
[INFO] Exclude: **/rat.txt
[INFO] Exclude: **/target/**/*
[INFO] Exclude: **/*.iml
[INFO] [ianal:verify-legal-files {execution: default}]
[INFO] Checking legal files in: bval-tck-runner-0.3-incubating-SNAPSHOT.jar
[INFO] [install:install {execution: default-install}]
[INFO] Installing <https://hudson.apache.org/hudson/job/BeanValidation-trunk-linux-tck-deploy/ws/trunk/bval-tck/target/bval-tck-runner-0.3-incubating-SNAPSHOT.jar>
to /home/hudson/.m2/repository/org/apache/bval/bval-tck-runner/0.3-incubating-SNAPSHOT/bval-tck-runner-0.3-incubating-SNAPSHOT.jar
[INFO] [deploy:deploy {execution: default-deploy}]
[INFO] Skipping artifact deployment
[HUDSON] Archiving <https://hudson.apache.org/hudson/job/BeanValidation-trunk-linux-tck-deploy/ws/trunk/bval-tck/target/bval-tck-runner-0.3-incubating-SNAPSHOT.jar>
to /home/hudson/hudson/jobs/BeanValidation-trunk-linux-tck-deploy/modules/org.apache.bval$bval-tck-runner/builds/2010-10-27_04-54-47/archive/org.apache.bval/bval-tck-runner/0.3-incubating-SNAPSHOT/bval-tck-runner-0.3-incubating-SNAPSHOT.jar
[INFO] 
[INFO] 
[INFO] ------------------------------------------------------------------------
[INFO] Reactor Summary:
[INFO] ------------------------------------------------------------------------
[INFO] Apache Bean Validation :: bval-parent (Parent POM) .... SUCCESS [1:02.017s]
[INFO] Apache Bean Validation :: bval-core ................... SUCCESS [3:06.340s]
[INFO] Apache Bean Validation :: bval-xstream (optional) ..... SUCCESS [2:04.320s]
[INFO] Apache Bean Validation :: bval-jsr303 ................. SUCCESS [1:50.540s]
[INFO] Apache Bean Validation :: org.apache.bval.bundle ...... SUCCESS [23.611s]
[INFO] Apache Bean Validation :: bval-json (optional) ........ SUCCESS [1:14.804s]
[INFO] Apache Bean Validation :: bval-guice (optional) ....... SUCCESS [1:10.564s]
[INFO] Apache Bean Validation :: bval-tck (TCK Runner) ....... SUCCESS [4:03.614s]
[INFO] ------------------------------------------------------------------------
[INFO] ------------------------------------------------------------------------
[INFO] BUILD SUCCESSFUL
[INFO] ------------------------------------------------------------------------
[INFO] Total time: 15 minutes 21 seconds
[INFO] Finished at: Wed Oct 27 05:10:17 UTC 2010
[INFO] Final Memory: 154M/453M
[INFO] ------------------------------------------------------------------------
Sending e-mails to: bval-commits@incubator.apache.org
Sending e-mails to: bval-commits@incubator.apache.org
channel stopped


Mime
View raw message