incubator-bval-commits mailing list archives

Site index · List index
Message view « Date » · « Thread »
Top « Date » · « Thread »
From Apache Hudson Server <hud...@hudson.zones.apache.org>
Subject Build failed in Hudson: BeanValidation-trunk » Apache Bean Validation :: bval-json (optional) #1
Date Fri, 21 May 2010 19:30:04 GMT
See <http://hudson.zones.apache.org/hudson/job/BeanValidation-trunk/org.apache.bval$bval-json/1/>

------------------------------------------
[INFO] ------------------------------------------------------------------------
[INFO] Building Apache Bean Validation :: bval-json (optional)
[INFO]    task-segment: [clean, package]
[INFO] ------------------------------------------------------------------------
[INFO] [clean:clean {execution: default-clean}]
Downloading: http://repo1.maven.org/maven2/org/freemarker/freemarker/2.3.15/freemarker-2.3.15.pom

Downloading: http://repo1.maven.org/maven2/org/freemarker/freemarker/2.3.15/freemarker-2.3.15.jar
Downloading: http://repository.apache.org/snapshots/org/apache/bval/bval-core/0.1-incubating-SNAPSHOT/bval-core-0.1-incubating-20100521.131635-18-tests.jar
27K downloaded  (bval-core-0.1-incubating-20100521.131635-18-tests.jar)

[INFO] [enforcer:enforce {execution: default}]
[INFO] [remote-resources:process {execution: default}]
Downloading: http://repository.apache.org/snapshots/org/apache/bval/bval-core/0.1-incubating-SNAPSHOT/bval-core-0.1-incubating-20100521.131635-18.pom
6K downloaded  (bval-core-0.1-incubating-20100521.131635-18.pom)
[INFO] [resources:resources {execution: default-resources}]
[INFO] Using 'UTF-8' encoding to copy filtered resources.
[INFO] Copying 1 resource
[INFO] Copying 4 resources
[INFO] [compiler:compile {execution: default-compile}]
[INFO] Compiling 1 source file to C:\hudson\hudson-slave\workspace\BeanValidation-trunk\trunk\bval-json\target\classes
[INFO] [resources:testResources {execution: default-testResources}]
[INFO] Using 'UTF-8' encoding to copy filtered resources.
[INFO] skip non existing resourceDirectory C:\hudson\hudson-slave\workspace\BeanValidation-trunk\trunk\bval-json\src\test\resources
[INFO] Copying 0 resource to META-INF
[INFO] Copying 4 resources
[INFO] [compiler:testCompile {execution: default-testCompile}]
[INFO] Compiling 1 source file to C:\hudson\hudson-slave\workspace\BeanValidation-trunk\trunk\bval-json\target\test-classes
[INFO] -------------------------------------------------------------
[ERROR] COMPILATION ERROR : 
[INFO] -------------------------------------------------------------
[ERROR] Failure executing javac, but could not parse the error:


The system is out of resources.
Consult the following stack trace for details.
java.lang.OutOfMemoryError: Java heap space
	at com.sun.tools.javac.zip.ZipFileIndex$ZipDirectory.buildIndex(ZipFileIndex.java:731)
	at com.sun.tools.javac.zip.ZipFileIndex$ZipDirectory.access$000(ZipFileIndex.java:652)
	at com.sun.tools.javac.zip.ZipFileIndex.checkIndex(ZipFileIndex.java:261)
	at com.sun.tools.javac.zip.ZipFileIndex.<init>(ZipFileIndex.java:209)
	at com.sun.tools.javac.zip.ZipFileIndex.getZipFileIndex(ZipFileIndex.java:115)
	at com.sun.tools.javac.util.DefaultFileManager.openArchive(DefaultFileManager.java:645)
	at com.sun.tools.javac.util.DefaultFileManager.listDirectory(DefaultFileManager.java:325)
	at com.sun.tools.javac.util.DefaultFileManager.list(DefaultFileManager.java:872)
	at com.sun.tools.javac.jvm.ClassReader.fillIn(ClassReader.java:2077)
	at com.sun.tools.javac.jvm.ClassReader.complete(ClassReader.java:1781)
	at com.sun.tools.javac.code.Symbol.complete(Symbol.java:386)
	at com.sun.tools.javac.comp.Enter.visitTopLevel(Enter.java:272)
	at com.sun.tools.javac.tree.JCTree$JCCompilationUnit.accept(JCTree.java:446)
	at com.sun.tools.javac.comp.Enter.classEnter(Enter.java:236)
	at com.sun.tools.javac.comp.Enter.classEnter(Enter.java:250)
	at com.sun.tools.javac.comp.Enter.complete(Enter.java:444)
	at com.sun.tools.javac.comp.Enter.main(Enter.java:429)
	at com.sun.tools.javac.main.JavaCompiler.enterTrees(JavaCompiler.java:819)
	at com.sun.tools.javac.main.JavaCompiler.compile(JavaCompiler.java:727)
	at com.sun.tools.javac.main.Main.compile(Main.java:353)
	at com.sun.tools.javac.main.Main.compile(Main.java:279)
	at com.sun.tools.javac.main.Main.compile(Main.java:270)
	at com.sun.tools.javac.Main.compile(Main.java:87)
	at sun.reflect.NativeMethodAccessorImpl.invoke0(Native Method)
	at sun.reflect.NativeMethodAccessorImpl.invoke(NativeMethodAccessorImpl.java:39)
	at sun.reflect.DelegatingMethodAccessorImpl.invoke(DelegatingMethodAccessorImpl.java:25)
	at java.lang.reflect.Method.invoke(Method.java:597)
	at org.codehaus.plexus.compiler.javac.JavacCompiler.compileInProcess(JavacCompiler.java:484)
	at org.codehaus.plexus.compiler.javac.JavacCompiler.compile(JavacCompiler.java:155)
	at org.apache.maven.plugin.AbstractCompilerMojo.execute(AbstractCompilerMojo.java:575)
	at org.apache.maven.plugin.TestCompilerMojo.execute(TestCompilerMojo.java:146)
	at org.apache.maven.plugin.DefaultPluginManager.executeMojo(DefaultPluginManager.java:490)

[INFO] 1error
[INFO] -------------------------------------------------------------
[HUDSON] Archiving C:\hudson\hudson-slave\workspace\BeanValidation-trunk\trunk\bval-json\pom.xml
to /export/home/hudson/hudson/jobs/BeanValidation-trunk/modules/org.apache.bval$bval-json/builds/2010-05-21_19-26-42/archive/org.apache.bval/bval-json/0.1-incubating-SNAPSHOT/pom.xml
[INFO] ------------------------------------------------------------------------
[ERROR] BUILD FAILURE
[INFO] ------------------------------------------------------------------------
[INFO] Compilation failure
Failure executing javac, but could not parse the error:


The system is out of resources.
Consult the following stack trace for details.
java.lang.OutOfMemoryError: Java heap space
	at com.sun.tools.javac.zip.ZipFileIndex$ZipDirectory.buildIndex(ZipFileIndex.java:731)
	at com.sun.tools.javac.zip.ZipFileIndex$ZipDirectory.access$000(ZipFileIndex.java:652)
	at com.sun.tools.javac.zip.ZipFileIndex.checkIndex(ZipFileIndex.java:261)
	at com.sun.tools.javac.zip.ZipFileIndex.<init>(ZipFileIndex.java:209)
	at com.sun.tools.javac.zip.ZipFileIndex.getZipFileIndex(ZipFileIndex.java:115)
	at com.sun.tools.javac.util.DefaultFileManager.openArchive(DefaultFileManager.java:645)
	at com.sun.tools.javac.util.DefaultFileManager.listDirectory(DefaultFileManager.java:325)
	at com.sun.tools.javac.util.DefaultFileManager.list(DefaultFileManager.java:872)
	at com.sun.tools.javac.jvm.ClassReader.fillIn(ClassReader.java:2077)
	at com.sun.tools.javac.jvm.ClassReader.complete(ClassReader.java:1781)
	at com.sun.tools.javac.code.Symbol.complete(Symbol.java:386)
	at com.sun.tools.javac.comp.Enter.visitTopLevel(Enter.java:272)
	at com.sun.tools.javac.tree.JCTree$JCCompilationUnit.accept(JCTree.java:446)
	at com.sun.tools.javac.comp.Enter.classEnter(Enter.java:236)
	at com.sun.tools.javac.comp.Enter.classEnter(Enter.java:250)
	at com.sun.tools.javac.comp.Enter.complete(Enter.java:444)
	at com.sun.tools.javac.comp.Enter.main(Enter.java:429)
	at com.sun.tools.javac.main.JavaCompiler.enterTrees(JavaCompiler.java:819)
	at com.sun.tools.javac.main.JavaCompiler.compile(JavaCompiler.java:727)
	at com.sun.tools.javac.main.Main.compile(Main.java:353)
	at com.sun.tools.javac.main.Main.compile(Main.java:279)
	at com.sun.tools.javac.main.Main.compile(Main.java:270)
	at com.sun.tools.javac.Main.compile(Main.java:87)
	at sun.reflect.NativeMethodAccessorImpl.invoke0(Native Method)
	at sun.reflect.NativeMethodAccessorImpl.invoke(NativeMethodAccessorImpl.java:39)
	at sun.reflect.DelegatingMethodAccessorImpl.invoke(DelegatingMethodAccessorImpl.java:25)
	at java.lang.reflect.Method.invoke(Method.java:597)
	at org.codehaus.plexus.compiler.javac.JavacCompiler.compileInProcess(JavacCompiler.java:484)
	at org.codehaus.plexus.compiler.javac.JavacCompiler.compile(JavacCompiler.java:155)
	at org.apache.maven.plugin.AbstractCompilerMojo.execute(AbstractCompilerMojo.java:575)
	at org.apache.maven.plugin.TestCompilerMojo.execute(TestCompilerMojo.java:146)
	at org.apache.maven.plugin.DefaultPluginManager.executeMojo(DefaultPluginManager.java:490)


[INFO] ------------------------------------------------------------------------
[INFO] For more information, run Maven with the -e switch
[INFO] ------------------------------------------------------------------------
[INFO] Total time: 3 minutes 4 seconds
[INFO] Finished at: Fri May 21 20:26:27 BST 2010
[INFO] Final Memory: 76M/81M
[INFO] ------------------------------------------------------------------------
Waiting for Hudson to finish collecting data


Mime
View raw message