incubator-blur-dev mailing list archives

Site index · List index
Message view « Date » · « Thread »
Top « Date » · « Thread »
From Apache Jenkins Server <jenk...@builds.apache.org>
Subject Build failed in Jenkins: Blur-master-jdk7 #1734
Date Thu, 18 Jun 2015 20:45:59 GMT
See <https://builds.apache.org/job/Blur-master-jdk7/1734/changes>

Changes:

[amccurry] Fixed hadoop1 hadoop2 issue.

------------------------------------------
[...truncated 4076 lines...]
expected =<a.id_f:[0.0 TO 2.0]>
actual   =<a.id_f:[0.0 TO 2.0]>
expected =<a.id_i:[0 TO 2]>
actual   =<a.id_i:[0 TO 2]>
Tests run: 44, Failures: 0, Errors: 0, Skipped: 0, Time elapsed: 0.526 sec - in org.apache.blur.lucene.search.SuperParserTest
Running org.apache.blur.lucene.search.SuperQueryTest
doc 0 score 2.3944716
doc 1 score 2.3944716
doc 2 score 0.5986179
doc 0 score 2.0
doc 1 score 2.0
doc 2 score 0.5
doc 0 score 3.261864
doc 1 score 3.1695762
doc 2 score 0.79239404
doc 0 score 3.261864
doc 1 score 3.1695762
doc 2 score 0.79239404
doc 0 score 3.5917075
doc 1 score 2.3944716
doc 2 score 0.5986179
Tests run: 6, Failures: 0, Errors: 0, Skipped: 0, Time elapsed: 0.723 sec - in org.apache.blur.lucene.search.SuperQueryTest
Running org.apache.blur.lucene.serializer.QueryWritableTest
Tests run: 1, Failures: 0, Errors: 0, Skipped: 0, Time elapsed: 0.109 sec - in org.apache.blur.lucene.serializer.QueryWritableTest

Results :

Tests run: 110, Failures: 0, Errors: 0, Skipped: 0

[JENKINS] Recording test results
[INFO] 
[INFO] --- maven-jar-plugin:2.5:jar (default-jar) @ blur-query ---
[INFO] Building jar: <https://builds.apache.org/job/Blur-master-jdk7/ws/blur-query/target/blur-query-hadoop1-1.2.1-0.2.4-incubating-SNAPSHOT.jar>
[INFO] 
[INFO] --- maven-site-plugin:3.4:attach-descriptor (attach-descriptor) @ blur-query ---
[INFO] 
[INFO] --- apache-rat-plugin:0.10:check (default) @ blur-query ---
[INFO] 51 implicit excludes (use -debug for more details).
[INFO] Exclude: LICENSE
[INFO] Exclude: CHANGES.txt
[INFO] Exclude: DISCLAIMER
[INFO] Exclude: NOTICE
[INFO] Exclude: README
[INFO] Exclude: **/README.textile
[INFO] Exclude: **/README.md
[INFO] Exclude: **/.classpath
[INFO] Exclude: **/.project
[INFO] Exclude: **/.settings/**
[INFO] Exclude: **/.idea/**
[INFO] Exclude: **/*.iml
[INFO] Exclude: **/target/**
[INFO] Exclude: **/build/**
[INFO] Exclude: **/.codio
[INFO] Exclude: **/src/main/webapp/libs/**
[INFO] Exclude: **/node_modules/**
[INFO] Exclude: **/src/main/webapp/public/css/**
[INFO] Exclude: **/src/main/webapp/js/utils/*
[INFO] Exclude: **/src/main/webapp/public/js/modernizr.js
[INFO] Exclude: **/src/main/webapp/less/tagmanager.less
[INFO] Exclude: **/src/main/webapp/node_modules/**
[INFO] Exclude: **/src/main/webapp/.sass-cache/**
[INFO] Exclude: **/src/main/webapp/.tmp/**
[INFO] Exclude: **/.editorconfig
[INFO] Exclude: **/.jshintrc
[INFO] Exclude: **/package.json
[INFO] Exclude: **/src/main/scripts/grunt.sh
[INFO] Exclude: **/src/main/webapp/coverage/**
[INFO] Exclude: contrib/blur-console-v1/**
[INFO] Exclude: **/src/main/resources/org/apache/blur/thrift/util/words.txt
[INFO] Exclude: **/js/d3.v2.js
[INFO] Exclude: **/js/d3.v2.min.js
[INFO] Exclude: **/src/main/resources*/license-notes.txt
[INFO] Exclude: **/src/main/resources*/NOTICE-bin.base.txt
[INFO] Exclude: **/src/main/resources*/NOTICE-bin.txt
[INFO] Exclude: **/src/main/resources*/notices/*.src
[INFO] Exclude: **/src/main/scripts/conf/controllers
[INFO] Exclude: **/src/main/scripts/conf/consoles
[INFO] Exclude: **/src/main/scripts/conf/default_zoo.cfg
[INFO] Exclude: **/src/main/scripts/conf/shards
[INFO] Exclude: **/src/main/scripts/conf/zookeepers
[INFO] Exclude: **/src/main/scripts/interface/gen-html/Blur.html
[INFO] Exclude: **/src/main/scripts/interface/gen-html/index.html
[INFO] Exclude: **/.empty
[INFO] 93 resources included (use -debug for more details)
[INFO] Rat check: Summary of files. Unapproved: 1 unknown: 1 generated: 0 approved: 92 licence.
[INFO] ------------------------------------------------------------------------
[INFO] Reactor Summary:
[INFO] 
[INFO] Blur .............................................. SUCCESS [6.397s]
[INFO] Blur Util ......................................... SUCCESS [13.312s]
[INFO] Blur Thrift ....................................... SUCCESS [11.089s]
[INFO] Blur KeyValue Store ............................... SUCCESS [17.801s]
[INFO] Blur Document Security ............................ SUCCESS [5.640s]
[INFO] Blur Store ........................................ SUCCESS [1:39.779s]
[INFO] Blur Query ........................................ FAILURE [33.833s]
[INFO] Blur Status ....................................... SKIPPED
[INFO] Blur Core ......................................... SKIPPED
[INFO] Blur Command ...................................... SKIPPED
[INFO] Blur Console ...................................... SKIPPED
[INFO] Blur Map Reduce ................................... SKIPPED
[INFO] Blur Hive ......................................... SKIPPED
[INFO] Blur Shell ........................................ SKIPPED
[INFO] Distribution ...................................... SKIPPED
[INFO] ------------------------------------------------------------------------
[INFO] BUILD FAILURE
[INFO] ------------------------------------------------------------------------
[INFO] Total time: 3:11.574s
[INFO] Finished at: Thu Jun 18 20:45:43 UTC 2015
[INFO] Final Memory: 45M/692M
[INFO] ------------------------------------------------------------------------
Waiting for Jenkins to finish collecting data
[ERROR] Failed to execute goal org.apache.rat:apache-rat-plugin:0.10:check (default) on project
blur-query: Too many files with unapproved license: 1 See RAT report in: <https://builds.apache.org/job/Blur-master-jdk7/ws/blur-query/target/rat.txt>
-> [Help 1]
[ERROR] 
[ERROR] To see the full stack trace of the errors, re-run Maven with the -e switch.
[ERROR] Re-run Maven using the -X switch to enable full debug logging.
[ERROR] 
[ERROR] For more information about the errors and possible solutions, please read the following
articles:
[ERROR] [Help 1] http://cwiki.apache.org/confluence/display/MAVEN/MojoFailureException
[ERROR] 
[ERROR] After correcting the problems, you can resume the build with the command
[ERROR]   mvn <goals> -rf :blur-query
[JENKINS] Archiving <https://builds.apache.org/job/Blur-master-jdk7/ws/pom.xml> to org.apache.blur/blur/0.2.4-incubating-SNAPSHOT/blur-0.2.4-incubating-SNAPSHOT.pom
Sending artifact delta relative to Blur-master-jdk7 » Blur #1733
Archived 1 artifacts
Archive block size is 32768
Received 0 blocks and 19286 bytes
Compression is 0.0%
Took 33 ms
[JENKINS] Archiving <https://builds.apache.org/job/Blur-master-jdk7/ws/blur-shell/pom.xml>
to org.apache.blur/blur-shell/hadoop1-1.2.1-0.2.4-incubating-SNAPSHOT/blur-shell-hadoop1-1.2.1-0.2.4-incubating-SNAPSHOT.pom
Sending artifact delta relative to Blur-master-jdk7 » Blur Shell #1731
Archived 1 artifacts
Archive block size is 32768
Received 0 blocks and 5439 bytes
Compression is 0.0%
Took 0.29 sec
[JENKINS] Archiving <https://builds.apache.org/job/Blur-master-jdk7/ws/blur-thrift/pom.xml>
to org.apache.blur/blur-thrift/hadoop1-1.2.1-0.2.4-incubating-SNAPSHOT/blur-thrift-hadoop1-1.2.1-0.2.4-incubating-SNAPSHOT.pom
[JENKINS] Archiving <https://builds.apache.org/job/Blur-master-jdk7/ws/blur-thrift/target/blur-thrift-hadoop1-1.2.1-0.2.4-incubating-SNAPSHOT.jar>
to org.apache.blur/blur-thrift/hadoop1-1.2.1-0.2.4-incubating-SNAPSHOT/blur-thrift-hadoop1-1.2.1-0.2.4-incubating-SNAPSHOT.jar
[JENKINS] Archiving <https://builds.apache.org/job/Blur-master-jdk7/ws/blur-thrift/target/blur-thrift-hadoop1-1.2.1-0.2.4-incubating-SNAPSHOT-tests.jar>
to org.apache.blur/blur-thrift/hadoop1-1.2.1-0.2.4-incubating-SNAPSHOT/blur-thrift-hadoop1-1.2.1-0.2.4-incubating-SNAPSHOT-tests.jar
[JENKINS] Archiving <https://builds.apache.org/job/Blur-master-jdk7/ws/blur-thrift/target/blur-thrift-hadoop1-1.2.1-0.2.4-incubating-SNAPSHOT-sources.jar>
to org.apache.blur/blur-thrift/hadoop1-1.2.1-0.2.4-incubating-SNAPSHOT/blur-thrift-hadoop1-1.2.1-0.2.4-incubating-SNAPSHOT-sources.jar
[JENKINS] Archiving <https://builds.apache.org/job/Blur-master-jdk7/ws/blur-thrift/target/blur-thrift-hadoop1-1.2.1-0.2.4-incubating-SNAPSHOT-test-sources.jar>
to org.apache.blur/blur-thrift/hadoop1-1.2.1-0.2.4-incubating-SNAPSHOT/blur-thrift-hadoop1-1.2.1-0.2.4-incubating-SNAPSHOT-test-sources.jar
Sending artifact delta relative to Blur-master-jdk7 » Blur Thrift #1733
Archived 5 artifacts
Archive block size is 32768
Received 2 blocks and 2952836 bytes
Compression is 2.2%
Took 1.5 sec
[JENKINS] Archiving <https://builds.apache.org/job/Blur-master-jdk7/ws/blur-query/pom.xml>
to org.apache.blur/blur-query/hadoop1-1.2.1-0.2.4-incubating-SNAPSHOT/blur-query-hadoop1-1.2.1-0.2.4-incubating-SNAPSHOT.pom
[JENKINS] Archiving <https://builds.apache.org/job/Blur-master-jdk7/ws/blur-query/target/blur-query-hadoop1-1.2.1-0.2.4-incubating-SNAPSHOT.jar>
to org.apache.blur/blur-query/hadoop1-1.2.1-0.2.4-incubating-SNAPSHOT/blur-query-hadoop1-1.2.1-0.2.4-incubating-SNAPSHOT.jar
Sending artifact delta relative to Blur-master-jdk7 » Blur Query #1733
Archived 2 artifacts
Archive block size is 32768
Received 0 blocks and 193909 bytes
Compression is 0.0%
Took 0.22 sec
[JENKINS] Archiving <https://builds.apache.org/job/Blur-master-jdk7/ws/blur-core/pom.xml>
to org.apache.blur/blur-core/hadoop1-1.2.1-0.2.4-incubating-SNAPSHOT/blur-core-hadoop1-1.2.1-0.2.4-incubating-SNAPSHOT.pom
Sending artifact delta relative to Blur-master-jdk7 » Blur Core #1731
Archived 1 artifacts
Archive block size is 32768
Received 0 blocks and 6935 bytes
Compression is 0.0%
Took 0.47 sec
[JENKINS] Archiving <https://builds.apache.org/job/Blur-master-jdk7/ws/blur-store/pom.xml>
to org.apache.blur/blur-store/hadoop1-1.2.1-0.2.4-incubating-SNAPSHOT/blur-store-hadoop1-1.2.1-0.2.4-incubating-SNAPSHOT.pom
[JENKINS] Archiving <https://builds.apache.org/job/Blur-master-jdk7/ws/blur-store/target/blur-store-hadoop1-1.2.1-0.2.4-incubating-SNAPSHOT.jar>
to org.apache.blur/blur-store/hadoop1-1.2.1-0.2.4-incubating-SNAPSHOT/blur-store-hadoop1-1.2.1-0.2.4-incubating-SNAPSHOT.jar
[JENKINS] Archiving <https://builds.apache.org/job/Blur-master-jdk7/ws/blur-store/target/blur-store-hadoop1-1.2.1-0.2.4-incubating-SNAPSHOT-tests.jar>
to org.apache.blur/blur-store/hadoop1-1.2.1-0.2.4-incubating-SNAPSHOT/blur-store-hadoop1-1.2.1-0.2.4-incubating-SNAPSHOT-tests.jar
[JENKINS] Archiving <https://builds.apache.org/job/Blur-master-jdk7/ws/blur-store/target/blur-store-hadoop1-1.2.1-0.2.4-incubating-SNAPSHOT-sources.jar>
to org.apache.blur/blur-store/hadoop1-1.2.1-0.2.4-incubating-SNAPSHOT/blur-store-hadoop1-1.2.1-0.2.4-incubating-SNAPSHOT-sources.jar
[JENKINS] Archiving <https://builds.apache.org/job/Blur-master-jdk7/ws/blur-store/target/blur-store-hadoop1-1.2.1-0.2.4-incubating-SNAPSHOT-test-sources.jar>
to org.apache.blur/blur-store/hadoop1-1.2.1-0.2.4-incubating-SNAPSHOT/blur-store-hadoop1-1.2.1-0.2.4-incubating-SNAPSHOT-test-sources.jar
Sending artifact delta relative to Blur-master-jdk7 » Blur Store #1733
Archived 5 artifacts
Archive block size is 32768
Received 0 blocks and 531472 bytes
Compression is 0.0%
Took 0.33 sec
[JENKINS] Archiving <https://builds.apache.org/job/Blur-master-jdk7/ws/blur-mapred/pom.xml>
to org.apache.blur/blur-mapred/hadoop1-1.2.1-0.2.4-incubating-SNAPSHOT/blur-mapred-hadoop1-1.2.1-0.2.4-incubating-SNAPSHOT.pom
Sending artifact delta relative to Blur-master-jdk7 » Blur Map Reduce #1731
Archived 1 artifacts
Archive block size is 32768
Received 0 blocks and 7551 bytes
Compression is 0.0%
Took 0.26 sec
[JENKINS] Archiving <https://builds.apache.org/job/Blur-master-jdk7/ws/blur-util/pom.xml>
to org.apache.blur/blur-util/hadoop1-1.2.1-0.2.4-incubating-SNAPSHOT/blur-util-hadoop1-1.2.1-0.2.4-incubating-SNAPSHOT.pom
[JENKINS] Archiving <https://builds.apache.org/job/Blur-master-jdk7/ws/blur-util/target/blur-util-hadoop1-1.2.1-0.2.4-incubating-SNAPSHOT.jar>
to org.apache.blur/blur-util/hadoop1-1.2.1-0.2.4-incubating-SNAPSHOT/blur-util-hadoop1-1.2.1-0.2.4-incubating-SNAPSHOT.jar
[JENKINS] Archiving <https://builds.apache.org/job/Blur-master-jdk7/ws/blur-util/target/blur-util-hadoop1-1.2.1-0.2.4-incubating-SNAPSHOT-sources.jar>
to org.apache.blur/blur-util/hadoop1-1.2.1-0.2.4-incubating-SNAPSHOT/blur-util-hadoop1-1.2.1-0.2.4-incubating-SNAPSHOT-sources.jar
[JENKINS] Archiving <https://builds.apache.org/job/Blur-master-jdk7/ws/blur-util/target/blur-util-hadoop1-1.2.1-0.2.4-incubating-SNAPSHOT-test-sources.jar>
to org.apache.blur/blur-util/hadoop1-1.2.1-0.2.4-incubating-SNAPSHOT/blur-util-hadoop1-1.2.1-0.2.4-incubating-SNAPSHOT-test-sources.jar
[JENKINS] Archiving <https://builds.apache.org/job/Blur-master-jdk7/ws/blur-util/target/blur-util-hadoop1-1.2.1-0.2.4-incubating-SNAPSHOT-tests.jar>
to org.apache.blur/blur-util/hadoop1-1.2.1-0.2.4-incubating-SNAPSHOT/blur-util-hadoop1-1.2.1-0.2.4-incubating-SNAPSHOT-tests.jar
Sending artifact delta relative to Blur-master-jdk7 » Blur Util #1733
Archived 5 artifacts
Archive block size is 32768
Received 0 blocks and 267119 bytes
Compression is 0.0%
Took 0.22 sec
[JENKINS] Archiving <https://builds.apache.org/job/Blur-master-jdk7/ws/distribution/pom.xml>
to org.apache.blur/apache-blur/hadoop1-1.2.1-0.2.4-incubating-SNAPSHOT/apache-blur-hadoop1-1.2.1-0.2.4-incubating-SNAPSHOT.pom
Sending artifact delta relative to Blur-master-jdk7 » Distribution #1731
Archived 1 artifacts
Archive block size is 32768
Received 0 blocks and 3878 bytes
Compression is 0.0%
Took 5.5 sec
[JENKINS] Archiving <https://builds.apache.org/job/Blur-master-jdk7/ws/blur-hive/pom.xml>
to org.apache.blur/blur-hive/hadoop1-1.2.1-0.13.1-0.2.4-incubating-SNAPSHOT/blur-hive-hadoop1-1.2.1-0.13.1-0.2.4-incubating-SNAPSHOT.pom
Sending artifact delta relative to Blur-master-jdk7 » Blur Hive #1731
Archived 1 artifacts
Archive block size is 32768
Received 0 blocks and 12496 bytes
Compression is 0.0%
Took 1.1 sec
[JENKINS] Archiving <https://builds.apache.org/job/Blur-master-jdk7/ws/blur-command/pom.xml>
to org.apache.blur/blur-command/hadoop1-1.2.1-0.2.4-incubating-SNAPSHOT/blur-command-hadoop1-1.2.1-0.2.4-incubating-SNAPSHOT.pom
Sending artifact delta relative to Blur-master-jdk7 » Blur Command #1731
Archived 1 artifacts
Archive block size is 32768
Received 0 blocks and 5830 bytes
Compression is 0.0%
Took 0.38 sec
[JENKINS] Archiving <https://builds.apache.org/job/Blur-master-jdk7/ws/blur-console/pom.xml>
to org.apache.blur/blur-console/hadoop1-1.2.1-0.2.4-incubating-SNAPSHOT/blur-console-hadoop1-1.2.1-0.2.4-incubating-SNAPSHOT.pom
Sending artifact delta relative to Blur-master-jdk7 » Blur Console #1731
Archived 1 artifacts
Archive block size is 32768
Received 0 blocks and 8650 bytes
Compression is 0.0%
Took 0.44 sec
[JENKINS] Archiving <https://builds.apache.org/job/Blur-master-jdk7/ws/blur-document-security/pom.xml>
to org.apache.blur/blur-document-security/hadoop1-1.2.1-0.2.4-incubating-SNAPSHOT/blur-document-security-hadoop1-1.2.1-0.2.4-incubating-SNAPSHOT.pom
[JENKINS] Archiving <https://builds.apache.org/job/Blur-master-jdk7/ws/blur-document-security/target/blur-document-security-hadoop1-1.2.1-0.2.4-incubating-SNAPSHOT.jar>
to org.apache.blur/blur-document-security/hadoop1-1.2.1-0.2.4-incubating-SNAPSHOT/blur-document-security-hadoop1-1.2.1-0.2.4-incubating-SNAPSHOT.jar
[JENKINS] Archiving <https://builds.apache.org/job/Blur-master-jdk7/ws/blur-document-security/target/blur-document-security-hadoop1-1.2.1-0.2.4-incubating-SNAPSHOT-tests.jar>
to org.apache.blur/blur-document-security/hadoop1-1.2.1-0.2.4-incubating-SNAPSHOT/blur-document-security-hadoop1-1.2.1-0.2.4-incubating-SNAPSHOT-tests.jar
[JENKINS] Archiving <https://builds.apache.org/job/Blur-master-jdk7/ws/blur-document-security/target/blur-document-security-hadoop1-1.2.1-0.2.4-incubating-SNAPSHOT-sources.jar>
to org.apache.blur/blur-document-security/hadoop1-1.2.1-0.2.4-incubating-SNAPSHOT/blur-document-security-hadoop1-1.2.1-0.2.4-incubating-SNAPSHOT-sources.jar
[JENKINS] Archiving <https://builds.apache.org/job/Blur-master-jdk7/ws/blur-document-security/target/blur-document-security-hadoop1-1.2.1-0.2.4-incubating-SNAPSHOT-test-sources.jar>
to org.apache.blur/blur-document-security/hadoop1-1.2.1-0.2.4-incubating-SNAPSHOT/blur-document-security-hadoop1-1.2.1-0.2.4-incubating-SNAPSHOT-test-sources.jar
Sending artifact delta relative to Blur-master-jdk7 » Blur Document Security #1733
Archived 5 artifacts
Archive block size is 32768
Received 0 blocks and 192213 bytes
Compression is 0.0%
Took 0.23 sec
[JENKINS] Archiving <https://builds.apache.org/job/Blur-master-jdk7/ws/blur-kvs/pom.xml>
to org.apache.blur/blur-kvs/hadoop1-1.2.1-0.2.4-incubating-SNAPSHOT/blur-kvs-hadoop1-1.2.1-0.2.4-incubating-SNAPSHOT.pom
[JENKINS] Archiving <https://builds.apache.org/job/Blur-master-jdk7/ws/blur-kvs/target/blur-kvs-hadoop1-1.2.1-0.2.4-incubating-SNAPSHOT.jar>
to org.apache.blur/blur-kvs/hadoop1-1.2.1-0.2.4-incubating-SNAPSHOT/blur-kvs-hadoop1-1.2.1-0.2.4-incubating-SNAPSHOT.jar
[JENKINS] Archiving <https://builds.apache.org/job/Blur-master-jdk7/ws/blur-kvs/target/blur-kvs-hadoop1-1.2.1-0.2.4-incubating-SNAPSHOT-tests.jar>
to org.apache.blur/blur-kvs/hadoop1-1.2.1-0.2.4-incubating-SNAPSHOT/blur-kvs-hadoop1-1.2.1-0.2.4-incubating-SNAPSHOT-tests.jar
[JENKINS] Archiving <https://builds.apache.org/job/Blur-master-jdk7/ws/blur-kvs/target/blur-kvs-hadoop1-1.2.1-0.2.4-incubating-SNAPSHOT-sources.jar>
to org.apache.blur/blur-kvs/hadoop1-1.2.1-0.2.4-incubating-SNAPSHOT/blur-kvs-hadoop1-1.2.1-0.2.4-incubating-SNAPSHOT-sources.jar
[JENKINS] Archiving <https://builds.apache.org/job/Blur-master-jdk7/ws/blur-kvs/target/blur-kvs-hadoop1-1.2.1-0.2.4-incubating-SNAPSHOT-test-sources.jar>
to org.apache.blur/blur-kvs/hadoop1-1.2.1-0.2.4-incubating-SNAPSHOT/blur-kvs-hadoop1-1.2.1-0.2.4-incubating-SNAPSHOT-test-sources.jar
Sending artifact delta relative to Blur-master-jdk7 » Blur KeyValue Store #1733
Archived 5 artifacts
Archive block size is 32768
Received 0 blocks and 81101 bytes
Compression is 0.0%
Took 0.17 sec
[JENKINS] Archiving <https://builds.apache.org/job/Blur-master-jdk7/ws/blur-status/pom.xml>
to org.apache.blur/blur-status/hadoop1-1.2.1-0.2.4-incubating-SNAPSHOT/blur-status-hadoop1-1.2.1-0.2.4-incubating-SNAPSHOT.pom
Sending artifact delta relative to Blur-master-jdk7 » Blur Status #1733
Archived 1 artifacts
Archive block size is 32768
Received 0 blocks and 4353 bytes
Compression is 0.0%
Took 56 ms
Sending e-mails to: blur-dev@incubator.apache.org
channel stopped

Mime
View raw message