incubator-blur-dev mailing list archives

Site index · List index
Message view « Date » · « Thread »
Top « Date » · « Thread »
From Apache Jenkins Server <jenk...@builds.apache.org>
Subject Build failed in Jenkins: Blur-master-jdk7 #1679
Date Tue, 19 May 2015 13:38:02 GMT
See <https://builds.apache.org/job/Blur-master-jdk7/1679/changes>

Changes:

[amccurry] Adding a command that will perform the map reduce indexing job for bulk updates.
 This is untested at this point.  Need to add the ability to add from better file inputs such
as avro.

------------------------------------------
[...truncated 15772 lines...]
[INFO] Exclude: **/src/main/webapp/less/tagmanager.less
[INFO] Exclude: **/src/main/webapp/node_modules/**
[INFO] Exclude: **/src/main/webapp/.sass-cache/**
[INFO] Exclude: **/src/main/webapp/.tmp/**
[INFO] Exclude: **/.editorconfig
[INFO] Exclude: **/.jshintrc
[INFO] Exclude: **/package.json
[INFO] Exclude: **/src/main/scripts/grunt.sh
[INFO] Exclude: **/src/main/webapp/coverage/**
[INFO] Exclude: contrib/blur-console-v1/**
[INFO] Exclude: **/src/main/resources/org/apache/blur/thrift/util/words.txt
[INFO] Exclude: **/js/d3.v2.js
[INFO] Exclude: **/js/d3.v2.min.js
[INFO] Exclude: **/src/main/resources*/license-notes.txt
[INFO] Exclude: **/src/main/resources*/NOTICE-bin.base.txt
[INFO] Exclude: **/src/main/resources*/NOTICE-bin.txt
[INFO] Exclude: **/src/main/resources*/notices/*.src
[INFO] Exclude: **/src/main/scripts/conf/controllers
[INFO] Exclude: **/src/main/scripts/conf/consoles
[INFO] Exclude: **/src/main/scripts/conf/default_zoo.cfg
[INFO] Exclude: **/src/main/scripts/conf/shards
[INFO] Exclude: **/src/main/scripts/conf/zookeepers
[INFO] Exclude: **/src/main/scripts/interface/gen-html/Blur.html
[INFO] Exclude: **/src/main/scripts/interface/gen-html/index.html
[INFO] Exclude: **/.empty
[INFO] 44 resources included (use -debug for more details)
[INFO] Rat check: Summary of files. Unapproved: 0 unknown: 0 generated: 0 approved: 44 licence.
[INFO] 
[INFO] --- maven-jar-plugin:2.5:test-jar (default) @ blur-mapred ---
[INFO] Building jar: <https://builds.apache.org/job/Blur-master-jdk7/ws/blur-mapred/target/blur-mapred-hadoop1-1.2.1-0.2.4-incubating-SNAPSHOT-tests.jar>
[WARNING] Failed to getClass for org.apache.maven.plugin.source.SourceJarMojo
[INFO] 
[INFO] --- maven-source-plugin:2.3:jar (attach-sources) @ blur-mapred ---
[INFO] Building jar: <https://builds.apache.org/job/Blur-master-jdk7/ws/blur-mapred/target/blur-mapred-hadoop1-1.2.1-0.2.4-incubating-SNAPSHOT-sources.jar>
[WARNING] Failed to getClass for org.apache.maven.plugin.source.TestSourceJarMojo
[INFO] 
[INFO] --- maven-source-plugin:2.3:test-jar (attach-sources) @ blur-mapred ---
[INFO] Building jar: <https://builds.apache.org/job/Blur-master-jdk7/ws/blur-mapred/target/blur-mapred-hadoop1-1.2.1-0.2.4-incubating-SNAPSHOT-test-sources.jar>
[INFO] 
[INFO] --- maven-install-plugin:2.3.1:install (default-install) @ blur-mapred ---
[INFO] Installing <https://builds.apache.org/job/Blur-master-jdk7/ws/blur-mapred/target/blur-mapred-hadoop1-1.2.1-0.2.4-incubating-SNAPSHOT.jar>
to /home/jenkins/jenkins-slave/maven-repositories/1/org/apache/blur/blur-mapred/hadoop1-1.2.1-0.2.4-incubating-SNAPSHOT/blur-mapred-hadoop1-1.2.1-0.2.4-incubating-SNAPSHOT.jar
[INFO] Installing <https://builds.apache.org/job/Blur-master-jdk7/ws/blur-mapred/pom.xml>
to /home/jenkins/jenkins-slave/maven-repositories/1/org/apache/blur/blur-mapred/hadoop1-1.2.1-0.2.4-incubating-SNAPSHOT/blur-mapred-hadoop1-1.2.1-0.2.4-incubating-SNAPSHOT.pom
[INFO] Installing <https://builds.apache.org/job/Blur-master-jdk7/ws/blur-mapred/target/blur-mapred-hadoop1-1.2.1-0.2.4-incubating-SNAPSHOT-tests.jar>
to /home/jenkins/jenkins-slave/maven-repositories/1/org/apache/blur/blur-mapred/hadoop1-1.2.1-0.2.4-incubating-SNAPSHOT/blur-mapred-hadoop1-1.2.1-0.2.4-incubating-SNAPSHOT-tests.jar
[INFO] Installing <https://builds.apache.org/job/Blur-master-jdk7/ws/blur-mapred/target/blur-mapred-hadoop1-1.2.1-0.2.4-incubating-SNAPSHOT-sources.jar>
to /home/jenkins/jenkins-slave/maven-repositories/1/org/apache/blur/blur-mapred/hadoop1-1.2.1-0.2.4-incubating-SNAPSHOT/blur-mapred-hadoop1-1.2.1-0.2.4-incubating-SNAPSHOT-sources.jar
[INFO] Installing <https://builds.apache.org/job/Blur-master-jdk7/ws/blur-mapred/target/blur-mapred-hadoop1-1.2.1-0.2.4-incubating-SNAPSHOT-test-sources.jar>
to /home/jenkins/jenkins-slave/maven-repositories/1/org/apache/blur/blur-mapred/hadoop1-1.2.1-0.2.4-incubating-SNAPSHOT/blur-mapred-hadoop1-1.2.1-0.2.4-incubating-SNAPSHOT-test-sources.jar
[INFO] 
[INFO] --- maven-install-plugin:2.3.1:install-file (default) @ blur-mapred ---
[INFO] Installing <https://builds.apache.org/job/Blur-master-jdk7/ws/blur-mapred/target/blur-mapred-hadoop1-1.2.1-0.2.4-incubating-SNAPSHOT.jar>
to /home/jenkins/jenkins-slave/maven-repositories/1/org/apache/blur/blur-mapred/hadoop1-1.2.1-0.2.4-incubating-SNAPSHOT/blur-mapred-hadoop1-1.2.1-0.2.4-incubating-SNAPSHOT.jar
[INFO] Installing <https://builds.apache.org/job/Blur-master-jdk7/ws/blur-mapred/target/effective-pom.xml>
to /home/jenkins/jenkins-slave/maven-repositories/1/org/apache/blur/blur-mapred/hadoop1-1.2.1-0.2.4-incubating-SNAPSHOT/blur-mapred-hadoop1-1.2.1-0.2.4-incubating-SNAPSHOT.pom
[INFO]                                                                         
[INFO] ------------------------------------------------------------------------
[INFO] Building Blur Command hadoop1-1.2.1-0.2.4-incubating-SNAPSHOT
[INFO] ------------------------------------------------------------------------
[INFO] 
[INFO] --- maven-clean-plugin:2.5:clean (default-clean) @ blur-command ---
[INFO] Deleting <https://builds.apache.org/job/Blur-master-jdk7/ws/blur-command/target>
[INFO] 
[INFO] --- maven-remote-resources-plugin:1.5:process (default) @ blur-command ---
[INFO] 
[INFO] --- maven-help-plugin:2.2:effective-pom (default) @ blur-command ---
[INFO] Effective-POM written to: <https://builds.apache.org/job/Blur-master-jdk7/ws/blur-command/target/effective-pom.xml>
[INFO] 
[INFO] --- maven-resources-plugin:2.6:resources (default-resources) @ blur-command ---
[INFO] Using 'UTF-8' encoding to copy filtered resources.
[INFO] Copying 6 resources
[INFO] Copying 3 resources
[INFO] 
[INFO] --- maven-compiler-plugin:3.1:compile (default-compile) @ blur-command ---
[INFO] Changes detected - recompiling the module!
[INFO] Compiling 12 source files to <https://builds.apache.org/job/Blur-master-jdk7/ws/blur-command/target/classes>
[INFO] -------------------------------------------------------------
[ERROR] COMPILATION ERROR : 
[INFO] -------------------------------------------------------------
[ERROR] <https://builds.apache.org/job/Blur-master-jdk7/ws/blur-command/src/main/java/org/apache/blur/command/BulkTableUpdate.java>:[27,43]
cannot find symbol
  symbol:   class ClusterExecuteCommandSingleTable
  location: package org.apache.blur.command.commandtype
[ERROR] <https://builds.apache.org/job/Blur-master-jdk7/ws/blur-command/src/main/java/org/apache/blur/command/BulkTableUpdate.java>:[42,38]
cannot find symbol
  symbol: class ClusterExecuteCommandSingleTable
[ERROR] <https://builds.apache.org/job/Blur-master-jdk7/ws/blur-command/src/main/java/org/apache/blur/command/BulkTableUpdate.java>:[62,3]
method does not override or implement a method from a supertype
[ERROR] <https://builds.apache.org/job/Blur-master-jdk7/ws/blur-command/src/main/java/org/apache/blur/command/BulkTableUpdate.java>:[69,20]
cannot find symbol
  symbol:   method getTable()
  location: class org.apache.blur.command.BulkTableUpdate
[ERROR] <https://builds.apache.org/job/Blur-master-jdk7/ws/blur-command/src/main/java/org/apache/blur/command/BulkTableUpdate.java>:[67,3]
method does not override or implement a method from a supertype
[INFO] 5 errors 
[INFO] -------------------------------------------------------------
[INFO] ------------------------------------------------------------------------
[INFO] Reactor Summary:
[INFO] 
[INFO] Blur .............................................. SUCCESS [12.710s]
[INFO] Blur Util ......................................... SUCCESS [13.829s]
[INFO] Blur Thrift ....................................... SUCCESS [11.387s]
[INFO] Blur Store ........................................ SUCCESS [1:30.483s]
[INFO] Blur Query ........................................ SUCCESS [40.190s]
[INFO] Blur Status ....................................... SUCCESS [2.871s]
[INFO] Blur Core ......................................... SUCCESS [6:04.353s]
[INFO] Blur Map Reduce ................................... SUCCESS [10:24.263s]
[INFO] Blur Command ...................................... FAILURE [1.207s]
[INFO] Blur Console ...................................... SKIPPED
[INFO] Blur Hive ......................................... SKIPPED
[INFO] Blur Shell ........................................ SKIPPED
[INFO] Distribution ...................................... SKIPPED
[INFO] ------------------------------------------------------------------------
[INFO] BUILD FAILURE
[INFO] ------------------------------------------------------------------------
[INFO] Total time: 19:26.586s
[INFO] Finished at: Tue May 19 13:37:45 UTC 2015
[INFO] Final Memory: 50M/325M
[INFO] ------------------------------------------------------------------------
Waiting for Jenkins to finish collecting data
[ERROR] Failed to execute goal org.apache.maven.plugins:maven-compiler-plugin:3.1:compile
(default-compile) on project blur-command: Compilation failure: Compilation failure:
[ERROR] <https://builds.apache.org/job/Blur-master-jdk7/ws/blur-command/src/main/java/org/apache/blur/command/BulkTableUpdate.java>:[27,43]
cannot find symbol
[ERROR] symbol:   class ClusterExecuteCommandSingleTable
[ERROR] location: package org.apache.blur.command.commandtype
[ERROR] <https://builds.apache.org/job/Blur-master-jdk7/ws/blur-command/src/main/java/org/apache/blur/command/BulkTableUpdate.java>:[42,38]
cannot find symbol
[ERROR] symbol: class ClusterExecuteCommandSingleTable
[ERROR] <https://builds.apache.org/job/Blur-master-jdk7/ws/blur-command/src/main/java/org/apache/blur/command/BulkTableUpdate.java>:[62,3]
method does not override or implement a method from a supertype
[ERROR] <https://builds.apache.org/job/Blur-master-jdk7/ws/blur-command/src/main/java/org/apache/blur/command/BulkTableUpdate.java>:[69,20]
cannot find symbol
[ERROR] symbol:   method getTable()
[ERROR] location: class org.apache.blur.command.BulkTableUpdate
[ERROR] <https://builds.apache.org/job/Blur-master-jdk7/ws/blur-command/src/main/java/org/apache/blur/command/BulkTableUpdate.java>:[67,3]
method does not override or implement a method from a supertype
[ERROR] -> [Help 1]
[ERROR] 
[ERROR] To see the full stack trace of the errors, re-run Maven with the -e switch.
[ERROR] Re-run Maven using the -X switch to enable full debug logging.
[ERROR] 
[ERROR] For more information about the errors and possible solutions, please read the following
articles:
[ERROR] [Help 1] http://cwiki.apache.org/confluence/display/MAVEN/MojoFailureException
[ERROR] 
[ERROR] After correcting the problems, you can resume the build with the command
[ERROR]   mvn <goals> -rf :blur-command
[JENKINS] Archiving <https://builds.apache.org/job/Blur-master-jdk7/ws/pom.xml> to org.apache.blur/blur/0.2.4-incubating-SNAPSHOT/blur-0.2.4-incubating-SNAPSHOT.pom
Sending artifact delta relative to Blur-master-jdk7 » Blur #1678
Archived 1 artifacts
Archive block size is 32768
Received 0 blocks and 19011 bytes
Compression is 0.0%
Took 0.12 sec
[JENKINS] Archiving <https://builds.apache.org/job/Blur-master-jdk7/ws/blur-shell/pom.xml>
to org.apache.blur/blur-shell/hadoop1-1.2.1-0.2.4-incubating-SNAPSHOT/blur-shell-hadoop1-1.2.1-0.2.4-incubating-SNAPSHOT.pom
Sending artifact delta relative to Blur-master-jdk7 » Blur Shell #1678
Archived 1 artifacts
Archive block size is 32768
Received 0 blocks and 5439 bytes
Compression is 0.0%
Took 0.17 sec
[JENKINS] Archiving <https://builds.apache.org/job/Blur-master-jdk7/ws/blur-thrift/pom.xml>
to org.apache.blur/blur-thrift/hadoop1-1.2.1-0.2.4-incubating-SNAPSHOT/blur-thrift-hadoop1-1.2.1-0.2.4-incubating-SNAPSHOT.pom
[JENKINS] Archiving <https://builds.apache.org/job/Blur-master-jdk7/ws/blur-thrift/target/blur-thrift-hadoop1-1.2.1-0.2.4-incubating-SNAPSHOT.jar>
to org.apache.blur/blur-thrift/hadoop1-1.2.1-0.2.4-incubating-SNAPSHOT/blur-thrift-hadoop1-1.2.1-0.2.4-incubating-SNAPSHOT.jar
[JENKINS] Archiving <https://builds.apache.org/job/Blur-master-jdk7/ws/blur-thrift/target/blur-thrift-hadoop1-1.2.1-0.2.4-incubating-SNAPSHOT-tests.jar>
to org.apache.blur/blur-thrift/hadoop1-1.2.1-0.2.4-incubating-SNAPSHOT/blur-thrift-hadoop1-1.2.1-0.2.4-incubating-SNAPSHOT-tests.jar
[JENKINS] Archiving <https://builds.apache.org/job/Blur-master-jdk7/ws/blur-thrift/target/blur-thrift-hadoop1-1.2.1-0.2.4-incubating-SNAPSHOT-sources.jar>
to org.apache.blur/blur-thrift/hadoop1-1.2.1-0.2.4-incubating-SNAPSHOT/blur-thrift-hadoop1-1.2.1-0.2.4-incubating-SNAPSHOT-sources.jar
[JENKINS] Archiving <https://builds.apache.org/job/Blur-master-jdk7/ws/blur-thrift/target/blur-thrift-hadoop1-1.2.1-0.2.4-incubating-SNAPSHOT-test-sources.jar>
to org.apache.blur/blur-thrift/hadoop1-1.2.1-0.2.4-incubating-SNAPSHOT/blur-thrift-hadoop1-1.2.1-0.2.4-incubating-SNAPSHOT-test-sources.jar
Sending artifact delta relative to Blur-master-jdk7 » Blur Thrift #1678
Archived 5 artifacts
Archive block size is 32768
Received 2 blocks and 2952836 bytes
Compression is 2.2%
Took 1.4 sec
[JENKINS] Archiving <https://builds.apache.org/job/Blur-master-jdk7/ws/blur-query/pom.xml>
to org.apache.blur/blur-query/hadoop1-1.2.1-0.2.4-incubating-SNAPSHOT/blur-query-hadoop1-1.2.1-0.2.4-incubating-SNAPSHOT.pom
[JENKINS] Archiving <https://builds.apache.org/job/Blur-master-jdk7/ws/blur-query/target/blur-query-hadoop1-1.2.1-0.2.4-incubating-SNAPSHOT.jar>
to org.apache.blur/blur-query/hadoop1-1.2.1-0.2.4-incubating-SNAPSHOT/blur-query-hadoop1-1.2.1-0.2.4-incubating-SNAPSHOT.jar
[JENKINS] Archiving <https://builds.apache.org/job/Blur-master-jdk7/ws/blur-query/target/blur-query-hadoop1-1.2.1-0.2.4-incubating-SNAPSHOT-tests.jar>
to org.apache.blur/blur-query/hadoop1-1.2.1-0.2.4-incubating-SNAPSHOT/blur-query-hadoop1-1.2.1-0.2.4-incubating-SNAPSHOT-tests.jar
[JENKINS] Archiving <https://builds.apache.org/job/Blur-master-jdk7/ws/blur-query/target/blur-query-hadoop1-1.2.1-0.2.4-incubating-SNAPSHOT-sources.jar>
to org.apache.blur/blur-query/hadoop1-1.2.1-0.2.4-incubating-SNAPSHOT/blur-query-hadoop1-1.2.1-0.2.4-incubating-SNAPSHOT-sources.jar
[JENKINS] Archiving <https://builds.apache.org/job/Blur-master-jdk7/ws/blur-query/target/blur-query-hadoop1-1.2.1-0.2.4-incubating-SNAPSHOT-test-sources.jar>
to org.apache.blur/blur-query/hadoop1-1.2.1-0.2.4-incubating-SNAPSHOT/blur-query-hadoop1-1.2.1-0.2.4-incubating-SNAPSHOT-test-sources.jar
Sending artifact delta relative to Blur-master-jdk7 » Blur Query #1678
Archived 5 artifacts
Archive block size is 32768
Received 0 blocks and 440085 bytes
Compression is 0.0%
Took 0.82 sec
[JENKINS] Archiving <https://builds.apache.org/job/Blur-master-jdk7/ws/blur-core/pom.xml>
to org.apache.blur/blur-core/hadoop1-1.2.1-0.2.4-incubating-SNAPSHOT/blur-core-hadoop1-1.2.1-0.2.4-incubating-SNAPSHOT.pom
[JENKINS] Archiving <https://builds.apache.org/job/Blur-master-jdk7/ws/blur-core/target/blur-core-hadoop1-1.2.1-0.2.4-incubating-SNAPSHOT.jar>
to org.apache.blur/blur-core/hadoop1-1.2.1-0.2.4-incubating-SNAPSHOT/blur-core-hadoop1-1.2.1-0.2.4-incubating-SNAPSHOT.jar
[JENKINS] Archiving <https://builds.apache.org/job/Blur-master-jdk7/ws/blur-core/target/blur-core-hadoop1-1.2.1-0.2.4-incubating-SNAPSHOT-tests.jar>
to org.apache.blur/blur-core/hadoop1-1.2.1-0.2.4-incubating-SNAPSHOT/blur-core-hadoop1-1.2.1-0.2.4-incubating-SNAPSHOT-tests.jar
[JENKINS] Archiving <https://builds.apache.org/job/Blur-master-jdk7/ws/blur-core/target/blur-core-hadoop1-1.2.1-0.2.4-incubating-SNAPSHOT-sources.jar>
to org.apache.blur/blur-core/hadoop1-1.2.1-0.2.4-incubating-SNAPSHOT/blur-core-hadoop1-1.2.1-0.2.4-incubating-SNAPSHOT-sources.jar
[JENKINS] Archiving <https://builds.apache.org/job/Blur-master-jdk7/ws/blur-core/target/blur-core-hadoop1-1.2.1-0.2.4-incubating-SNAPSHOT-test-sources.jar>
to org.apache.blur/blur-core/hadoop1-1.2.1-0.2.4-incubating-SNAPSHOT/blur-core-hadoop1-1.2.1-0.2.4-incubating-SNAPSHOT-test-sources.jar
Sending artifact delta relative to Blur-master-jdk7 » Blur Core #1678
Archived 5 artifacts
Archive block size is 32768
Received 0 blocks and 1367667 bytes
Compression is 0.0%
Took 0.8 sec
[JENKINS] Archiving <https://builds.apache.org/job/Blur-master-jdk7/ws/blur-store/pom.xml>
to org.apache.blur/blur-store/hadoop1-1.2.1-0.2.4-incubating-SNAPSHOT/blur-store-hadoop1-1.2.1-0.2.4-incubating-SNAPSHOT.pom
[JENKINS] Archiving <https://builds.apache.org/job/Blur-master-jdk7/ws/blur-store/target/blur-store-hadoop1-1.2.1-0.2.4-incubating-SNAPSHOT.jar>
to org.apache.blur/blur-store/hadoop1-1.2.1-0.2.4-incubating-SNAPSHOT/blur-store-hadoop1-1.2.1-0.2.4-incubating-SNAPSHOT.jar
[JENKINS] Archiving <https://builds.apache.org/job/Blur-master-jdk7/ws/blur-store/target/blur-store-hadoop1-1.2.1-0.2.4-incubating-SNAPSHOT-tests.jar>
to org.apache.blur/blur-store/hadoop1-1.2.1-0.2.4-incubating-SNAPSHOT/blur-store-hadoop1-1.2.1-0.2.4-incubating-SNAPSHOT-tests.jar
[JENKINS] Archiving <https://builds.apache.org/job/Blur-master-jdk7/ws/blur-store/target/blur-store-hadoop1-1.2.1-0.2.4-incubating-SNAPSHOT-sources.jar>
to org.apache.blur/blur-store/hadoop1-1.2.1-0.2.4-incubating-SNAPSHOT/blur-store-hadoop1-1.2.1-0.2.4-incubating-SNAPSHOT-sources.jar
[JENKINS] Archiving <https://builds.apache.org/job/Blur-master-jdk7/ws/blur-store/target/blur-store-hadoop1-1.2.1-0.2.4-incubating-SNAPSHOT-test-sources.jar>
to org.apache.blur/blur-store/hadoop1-1.2.1-0.2.4-incubating-SNAPSHOT/blur-store-hadoop1-1.2.1-0.2.4-incubating-SNAPSHOT-test-sources.jar
Sending artifact delta relative to Blur-master-jdk7 » Blur Store #1678
Archived 5 artifacts
Archive block size is 32768
Received 0 blocks and 500731 bytes
Compression is 0.0%
Took 0.53 sec
[JENKINS] Archiving <https://builds.apache.org/job/Blur-master-jdk7/ws/blur-mapred/pom.xml>
to org.apache.blur/blur-mapred/hadoop1-1.2.1-0.2.4-incubating-SNAPSHOT/blur-mapred-hadoop1-1.2.1-0.2.4-incubating-SNAPSHOT.pom
[JENKINS] Archiving <https://builds.apache.org/job/Blur-master-jdk7/ws/blur-mapred/target/blur-mapred-hadoop1-1.2.1-0.2.4-incubating-SNAPSHOT.jar>
to org.apache.blur/blur-mapred/hadoop1-1.2.1-0.2.4-incubating-SNAPSHOT/blur-mapred-hadoop1-1.2.1-0.2.4-incubating-SNAPSHOT.jar
[JENKINS] Archiving <https://builds.apache.org/job/Blur-master-jdk7/ws/blur-mapred/target/blur-mapred-hadoop1-1.2.1-0.2.4-incubating-SNAPSHOT-tests.jar>
to org.apache.blur/blur-mapred/hadoop1-1.2.1-0.2.4-incubating-SNAPSHOT/blur-mapred-hadoop1-1.2.1-0.2.4-incubating-SNAPSHOT-tests.jar
[JENKINS] Archiving <https://builds.apache.org/job/Blur-master-jdk7/ws/blur-mapred/target/blur-mapred-hadoop1-1.2.1-0.2.4-incubating-SNAPSHOT-sources.jar>
to org.apache.blur/blur-mapred/hadoop1-1.2.1-0.2.4-incubating-SNAPSHOT/blur-mapred-hadoop1-1.2.1-0.2.4-incubating-SNAPSHOT-sources.jar
[JENKINS] Archiving <https://builds.apache.org/job/Blur-master-jdk7/ws/blur-mapred/target/blur-mapred-hadoop1-1.2.1-0.2.4-incubating-SNAPSHOT-test-sources.jar>
to org.apache.blur/blur-mapred/hadoop1-1.2.1-0.2.4-incubating-SNAPSHOT/blur-mapred-hadoop1-1.2.1-0.2.4-incubating-SNAPSHOT-test-sources.jar
Sending artifact delta relative to Blur-master-jdk7 » Blur Map Reduce #1678
Archived 5 artifacts
Archive block size is 32768
Received 0 blocks and 274330 bytes
Compression is 0.0%
Took 0.16 sec
[JENKINS] Archiving <https://builds.apache.org/job/Blur-master-jdk7/ws/blur-util/pom.xml>
to org.apache.blur/blur-util/hadoop1-1.2.1-0.2.4-incubating-SNAPSHOT/blur-util-hadoop1-1.2.1-0.2.4-incubating-SNAPSHOT.pom
[JENKINS] Archiving <https://builds.apache.org/job/Blur-master-jdk7/ws/blur-util/target/blur-util-hadoop1-1.2.1-0.2.4-incubating-SNAPSHOT.jar>
to org.apache.blur/blur-util/hadoop1-1.2.1-0.2.4-incubating-SNAPSHOT/blur-util-hadoop1-1.2.1-0.2.4-incubating-SNAPSHOT.jar
[JENKINS] Archiving <https://builds.apache.org/job/Blur-master-jdk7/ws/blur-util/target/blur-util-hadoop1-1.2.1-0.2.4-incubating-SNAPSHOT-sources.jar>
to org.apache.blur/blur-util/hadoop1-1.2.1-0.2.4-incubating-SNAPSHOT/blur-util-hadoop1-1.2.1-0.2.4-incubating-SNAPSHOT-sources.jar
[JENKINS] Archiving <https://builds.apache.org/job/Blur-master-jdk7/ws/blur-util/target/blur-util-hadoop1-1.2.1-0.2.4-incubating-SNAPSHOT-test-sources.jar>
to org.apache.blur/blur-util/hadoop1-1.2.1-0.2.4-incubating-SNAPSHOT/blur-util-hadoop1-1.2.1-0.2.4-incubating-SNAPSHOT-test-sources.jar
[JENKINS] Archiving <https://builds.apache.org/job/Blur-master-jdk7/ws/blur-util/target/blur-util-hadoop1-1.2.1-0.2.4-incubating-SNAPSHOT-tests.jar>
to org.apache.blur/blur-util/hadoop1-1.2.1-0.2.4-incubating-SNAPSHOT/blur-util-hadoop1-1.2.1-0.2.4-incubating-SNAPSHOT-tests.jar
Sending artifact delta relative to Blur-master-jdk7 » Blur Util #1678
Archived 5 artifacts
Archive block size is 32768
Received 0 blocks and 266017 bytes
Compression is 0.0%
Took 0.3 sec
[JENKINS] Archiving <https://builds.apache.org/job/Blur-master-jdk7/ws/distribution/pom.xml>
to org.apache.blur/apache-blur/hadoop1-1.2.1-0.2.4-incubating-SNAPSHOT/apache-blur-hadoop1-1.2.1-0.2.4-incubating-SNAPSHOT.pom
Sending artifact delta relative to Blur-master-jdk7 » Distribution #1678
Archived 1 artifacts
Archive block size is 32768
Received 0 blocks and 3878 bytes
Compression is 0.0%
Took 5.3 sec
[JENKINS] Archiving <https://builds.apache.org/job/Blur-master-jdk7/ws/blur-hive/pom.xml>
to org.apache.blur/blur-hive/hadoop1-1.2.1-0.13.1-0.2.4-incubating-SNAPSHOT/blur-hive-hadoop1-1.2.1-0.13.1-0.2.4-incubating-SNAPSHOT.pom
Sending artifact delta relative to Blur-master-jdk7 » Blur Hive #1678
Archived 1 artifacts
Archive block size is 32768
Received 0 blocks and 12496 bytes
Compression is 0.0%
Took 1 sec
[JENKINS] Archiving <https://builds.apache.org/job/Blur-master-jdk7/ws/blur-command/pom.xml>
to org.apache.blur/blur-command/hadoop1-1.2.1-0.2.4-incubating-SNAPSHOT/blur-command-hadoop1-1.2.1-0.2.4-incubating-SNAPSHOT.pom
Sending artifact delta relative to Blur-master-jdk7 » Blur Command #1678
Archived 1 artifacts
Archive block size is 32768
Received 0 blocks and 5980 bytes
Compression is 0.0%
Took 0.27 sec
[JENKINS] Archiving <https://builds.apache.org/job/Blur-master-jdk7/ws/blur-console/pom.xml>
to org.apache.blur/blur-console/hadoop1-1.2.1-0.2.4-incubating-SNAPSHOT/blur-console-hadoop1-1.2.1-0.2.4-incubating-SNAPSHOT.pom
Sending artifact delta relative to Blur-master-jdk7 » Blur Console #1678
Archived 1 artifacts
Archive block size is 32768
Received 0 blocks and 8650 bytes
Compression is 0.0%
Took 0.38 sec
[JENKINS] Archiving <https://builds.apache.org/job/Blur-master-jdk7/ws/blur-status/pom.xml>
to org.apache.blur/blur-status/hadoop1-1.2.1-0.2.4-incubating-SNAPSHOT/blur-status-hadoop1-1.2.1-0.2.4-incubating-SNAPSHOT.pom
[JENKINS] Archiving <https://builds.apache.org/job/Blur-master-jdk7/ws/blur-status/target/blur-status-hadoop1-1.2.1-0.2.4-incubating-SNAPSHOT.jar>
to org.apache.blur/blur-status/hadoop1-1.2.1-0.2.4-incubating-SNAPSHOT/blur-status-hadoop1-1.2.1-0.2.4-incubating-SNAPSHOT.jar
[JENKINS] Archiving <https://builds.apache.org/job/Blur-master-jdk7/ws/blur-status/target/blur-status-hadoop1-1.2.1-0.2.4-incubating-SNAPSHOT-sources.jar>
to org.apache.blur/blur-status/hadoop1-1.2.1-0.2.4-incubating-SNAPSHOT/blur-status-hadoop1-1.2.1-0.2.4-incubating-SNAPSHOT-sources.jar
Sending artifact delta relative to Blur-master-jdk7 » Blur Status #1678
Archived 3 artifacts
Archive block size is 32768
Received 4 blocks and 276194 bytes
Compression is 32.2%
Took 0.32 sec
Sending e-mails to: blur-dev@incubator.apache.org
channel stopped

Mime
View raw message