incubator-blur-dev mailing list archives

Site index · List index
Message view « Date » · « Thread »
Top « Date » · « Thread »
From Apache Jenkins Server <jenk...@builds.apache.org>
Subject Build failed in Jenkins: Blur-master-jdk7 #1632
Date Sat, 18 Apr 2015 14:38:40 GMT
See <https://builds.apache.org/job/Blur-master-jdk7/1632/changes>

Changes:

[amccurry] Updating the blur input format to allow for fast directory use.

------------------------------------------
[...truncated 3131 lines...]
[INFO] 
[INFO] --- maven-surefire-plugin:2.17:test (default-test) @ blur-status ---
[WARNING] The parameter forkMode is deprecated since version 2.14. Use forkCount and reuseForks
instead.
[JENKINS] Recording test results
[INFO] 
[INFO] --- maven-jar-plugin:2.5:jar (default-jar) @ blur-status ---
[INFO] Building jar: <https://builds.apache.org/job/Blur-master-jdk7/ws/blur-status/target/blur-status-hadoop1-1.2.1-0.2.4-incubating-SNAPSHOT.jar>
[INFO] 
[INFO] --- maven-site-plugin:3.4:attach-descriptor (attach-descriptor) @ blur-status ---
[INFO] 
[INFO] --- apache-rat-plugin:0.10:check (default) @ blur-status ---
[INFO] 51 implicit excludes (use -debug for more details).
[INFO] Exclude: LICENSE
[INFO] Exclude: CHANGES.txt
[INFO] Exclude: DISCLAIMER
[INFO] Exclude: NOTICE
[INFO] Exclude: README
[INFO] Exclude: **/README.textile
[INFO] Exclude: **/README.md
[INFO] Exclude: **/.classpath
[INFO] Exclude: **/.project
[INFO] Exclude: **/.settings/**
[INFO] Exclude: **/.idea/**
[INFO] Exclude: **/*.iml
[INFO] Exclude: **/target/**
[INFO] Exclude: **/build/**
[INFO] Exclude: **/.codio
[INFO] Exclude: **/src/main/webapp/libs/**
[INFO] Exclude: **/node_modules/**
[INFO] Exclude: **/src/main/webapp/public/css/**
[INFO] Exclude: **/src/main/webapp/js/utils/*
[INFO] Exclude: **/src/main/webapp/public/js/modernizr.js
[INFO] Exclude: **/src/main/webapp/less/tagmanager.less
[INFO] Exclude: **/src/main/webapp/node_modules/**
[INFO] Exclude: **/src/main/webapp/.sass-cache/**
[INFO] Exclude: **/src/main/webapp/.tmp/**
[INFO] Exclude: **/.editorconfig
[INFO] Exclude: **/.jshintrc
[INFO] Exclude: **/package.json
[INFO] Exclude: **/src/main/scripts/grunt.sh
[INFO] Exclude: **/src/main/webapp/coverage/**
[INFO] Exclude: contrib/blur-console-v1/**
[INFO] Exclude: **/src/main/resources/org/apache/blur/thrift/util/words.txt
[INFO] Exclude: **/js/d3.v2.js
[INFO] Exclude: **/js/d3.v2.min.js
[INFO] Exclude: **/src/main/resources*/license-notes.txt
[INFO] Exclude: **/src/main/resources*/NOTICE-bin.base.txt
[INFO] Exclude: **/src/main/resources*/NOTICE-bin.txt
[INFO] Exclude: **/src/main/resources*/notices/*.src
[INFO] Exclude: **/src/main/scripts/conf/controllers
[INFO] Exclude: **/src/main/scripts/conf/consoles
[INFO] Exclude: **/src/main/scripts/conf/default_zoo.cfg
[INFO] Exclude: **/src/main/scripts/conf/shards
[INFO] Exclude: **/src/main/scripts/conf/zookeepers
[INFO] Exclude: **/src/main/scripts/interface/gen-html/Blur.html
[INFO] Exclude: **/src/main/scripts/interface/gen-html/index.html
[INFO] Exclude: **/.empty
[INFO] 17 resources included (use -debug for more details)
[INFO] Rat check: Summary of files. Unapproved: 0 unknown: 0 generated: 0 approved: 15 licence.
[INFO] 
[INFO] --- maven-install-plugin:2.3.1:install (default-install) @ blur-status ---
[INFO] Installing <https://builds.apache.org/job/Blur-master-jdk7/ws/blur-status/target/blur-status-hadoop1-1.2.1-0.2.4-incubating-SNAPSHOT.jar>
to /home/jenkins/jenkins-slave/maven-repositories/1/org/apache/blur/blur-status/hadoop1-1.2.1-0.2.4-incubating-SNAPSHOT/blur-status-hadoop1-1.2.1-0.2.4-incubating-SNAPSHOT.jar
[INFO] Installing <https://builds.apache.org/job/Blur-master-jdk7/ws/blur-status/pom.xml>
to /home/jenkins/jenkins-slave/maven-repositories/1/org/apache/blur/blur-status/hadoop1-1.2.1-0.2.4-incubating-SNAPSHOT/blur-status-hadoop1-1.2.1-0.2.4-incubating-SNAPSHOT.pom
[INFO] 
[INFO] --- maven-install-plugin:2.3.1:install-file (default) @ blur-status ---
[INFO] Installing <https://builds.apache.org/job/Blur-master-jdk7/ws/blur-status/target/blur-status-hadoop1-1.2.1-0.2.4-incubating-SNAPSHOT.jar>
to /home/jenkins/jenkins-slave/maven-repositories/1/org/apache/blur/blur-status/hadoop1-1.2.1-0.2.4-incubating-SNAPSHOT/blur-status-hadoop1-1.2.1-0.2.4-incubating-SNAPSHOT.jar
[INFO] Installing <https://builds.apache.org/job/Blur-master-jdk7/ws/blur-status/target/effective-pom.xml>
to /home/jenkins/jenkins-slave/maven-repositories/1/org/apache/blur/blur-status/hadoop1-1.2.1-0.2.4-incubating-SNAPSHOT/blur-status-hadoop1-1.2.1-0.2.4-incubating-SNAPSHOT.pom
[INFO]                                                                         
[INFO] ------------------------------------------------------------------------
[INFO] Building Blur Core hadoop1-1.2.1-0.2.4-incubating-SNAPSHOT
[INFO] ------------------------------------------------------------------------
[INFO] 
[INFO] --- maven-clean-plugin:2.5:clean (default-clean) @ blur-core ---
[INFO] Deleting <https://builds.apache.org/job/Blur-master-jdk7/ws/blur-core/target>
[INFO] 
[INFO] --- maven-remote-resources-plugin:1.5:process (default) @ blur-core ---
[INFO] 
[INFO] --- maven-help-plugin:2.2:effective-pom (default) @ blur-core ---
[INFO] Effective-POM written to: <https://builds.apache.org/job/Blur-master-jdk7/ws/blur-core/target/effective-pom.xml>
[INFO] 
[INFO] --- maven-resources-plugin:2.6:resources (default-resources) @ blur-core ---
[INFO] Using 'UTF-8' encoding to copy filtered resources.
[INFO] skip non existing resourceDirectory <https://builds.apache.org/job/Blur-master-jdk7/ws/blur-core/src/main/resources>
[INFO] Copying 3 resources
[INFO] 
[INFO] --- maven-compiler-plugin:3.1:compile (default-compile) @ blur-core ---
[INFO] Changes detected - recompiling the module!
[INFO] Compiling 168 source files to <https://builds.apache.org/job/Blur-master-jdk7/ws/blur-core/target/classes>
[INFO] -------------------------------------------------------------
[WARNING] COMPILATION WARNING : 
[INFO] -------------------------------------------------------------
[WARNING] <https://builds.apache.org/job/Blur-master-jdk7/ws/blur-core/src/main/java/org/apache/blur/thrift/ThriftBlurShardServer.java>:[122,16]
sun.misc.VM is internal proprietary API and may be removed in a future release
[WARNING] <https://builds.apache.org/job/Blur-master-jdk7/ws/blur-core/src/main/java/org/apache/blur/thrift/ThriftBlurShardServer.java>:[183,88]
sun.misc.VM is internal proprietary API and may be removed in a future release
[INFO] 2 warnings 
[INFO] -------------------------------------------------------------
[INFO] -------------------------------------------------------------
[ERROR] COMPILATION ERROR : 
[INFO] -------------------------------------------------------------
[ERROR] <https://builds.apache.org/job/Blur-master-jdk7/ws/blur-core/src/main/java/org/apache/blur/manager/indexserver/DistributedIndexServer.java>:[56,34]
cannot find symbol
  symbol:   class DirectoryUtil
  location: package org.apache.blur.store.hdfs
[ERROR] <https://builds.apache.org/job/Blur-master-jdk7/ws/blur-core/src/main/java/org/apache/blur/manager/indexserver/DistributedIndexServer.java>:[513,27]
cannot find symbol
  symbol:   variable DirectoryUtil
  location: class org.apache.blur.manager.indexserver.DistributedIndexServer
[INFO] 2 errors 
[INFO] -------------------------------------------------------------
[INFO] ------------------------------------------------------------------------
[INFO] Reactor Summary:
[INFO] 
[INFO] Blur .............................................. SUCCESS [4.137s]
[INFO] Blur Util ......................................... SUCCESS [10.570s]
[INFO] Blur Thrift ....................................... SUCCESS [9.176s]
[INFO] Blur Store ........................................ SUCCESS [1:15.064s]
[INFO] Blur Query ........................................ SUCCESS [32.658s]
[INFO] Blur Status ....................................... SUCCESS [1.835s]
[INFO] Blur Core ......................................... FAILURE [2.317s]
[INFO] Blur Command ...................................... SKIPPED
[INFO] Blur Console ...................................... SKIPPED
[INFO] Blur Map Reduce ................................... SKIPPED
[INFO] Blur Hive ......................................... SKIPPED
[INFO] Blur Shell ........................................ SKIPPED
[INFO] Distribution ...................................... SKIPPED
[INFO] ------------------------------------------------------------------------
[INFO] BUILD FAILURE
[INFO] ------------------------------------------------------------------------
[INFO] Total time: 2:19.877s
[INFO] Finished at: Sat Apr 18 14:38:23 UTC 2015
[INFO] Final Memory: 46M/619M
[INFO] ------------------------------------------------------------------------
Waiting for Jenkins to finish collecting data[ERROR] Failed to execute goal org.apache.maven.plugins:maven-compiler-plugin:3.1:compile
(default-compile) on project blur-core: Compilation failure: Compilation failure:
[ERROR] <https://builds.apache.org/job/Blur-master-jdk7/ws/blur-core/src/main/java/org/apache/blur/manager/indexserver/DistributedIndexServer.java>:[56,34]
cannot find symbol
[ERROR] symbol:   class DirectoryUtil
[ERROR] location: package org.apache.blur.store.hdfs
[ERROR] <https://builds.apache.org/job/Blur-master-jdk7/ws/blur-core/src/main/java/org/apache/blur/manager/indexserver/DistributedIndexServer.java>:[513,27]
cannot find symbol
[ERROR] symbol:   variable DirectoryUtil
[ERROR] location: class org.apache.blur.manager.indexserver.DistributedIndexServer
[ERROR] -> [Help 1]
[ERROR] 
[ERROR] To see the full stack trace of the errors, re-run Maven with the -e switch.
[ERROR] Re-run Maven using the -X switch to enable full debug logging.
[ERROR] 
[ERROR] For more information about the errors and possible solutions, please read the following
articles:
[ERROR] [Help 1] http://cwiki.apache.org/confluence/display/MAVEN/MojoFailureException
[ERROR] 
[ERROR] After correcting the problems, you can resume the build with the command
[ERROR]   mvn <goals> -rf :blur-core

[JENKINS] Archiving <https://builds.apache.org/job/Blur-master-jdk7/ws/pom.xml> to org.apache.blur/blur/0.2.4-incubating-SNAPSHOT/blur-0.2.4-incubating-SNAPSHOT.pom
Sending artifact delta relative to Blur-master-jdk7 » Blur #1631
Archived 1 artifacts
Archive block size is 32768
Received 0 blocks and 19011 bytes
Compression is 0.0%
Took 0.15 sec
[JENKINS] Archiving <https://builds.apache.org/job/Blur-master-jdk7/ws/blur-shell/pom.xml>
to org.apache.blur/blur-shell/hadoop1-1.2.1-0.2.4-incubating-SNAPSHOT/blur-shell-hadoop1-1.2.1-0.2.4-incubating-SNAPSHOT.pom
Sending artifact delta relative to Blur-master-jdk7 » Blur Shell #1631
Archived 1 artifacts
Archive block size is 32768
Received 0 blocks and 5164 bytes
Compression is 0.0%
Took 0.18 sec
[JENKINS] Archiving <https://builds.apache.org/job/Blur-master-jdk7/ws/blur-thrift/pom.xml>
to org.apache.blur/blur-thrift/hadoop1-1.2.1-0.2.4-incubating-SNAPSHOT/blur-thrift-hadoop1-1.2.1-0.2.4-incubating-SNAPSHOT.pom
[JENKINS] Archiving <https://builds.apache.org/job/Blur-master-jdk7/ws/blur-thrift/target/blur-thrift-hadoop1-1.2.1-0.2.4-incubating-SNAPSHOT.jar>
to org.apache.blur/blur-thrift/hadoop1-1.2.1-0.2.4-incubating-SNAPSHOT/blur-thrift-hadoop1-1.2.1-0.2.4-incubating-SNAPSHOT.jar
[JENKINS] Archiving <https://builds.apache.org/job/Blur-master-jdk7/ws/blur-thrift/target/blur-thrift-hadoop1-1.2.1-0.2.4-incubating-SNAPSHOT-tests.jar>
to org.apache.blur/blur-thrift/hadoop1-1.2.1-0.2.4-incubating-SNAPSHOT/blur-thrift-hadoop1-1.2.1-0.2.4-incubating-SNAPSHOT-tests.jar
Sending artifact delta relative to Blur-master-jdk7 » Blur Thrift #1631
Archived 3 artifacts
Archive block size is 32768
Received 0 blocks and 2421350 bytes
Compression is 0.0%
Took 1.4 sec
[JENKINS] Archiving <https://builds.apache.org/job/Blur-master-jdk7/ws/blur-query/pom.xml>
to org.apache.blur/blur-query/hadoop1-1.2.1-0.2.4-incubating-SNAPSHOT/blur-query-hadoop1-1.2.1-0.2.4-incubating-SNAPSHOT.pom
[JENKINS] Archiving <https://builds.apache.org/job/Blur-master-jdk7/ws/blur-query/target/blur-query-hadoop1-1.2.1-0.2.4-incubating-SNAPSHOT.jar>
to org.apache.blur/blur-query/hadoop1-1.2.1-0.2.4-incubating-SNAPSHOT/blur-query-hadoop1-1.2.1-0.2.4-incubating-SNAPSHOT.jar
[JENKINS] Archiving <https://builds.apache.org/job/Blur-master-jdk7/ws/blur-query/target/blur-query-hadoop1-1.2.1-0.2.4-incubating-SNAPSHOT-tests.jar>
to org.apache.blur/blur-query/hadoop1-1.2.1-0.2.4-incubating-SNAPSHOT/blur-query-hadoop1-1.2.1-0.2.4-incubating-SNAPSHOT-tests.jar
Sending artifact delta relative to Blur-master-jdk7 » Blur Query #1631
Archived 3 artifacts
Archive block size is 32768
Received 0 blocks and 269924 bytes
Compression is 0.0%
Took 0.33 sec
[JENKINS] Archiving <https://builds.apache.org/job/Blur-master-jdk7/ws/blur-core/pom.xml>
to org.apache.blur/blur-core/hadoop1-1.2.1-0.2.4-incubating-SNAPSHOT/blur-core-hadoop1-1.2.1-0.2.4-incubating-SNAPSHOT.pom
Sending artifact delta relative to Blur-master-jdk7 » Blur Core #1631
Archived 1 artifacts
Archive block size is 32768
Received 0 blocks and 6658 bytes
Compression is 0.0%
Took 0.31 sec
[JENKINS] Archiving <https://builds.apache.org/job/Blur-master-jdk7/ws/blur-store/pom.xml>
to org.apache.blur/blur-store/hadoop1-1.2.1-0.2.4-incubating-SNAPSHOT/blur-store-hadoop1-1.2.1-0.2.4-incubating-SNAPSHOT.pom
[JENKINS] Archiving <https://builds.apache.org/job/Blur-master-jdk7/ws/blur-store/target/blur-store-hadoop1-1.2.1-0.2.4-incubating-SNAPSHOT.jar>
to org.apache.blur/blur-store/hadoop1-1.2.1-0.2.4-incubating-SNAPSHOT/blur-store-hadoop1-1.2.1-0.2.4-incubating-SNAPSHOT.jar
[JENKINS] Archiving <https://builds.apache.org/job/Blur-master-jdk7/ws/blur-store/target/blur-store-hadoop1-1.2.1-0.2.4-incubating-SNAPSHOT-tests.jar>
to org.apache.blur/blur-store/hadoop1-1.2.1-0.2.4-incubating-SNAPSHOT/blur-store-hadoop1-1.2.1-0.2.4-incubating-SNAPSHOT-tests.jar
Sending artifact delta relative to Blur-master-jdk7 » Blur Store #1631
Archived 3 artifacts
Archive block size is 32768
Received 0 blocks and 320867 bytes
Compression is 0.0%
Took 0.29 sec
[JENKINS] Archiving <https://builds.apache.org/job/Blur-master-jdk7/ws/blur-mapred/pom.xml>
to org.apache.blur/blur-mapred/hadoop1-1.2.1-0.2.4-incubating-SNAPSHOT/blur-mapred-hadoop1-1.2.1-0.2.4-incubating-SNAPSHOT.pom
Sending artifact delta relative to Blur-master-jdk7 » Blur Map Reduce #1631
Archived 1 artifacts
Archive block size is 32768
Received 0 blocks and 7203 bytes
Compression is 0.0%
Took 0.29 sec
[JENKINS] Archiving <https://builds.apache.org/job/Blur-master-jdk7/ws/blur-util/pom.xml>
to org.apache.blur/blur-util/hadoop1-1.2.1-0.2.4-incubating-SNAPSHOT/blur-util-hadoop1-1.2.1-0.2.4-incubating-SNAPSHOT.pom
[JENKINS] Archiving <https://builds.apache.org/job/Blur-master-jdk7/ws/blur-util/target/blur-util-hadoop1-1.2.1-0.2.4-incubating-SNAPSHOT.jar>
to org.apache.blur/blur-util/hadoop1-1.2.1-0.2.4-incubating-SNAPSHOT/blur-util-hadoop1-1.2.1-0.2.4-incubating-SNAPSHOT.jar
[JENKINS] Archiving <https://builds.apache.org/job/Blur-master-jdk7/ws/blur-util/target/blur-util-hadoop1-1.2.1-0.2.4-incubating-SNAPSHOT-tests.jar>
to org.apache.blur/blur-util/hadoop1-1.2.1-0.2.4-incubating-SNAPSHOT/blur-util-hadoop1-1.2.1-0.2.4-incubating-SNAPSHOT-tests.jar
Sending artifact delta relative to Blur-master-jdk7 » Blur Util #1631
Archived 3 artifacts
Archive block size is 32768
Received 0 blocks and 177237 bytes
Compression is 0.0%
Took 0.28 sec
[JENKINS] Archiving <https://builds.apache.org/job/Blur-master-jdk7/ws/distribution/pom.xml>
to org.apache.blur/apache-blur/hadoop1-1.2.1-0.2.4-incubating-SNAPSHOT/apache-blur-hadoop1-1.2.1-0.2.4-incubating-SNAPSHOT.pom
Sending artifact delta relative to Blur-master-jdk7 » Distribution #1631
Archived 1 artifacts
Archive block size is 32768
Received 0 blocks and 3878 bytes
Compression is 0.0%
Took 7.2 sec
[JENKINS] Archiving <https://builds.apache.org/job/Blur-master-jdk7/ws/blur-hive/pom.xml>
to org.apache.blur/blur-hive/hadoop1-1.2.1-0.13.1-0.2.4-incubating-SNAPSHOT/blur-hive-hadoop1-1.2.1-0.13.1-0.2.4-incubating-SNAPSHOT.pom
Sending artifact delta relative to Blur-master-jdk7 » Blur Hive #1631
Archived 1 artifacts
Archive block size is 32768
Received 0 blocks and 12257 bytes
Compression is 0.0%
Took 1.8 sec
[JENKINS] Archiving <https://builds.apache.org/job/Blur-master-jdk7/ws/blur-command/pom.xml>
to org.apache.blur/blur-command/hadoop1-1.2.1-0.2.4-incubating-SNAPSHOT/blur-command-hadoop1-1.2.1-0.2.4-incubating-SNAPSHOT.pom
Sending artifact delta relative to Blur-master-jdk7 » Blur Command #1631
Archived 1 artifacts
Archive block size is 32768
Received 0 blocks and 5656 bytes
Compression is 0.0%
Took 0.16 sec
[JENKINS] Archiving <https://builds.apache.org/job/Blur-master-jdk7/ws/blur-console/pom.xml>
to org.apache.blur/blur-console/hadoop1-1.2.1-0.2.4-incubating-SNAPSHOT/blur-console-hadoop1-1.2.1-0.2.4-incubating-SNAPSHOT.pom
Sending artifact delta relative to Blur-master-jdk7 » Blur Console #1631
Archived 1 artifacts
Archive block size is 32768
Received 0 blocks and 9153 bytes
Compression is 0.0%
Took 0.38 sec
[JENKINS] Archiving <https://builds.apache.org/job/Blur-master-jdk7/ws/blur-status/pom.xml>
to org.apache.blur/blur-status/hadoop1-1.2.1-0.2.4-incubating-SNAPSHOT/blur-status-hadoop1-1.2.1-0.2.4-incubating-SNAPSHOT.pom
[JENKINS] Archiving <https://builds.apache.org/job/Blur-master-jdk7/ws/blur-status/target/blur-status-hadoop1-1.2.1-0.2.4-incubating-SNAPSHOT.jar>
to org.apache.blur/blur-status/hadoop1-1.2.1-0.2.4-incubating-SNAPSHOT/blur-status-hadoop1-1.2.1-0.2.4-incubating-SNAPSHOT.jar
Sending artifact delta relative to Blur-master-jdk7 » Blur Status #1631
Archived 2 artifacts
Archive block size is 32768
Received 0 blocks and 207369 bytes
Compression is 0.0%
Took 0.26 sec
Sending e-mails to: blur-dev@incubator.apache.org
channel stopped

Mime
View raw message