incubator-blur-dev mailing list archives

Site index · List index
Message view « Date » · « Thread »
Top « Date » · « Thread »
From Apache Jenkins Server <jenk...@builds.apache.org>
Subject Build failed in Jenkins: Blur-master-jdk7 #1532
Date Wed, 18 Mar 2015 02:23:42 GMT
See <https://builds.apache.org/job/Blur-master-jdk7/1532/changes>

Changes:

[amccurry] Adding sequential access detecting.

[amccurry] Changing legacy behavior so that if the old table block cache file types are left
null that the legacy behavior will not override the blur configuration.

------------------------------------------
[...truncated 373 lines...]
[INFO] Exclude: **/.project
[INFO] Exclude: **/.settings/**
[INFO] Exclude: **/.idea/**
[INFO] Exclude: **/*.iml
[INFO] Exclude: **/target/**
[INFO] Exclude: **/build/**
[INFO] Exclude: **/.codio
[INFO] Exclude: **/src/main/webapp/libs/**
[INFO] Exclude: **/node_modules/**
[INFO] Exclude: **/src/main/webapp/public/css/**
[INFO] Exclude: **/src/main/webapp/js/utils/*
[INFO] Exclude: **/src/main/webapp/public/js/modernizr.js
[INFO] Exclude: **/src/main/webapp/less/tagmanager.less
[INFO] Exclude: **/src/main/webapp/node_modules/**
[INFO] Exclude: **/src/main/webapp/.sass-cache/**
[INFO] Exclude: **/src/main/webapp/.tmp/**
[INFO] Exclude: **/.editorconfig
[INFO] Exclude: **/.jshintrc
[INFO] Exclude: **/package.json
[INFO] Exclude: **/src/main/scripts/grunt.sh
[INFO] Exclude: **/src/main/webapp/coverage/**
[INFO] Exclude: contrib/blur-console-v1/**
[INFO] Exclude: **/src/main/resources/org/apache/blur/thrift/util/words.txt
[INFO] Exclude: **/js/d3.v2.js
[INFO] Exclude: **/js/d3.v2.min.js
[INFO] Exclude: **/src/main/resources*/license-notes.txt
[INFO] Exclude: **/src/main/resources*/NOTICE-bin.base.txt
[INFO] Exclude: **/src/main/resources*/NOTICE-bin.txt
[INFO] Exclude: **/src/main/resources*/notices/*.src
[INFO] Exclude: **/src/main/scripts/conf/controllers
[INFO] Exclude: **/src/main/scripts/conf/consoles
[INFO] Exclude: **/src/main/scripts/conf/default_zoo.cfg
[INFO] Exclude: **/src/main/scripts/conf/shards
[INFO] Exclude: **/src/main/scripts/conf/zookeepers
[INFO] Exclude: **/src/main/scripts/interface/gen-html/Blur.html
[INFO] Exclude: **/src/main/scripts/interface/gen-html/index.html
[INFO] Exclude: **/.empty
[INFO] 202 resources included (use -debug for more details)
[INFO] Rat check: Summary of files. Unapproved: 0 unknown: 0 generated: 0 approved: 152 licence.
[INFO] 
[INFO] --- maven-jar-plugin:2.5:test-jar (default) @ blur-thrift ---
[INFO] Building jar: <https://builds.apache.org/job/Blur-master-jdk7/ws/blur-thrift/target/blur-thrift-hadoop1-1.2.1-0.2.4-incubating-SNAPSHOT-tests.jar>
[INFO] 
[INFO] --- maven-install-plugin:2.3.1:install (default-install) @ blur-thrift ---
[INFO] Installing <https://builds.apache.org/job/Blur-master-jdk7/ws/blur-thrift/target/blur-thrift-hadoop1-1.2.1-0.2.4-incubating-SNAPSHOT.jar>
to /home/jenkins/jenkins-slave/maven-repositories/0/org/apache/blur/blur-thrift/hadoop1-1.2.1-0.2.4-incubating-SNAPSHOT/blur-thrift-hadoop1-1.2.1-0.2.4-incubating-SNAPSHOT.jar
[INFO] Installing <https://builds.apache.org/job/Blur-master-jdk7/ws/blur-thrift/pom.xml>
to /home/jenkins/jenkins-slave/maven-repositories/0/org/apache/blur/blur-thrift/hadoop1-1.2.1-0.2.4-incubating-SNAPSHOT/blur-thrift-hadoop1-1.2.1-0.2.4-incubating-SNAPSHOT.pom
[INFO] Installing <https://builds.apache.org/job/Blur-master-jdk7/ws/blur-thrift/target/blur-thrift-hadoop1-1.2.1-0.2.4-incubating-SNAPSHOT-tests.jar>
to /home/jenkins/jenkins-slave/maven-repositories/0/org/apache/blur/blur-thrift/hadoop1-1.2.1-0.2.4-incubating-SNAPSHOT/blur-thrift-hadoop1-1.2.1-0.2.4-incubating-SNAPSHOT-tests.jar
[INFO] 
[INFO] --- maven-install-plugin:2.3.1:install-file (default) @ blur-thrift ---
[INFO] Installing <https://builds.apache.org/job/Blur-master-jdk7/ws/blur-thrift/target/blur-thrift-hadoop1-1.2.1-0.2.4-incubating-SNAPSHOT.jar>
to /home/jenkins/jenkins-slave/maven-repositories/0/org/apache/blur/blur-thrift/hadoop1-1.2.1-0.2.4-incubating-SNAPSHOT/blur-thrift-hadoop1-1.2.1-0.2.4-incubating-SNAPSHOT.jar
[INFO] Installing <https://builds.apache.org/job/Blur-master-jdk7/ws/blur-thrift/target/effective-pom.xml>
to /home/jenkins/jenkins-slave/maven-repositories/0/org/apache/blur/blur-thrift/hadoop1-1.2.1-0.2.4-incubating-SNAPSHOT/blur-thrift-hadoop1-1.2.1-0.2.4-incubating-SNAPSHOT.pom
[INFO]                                                                         
[INFO] ------------------------------------------------------------------------
[INFO] Building Blur Store hadoop1-1.2.1-0.2.4-incubating-SNAPSHOT
[INFO] ------------------------------------------------------------------------
[INFO] 
[INFO] --- maven-clean-plugin:2.5:clean (default-clean) @ blur-store ---
[INFO] Deleting <https://builds.apache.org/job/Blur-master-jdk7/ws/blur-store/target>
[INFO] 
[INFO] --- maven-remote-resources-plugin:1.5:process (default) @ blur-store ---
[INFO] 
[INFO] --- maven-help-plugin:2.2:effective-pom (default) @ blur-store ---
[INFO] Effective-POM written to: <https://builds.apache.org/job/Blur-master-jdk7/ws/blur-store/target/effective-pom.xml>
[INFO] 
[INFO] --- maven-resources-plugin:2.6:resources (default-resources) @ blur-store ---
[INFO] Using 'UTF-8' encoding to copy filtered resources.
[INFO] Copying 2 resources
[INFO] Copying 3 resources
[INFO] 
[INFO] --- maven-compiler-plugin:3.1:compile (default-compile) @ blur-store ---
[INFO] Changes detected - recompiling the module!
[INFO] Compiling 74 source files to <https://builds.apache.org/job/Blur-master-jdk7/ws/blur-store/target/classes>
[WARNING] <https://builds.apache.org/job/Blur-master-jdk7/ws/blur-store/src/main/java/org/apache/blur/store/blockcache_v2/cachevalue/UnsafeCacheValue.java>:[30,16]
sun.misc.Unsafe is internal proprietary API and may be removed in a future release
[WARNING] <https://builds.apache.org/job/Blur-master-jdk7/ws/blur-store/src/main/java/org/apache/blur/store/util/UnsafeUtil.java>:[21,16]
sun.misc.Unsafe is internal proprietary API and may be removed in a future release
[WARNING] <https://builds.apache.org/job/Blur-master-jdk7/ws/blur-store/src/main/java/org/apache/blur/store/blockcache_v2/cachevalue/UnsafeCacheValue.java>:[44,24]
sun.misc.Unsafe is internal proprietary API and may be removed in a future release
[WARNING] <https://builds.apache.org/job/Blur-master-jdk7/ws/blur-store/src/main/java/org/apache/blur/store/util/UnsafeUtil.java>:[25,24]
sun.misc.Unsafe is internal proprietary API and may be removed in a future release
[WARNING] <https://builds.apache.org/job/Blur-master-jdk7/ws/blur-store/src/main/java/org/apache/blur/store/util/UnsafeUtil.java>:[32,18]
sun.misc.Unsafe is internal proprietary API and may be removed in a future release
[WARNING] <https://builds.apache.org/job/Blur-master-jdk7/ws/blur-store/src/main/java/org/apache/blur/store/util/UnsafeUtil.java>:[38,17]
sun.misc.Unsafe is internal proprietary API and may be removed in a future release
[WARNING] <https://builds.apache.org/job/Blur-master-jdk7/ws/blur-store/src/main/java/org/apache/blur/store/buffer/ReusedBufferedIndexOutput.java>:
Some input files use or override a deprecated API.
[WARNING] <https://builds.apache.org/job/Blur-master-jdk7/ws/blur-store/src/main/java/org/apache/blur/store/buffer/ReusedBufferedIndexOutput.java>:
Recompile with -Xlint:deprecation for details.
[INFO] 
[INFO] --- maven-resources-plugin:2.6:testResources (default-testResources) @ blur-store ---
[INFO] Using 'UTF-8' encoding to copy filtered resources.
[INFO] Copying 1 resource
[INFO] Copying 3 resources
[INFO] 
[INFO] --- maven-compiler-plugin:3.1:testCompile (default-testCompile) @ blur-store ---
[INFO] Changes detected - recompiling the module!
[INFO] Compiling 21 source files to <https://builds.apache.org/job/Blur-master-jdk7/ws/blur-store/target/test-classes>
[INFO] -------------------------------------------------------------
[WARNING] COMPILATION WARNING : 
[INFO] -------------------------------------------------------------
[WARNING] <https://builds.apache.org/job/Blur-master-jdk7/ws/blur-store/src/test/java/org/apache/blur/store/BaseDirectoryTestSuite.java>:
Some input files use or override a deprecated API.
[WARNING] <https://builds.apache.org/job/Blur-master-jdk7/ws/blur-store/src/test/java/org/apache/blur/store/BaseDirectoryTestSuite.java>:
Recompile with -Xlint:deprecation for details.
[INFO] 2 warnings 
[INFO] -------------------------------------------------------------
[INFO] -------------------------------------------------------------
[ERROR] COMPILATION ERROR : 
[INFO] -------------------------------------------------------------
[ERROR] <https://builds.apache.org/job/Blur-master-jdk7/ws/blur-store/src/test/java/org/apache/blur/store/blockcache_v2/CacheIndexOutputTest.java>:[58,36]
constructor CacheIndexOutput in class org.apache.blur.store.blockcache_v2.CacheIndexOutput
cannot be applied to given types;
  required: org.apache.blur.store.blockcache_v2.CacheDirectory,java.lang.String,org.apache.blur.store.blockcache_v2.Cache,org.apache.lucene.store.Directory,org.apache.lucene.store.IOContext
  found: <nulltype>,java.lang.String,org.apache.lucene.store.IndexOutput,org.apache.blur.store.blockcache_v2.Cache
  reason: actual and formal argument lists differ in length
[ERROR] <https://builds.apache.org/job/Blur-master-jdk7/ws/blur-store/src/test/java/org/apache/blur/store/blockcache_v2/CacheIndexOutputTest.java>:[91,41]
constructor CacheIndexOutput in class org.apache.blur.store.blockcache_v2.CacheIndexOutput
cannot be applied to given types;
  required: org.apache.blur.store.blockcache_v2.CacheDirectory,java.lang.String,org.apache.blur.store.blockcache_v2.Cache,org.apache.lucene.store.Directory,org.apache.lucene.store.IOContext
  found: <nulltype>,java.lang.String,org.apache.lucene.store.IndexOutput,org.apache.blur.store.blockcache_v2.Cache
  reason: actual and formal argument lists differ in length
[INFO] 2 errors 
[INFO] -------------------------------------------------------------
[INFO] ------------------------------------------------------------------------
[INFO] Reactor Summary:
[INFO] 
[INFO] Blur .............................................. SUCCESS [5.509s]
[INFO] Blur Util ......................................... SUCCESS [17.465s]
[INFO] Blur Thrift ....................................... SUCCESS [9.809s]
[INFO] Blur Store ........................................ FAILURE [2.282s]
[INFO] Blur Query ........................................ SKIPPED
[INFO] Blur Status ....................................... SKIPPED
[INFO] Blur Core ......................................... SKIPPED
[INFO] Blur Command ...................................... SKIPPED
[INFO] Blur Console ...................................... SKIPPED
[INFO] Blur Map Reduce Hadoop1 ........................... SKIPPED
[INFO] Blur Hive ......................................... SKIPPED
[INFO] Blur Shell ........................................ SKIPPED
[INFO] Distribution ...................................... SKIPPED
[INFO] ------------------------------------------------------------------------
[INFO] BUILD FAILURE
[INFO] ------------------------------------------------------------------------
[INFO] Total time: 39.157s
[INFO] Finished at: Wed Mar 18 02:23:30 UTC 2015
[INFO] Final Memory: 44M/705M
[INFO] ------------------------------------------------------------------------
Waiting for Jenkins to finish collecting data[ERROR] Failed to execute goal org.apache.maven.plugins:maven-compiler-plugin:3.1:testCompile
(default-testCompile) on project blur-store: Compilation failure: Compilation failure:
[ERROR] <https://builds.apache.org/job/Blur-master-jdk7/ws/blur-store/src/test/java/org/apache/blur/store/blockcache_v2/CacheIndexOutputTest.java>:[58,36]
constructor CacheIndexOutput in class org.apache.blur.store.blockcache_v2.CacheIndexOutput
cannot be applied to given types;
[ERROR] required: org.apache.blur.store.blockcache_v2.CacheDirectory,java.lang.String,org.apache.blur.store.blockcache_v2.Cache,org.apache.lucene.store.Directory,org.apache.lucene.store.IOContext
[ERROR] found: <nulltype>,java.lang.String,org.apache.lucene.store.IndexOutput,org.apache.blur.store.blockcache_v2.Cache
[ERROR] reason: actual and formal argument lists differ in length
[ERROR] <https://builds.apache.org/job/Blur-master-jdk7/ws/blur-store/src/test/java/org/apache/blur/store/blockcache_v2/CacheIndexOutputTest.java>:[91,41]
constructor CacheIndexOutput in class org.apache.blur.store.blockcache_v2.CacheIndexOutput
cannot be applied to given types;
[ERROR] required: org.apache.blur.store.blockcache_v2.CacheDirectory,java.lang.String,org.apache.blur.store.blockcache_v2.Cache,org.apache.lucene.store.Directory,org.apache.lucene.store.IOContext
[ERROR] found: <nulltype>,java.lang.String,org.apache.lucene.store.IndexOutput,org.apache.blur.store.blockcache_v2.Cache
[ERROR] reason: actual and formal argument lists differ in length
[ERROR] -> [Help 1]
[ERROR] 
[ERROR] To see the full stack trace of the errors, re-run Maven with the -e switch.
[ERROR] Re-run Maven using the -X switch to enable full debug logging.
[ERROR] 
[ERROR] For more information about the errors and possible solutions, please read the following
articles:
[ERROR] [Help 1] http://cwiki.apache.org/confluence/display/MAVEN/MojoFailureException
[ERROR] 
[ERROR] After correcting the problems, you can resume the build with the command
[ERROR]   mvn <goals> -rf :blur-store

[JENKINS] Archiving <https://builds.apache.org/job/Blur-master-jdk7/ws/pom.xml> to org.apache.blur/blur/0.2.4-incubating-SNAPSHOT/blur-0.2.4-incubating-SNAPSHOT.pom
Sending artifact delta relative to Blur-master-jdk7 » Blur #1531
Archived 1 artifacts
Archive block size is 32768
Received 0 blocks and 19035 bytes
Compression is 0.0%
Took 96 ms
[JENKINS] Archiving <https://builds.apache.org/job/Blur-master-jdk7/ws/blur-mapred-hadoop1/pom.xml>
to org.apache.blur/blur-mapred-hadoop1/hadoop1-1.2.1-0.2.4-incubating-SNAPSHOT/blur-mapred-hadoop1-hadoop1-1.2.1-0.2.4-incubating-SNAPSHOT.pom
Sending artifact delta relative to Blur-master-jdk7 » Blur Map Reduce Hadoop1 #1531
Archived 1 artifacts
Archive block size is 32768
Received 0 blocks and 6532 bytes
Compression is 0.0%
Took 82 ms
[JENKINS] Archiving <https://builds.apache.org/job/Blur-master-jdk7/ws/blur-shell/pom.xml>
to org.apache.blur/blur-shell/hadoop1-1.2.1-0.2.4-incubating-SNAPSHOT/blur-shell-hadoop1-1.2.1-0.2.4-incubating-SNAPSHOT.pom
Sending artifact delta relative to Blur-master-jdk7 » Blur Shell #1531
Archived 1 artifacts
Archive block size is 32768
Received 0 blocks and 5164 bytes
Compression is 0.0%
Took 0.1 sec
[JENKINS] Archiving <https://builds.apache.org/job/Blur-master-jdk7/ws/blur-thrift/pom.xml>
to org.apache.blur/blur-thrift/hadoop1-1.2.1-0.2.4-incubating-SNAPSHOT/blur-thrift-hadoop1-1.2.1-0.2.4-incubating-SNAPSHOT.pom
[JENKINS] Archiving <https://builds.apache.org/job/Blur-master-jdk7/ws/blur-thrift/target/blur-thrift-hadoop1-1.2.1-0.2.4-incubating-SNAPSHOT.jar>
to org.apache.blur/blur-thrift/hadoop1-1.2.1-0.2.4-incubating-SNAPSHOT/blur-thrift-hadoop1-1.2.1-0.2.4-incubating-SNAPSHOT.jar
[JENKINS] Archiving <https://builds.apache.org/job/Blur-master-jdk7/ws/blur-thrift/target/blur-thrift-hadoop1-1.2.1-0.2.4-incubating-SNAPSHOT-tests.jar>
to org.apache.blur/blur-thrift/hadoop1-1.2.1-0.2.4-incubating-SNAPSHOT/blur-thrift-hadoop1-1.2.1-0.2.4-incubating-SNAPSHOT-tests.jar
Sending artifact delta relative to Blur-master-jdk7 » Blur Thrift #1531
Archived 3 artifacts
Archive block size is 32768
Received 0 blocks and 2362298 bytes
Compression is 0.0%
Took 0.72 sec
[JENKINS] Archiving <https://builds.apache.org/job/Blur-master-jdk7/ws/blur-query/pom.xml>
to org.apache.blur/blur-query/hadoop1-1.2.1-0.2.4-incubating-SNAPSHOT/blur-query-hadoop1-1.2.1-0.2.4-incubating-SNAPSHOT.pom
Sending artifact delta relative to Blur-master-jdk7 » Blur Query #1531
Archived 1 artifacts
Archive block size is 32768
Received 0 blocks and 5052 bytes
Compression is 0.0%
Took 82 ms
[JENKINS] Archiving <https://builds.apache.org/job/Blur-master-jdk7/ws/blur-core/pom.xml>
to org.apache.blur/blur-core/hadoop1-1.2.1-0.2.4-incubating-SNAPSHOT/blur-core-hadoop1-1.2.1-0.2.4-incubating-SNAPSHOT.pom
Sending artifact delta relative to Blur-master-jdk7 » Blur Core #1531
Archived 1 artifacts
Archive block size is 32768
Received 0 blocks and 6658 bytes
Compression is 0.0%
Took 88 ms
[JENKINS] Archiving <https://builds.apache.org/job/Blur-master-jdk7/ws/blur-store/pom.xml>
to org.apache.blur/blur-store/hadoop1-1.2.1-0.2.4-incubating-SNAPSHOT/blur-store-hadoop1-1.2.1-0.2.4-incubating-SNAPSHOT.pom
Sending artifact delta relative to Blur-master-jdk7 » Blur Store #1531
Archived 1 artifacts
Archive block size is 32768
Received 0 blocks and 6606 bytes
Compression is 0.0%
Took 74 ms
[JENKINS] Archiving <https://builds.apache.org/job/Blur-master-jdk7/ws/blur-util/pom.xml>
to org.apache.blur/blur-util/hadoop1-1.2.1-0.2.4-incubating-SNAPSHOT/blur-util-hadoop1-1.2.1-0.2.4-incubating-SNAPSHOT.pom
[JENKINS] Archiving <https://builds.apache.org/job/Blur-master-jdk7/ws/blur-util/target/blur-util-hadoop1-1.2.1-0.2.4-incubating-SNAPSHOT.jar>
to org.apache.blur/blur-util/hadoop1-1.2.1-0.2.4-incubating-SNAPSHOT/blur-util-hadoop1-1.2.1-0.2.4-incubating-SNAPSHOT.jar
[JENKINS] Archiving <https://builds.apache.org/job/Blur-master-jdk7/ws/blur-util/target/blur-util-hadoop1-1.2.1-0.2.4-incubating-SNAPSHOT-tests.jar>
to org.apache.blur/blur-util/hadoop1-1.2.1-0.2.4-incubating-SNAPSHOT/blur-util-hadoop1-1.2.1-0.2.4-incubating-SNAPSHOT-tests.jar
Sending artifact delta relative to Blur-master-jdk7 » Blur Util #1531
Archived 3 artifacts
Archive block size is 32768
Received 0 blocks and 176139 bytes
Compression is 0.0%
Took 0.11 sec
[JENKINS] Archiving <https://builds.apache.org/job/Blur-master-jdk7/ws/distribution/pom.xml>
to org.apache.blur/apache-blur/hadoop1-1.2.1-0.2.4-incubating-SNAPSHOT/apache-blur-hadoop1-1.2.1-0.2.4-incubating-SNAPSHOT.pom
Sending artifact delta relative to Blur-master-jdk7 » Distribution #1531
Archived 1 artifacts
Archive block size is 32768
Received 0 blocks and 4343 bytes
Compression is 0.0%
Took 3.4 sec
[JENKINS] Archiving <https://builds.apache.org/job/Blur-master-jdk7/ws/blur-hive/pom.xml>
to org.apache.blur/blur-hive/hadoop1-1.2.1-0.13.1-0.2.4-incubating-SNAPSHOT/blur-hive-hadoop1-1.2.1-0.13.1-0.2.4-incubating-SNAPSHOT.pom
Sending artifact delta relative to Blur-master-jdk7 » Blur Hive #1531
Archived 1 artifacts
Archive block size is 32768
Received 0 blocks and 12281 bytes
Compression is 0.0%
Took 0.46 sec
[JENKINS] Archiving <https://builds.apache.org/job/Blur-master-jdk7/ws/blur-command/pom.xml>
to org.apache.blur/blur-command/hadoop1-1.2.1-0.2.4-incubating-SNAPSHOT/blur-command-hadoop1-1.2.1-0.2.4-incubating-SNAPSHOT.pom
Sending artifact delta relative to Blur-master-jdk7 » Blur Command #1531
Archived 1 artifacts
Archive block size is 32768
Received 0 blocks and 5656 bytes
Compression is 0.0%
Took 79 ms
[JENKINS] Archiving <https://builds.apache.org/job/Blur-master-jdk7/ws/blur-console/pom.xml>
to org.apache.blur/blur-console/hadoop1-1.2.1-0.2.4-incubating-SNAPSHOT/blur-console-hadoop1-1.2.1-0.2.4-incubating-SNAPSHOT.pom
Sending artifact delta relative to Blur-master-jdk7 » Blur Console #1531
Archived 1 artifacts
Archive block size is 32768
Received 0 blocks and 9127 bytes
Compression is 0.0%
Took 0.12 sec
[JENKINS] Archiving <https://builds.apache.org/job/Blur-master-jdk7/ws/blur-status/pom.xml>
to org.apache.blur/blur-status/hadoop1-1.2.1-0.2.4-incubating-SNAPSHOT/blur-status-hadoop1-1.2.1-0.2.4-incubating-SNAPSHOT.pom
Sending artifact delta relative to Blur-master-jdk7 » Blur Status #1531
Archived 1 artifacts
Archive block size is 32768
Received 0 blocks and 4122 bytes
Compression is 0.0%
Took 72 ms
Sending e-mails to: blur-dev@incubator.apache.org
channel stopped

Mime
View raw message