incubator-blur-dev mailing list archives

Site index · List index
Message view « Date » · « Thread »
Top « Date » · « Thread »
From Apache Jenkins Server <jenk...@builds.apache.org>
Subject Build failed in Jenkins: Blur-master-jdk7 #1235
Date Sun, 21 Dec 2014 17:12:35 GMT
See <https://builds.apache.org/job/Blur-master-jdk7/1235/>

------------------------------------------
[...truncated 27625 lines...]
WARN  FSNamesystem - ReplicationMonitor thread received InterruptedExceptionjava.lang.InterruptedException:
sleep interrupted
Tests run: 2, Failures: 0, Errors: 0, Skipped: 0, Time elapsed: 18.845 sec
WARN  WatchChildren - Closing [36a7e194-5d56-4bbe-9e63-2d0f31a2547b]

Results :

Tests run: 9, Failures: 0, Errors: 0, Skipped: 0

[JENKINS] Recording test results
[INFO] 
[INFO] --- maven-jar-plugin:2.4:jar (default-jar) @ blur-console ---
[INFO] Building jar: <https://builds.apache.org/job/Blur-master-jdk7/ws/blur-console/target/blur-console-0.2.4-incubating-SNAPSHOT-hadoop1.jar>
[INFO] 
[INFO] --- maven-site-plugin:3.2:attach-descriptor (attach-descriptor) @ blur-console ---
[INFO] 
[INFO] --- apache-rat-plugin:0.10:check (default) @ blur-console ---
[INFO] 51 implicit excludes (use -debug for more details).
[INFO] Exclude: LICENSE
[INFO] Exclude: CHANGES.txt
[INFO] Exclude: DISCLAIMER
[INFO] Exclude: NOTICE
[INFO] Exclude: README
[INFO] Exclude: **/README.textile
[INFO] Exclude: **/README.md
[INFO] Exclude: **/.classpath
[INFO] Exclude: **/.project
[INFO] Exclude: **/.settings/**
[INFO] Exclude: **/.idea/**
[INFO] Exclude: **/*.iml
[INFO] Exclude: **/target/**
[INFO] Exclude: **/build/**
[INFO] Exclude: **/.codio
[INFO] Exclude: **/src/main/webapp/libs/**
[INFO] Exclude: **/node_modules/**
[INFO] Exclude: **/src/main/webapp/public/css/**
[INFO] Exclude: **/src/main/webapp/js/utils/*
[INFO] Exclude: **/src/main/webapp/public/js/modernizr.js
[INFO] Exclude: **/src/main/webapp/less/tagmanager.less
[INFO] Exclude: **/src/main/webapp/node_modules/**
[INFO] Exclude: **/src/main/webapp/.sass-cache/**
[INFO] Exclude: **/src/main/webapp/.tmp/**
[INFO] Exclude: **/.editorconfig
[INFO] Exclude: **/.jshintrc
[INFO] Exclude: **/package.json
[INFO] Exclude: **/src/main/scripts/grunt.sh
[INFO] Exclude: **/src/main/webapp/coverage/**
[INFO] Exclude: contrib/blur-console-v1/**
[INFO] Exclude: **/src/main/resources/org/apache/blur/thrift/util/words.txt
[INFO] Exclude: **/src/main/webapp/js/d3.v2.js
[INFO] Exclude: **/src/main/webapp/js/d3.v2.min.js
[INFO] Exclude: **/src/main/resources*/license-notes.txt
[INFO] Exclude: **/src/main/resources*/NOTICE-bin.base.txt
[INFO] Exclude: **/src/main/resources*/NOTICE-bin.txt
[INFO] Exclude: **/src/main/resources*/notices/*.src
[INFO] Exclude: **/src/main/scripts/conf/controllers
[INFO] Exclude: **/src/main/scripts/conf/consoles
[INFO] Exclude: **/src/main/scripts/conf/default_zoo.cfg
[INFO] Exclude: **/src/main/scripts/conf/shards
[INFO] Exclude: **/src/main/scripts/conf/zookeepers
[INFO] Exclude: **/src/main/scripts/interface/gen-html/Blur.html
[INFO] Exclude: **/src/main/scripts/interface/gen-html/index.html
[INFO] Exclude: **/.empty
[INFO] 85 resources included (use -debug for more details)
[INFO] Rat check: Summary of files. Unapproved: 0 unknown: 0 generated: 0 approved: 83 licence.
[INFO] 
[INFO] --- maven-jar-plugin:2.4:test-jar (default) @ blur-console ---
[INFO] Building jar: <https://builds.apache.org/job/Blur-master-jdk7/ws/blur-console/target/blur-console-0.2.4-incubating-SNAPSHOT-hadoop1-tests.jar>
[INFO] 
[INFO] --- maven-assembly-plugin:2.2.1:single (make-assembly) @ blur-console ---
[INFO] Reading assembly descriptor: src/assemble/webapp.xml
[INFO] Building jar: <https://builds.apache.org/job/Blur-master-jdk7/ws/blur-console/target/blur-console-0.2.4-incubating-SNAPSHOT-hadoop1-webapp.jar>
[INFO] 
[INFO] --- maven-install-plugin:2.3.1:install (default-install) @ blur-console ---
[INFO] Installing <https://builds.apache.org/job/Blur-master-jdk7/ws/blur-console/target/blur-console-0.2.4-incubating-SNAPSHOT-hadoop1.jar>
to /home/jenkins/jenkins-slave/maven-repositories/0/org/apache/blur/blur-console/0.2.4-incubating-SNAPSHOT-hadoop1/blur-console-0.2.4-incubating-SNAPSHOT-hadoop1.jar
[INFO] Installing <https://builds.apache.org/job/Blur-master-jdk7/ws/blur-console/pom.xml>
to /home/jenkins/jenkins-slave/maven-repositories/0/org/apache/blur/blur-console/0.2.4-incubating-SNAPSHOT-hadoop1/blur-console-0.2.4-incubating-SNAPSHOT-hadoop1.pom
[INFO] Installing <https://builds.apache.org/job/Blur-master-jdk7/ws/blur-console/target/blur-console-0.2.4-incubating-SNAPSHOT-hadoop1-tests.jar>
to /home/jenkins/jenkins-slave/maven-repositories/0/org/apache/blur/blur-console/0.2.4-incubating-SNAPSHOT-hadoop1/blur-console-0.2.4-incubating-SNAPSHOT-hadoop1-tests.jar
[INFO] Installing <https://builds.apache.org/job/Blur-master-jdk7/ws/blur-console/target/blur-console-0.2.4-incubating-SNAPSHOT-hadoop1-webapp.jar>
to /home/jenkins/jenkins-slave/maven-repositories/0/org/apache/blur/blur-console/0.2.4-incubating-SNAPSHOT-hadoop1/blur-console-0.2.4-incubating-SNAPSHOT-hadoop1-webapp.jar
[INFO]                                                                         
[INFO] ------------------------------------------------------------------------
[INFO] Building Blur Map Reduce Hadoop1 0.2.4-incubating-SNAPSHOT-hadoop1
[INFO] ------------------------------------------------------------------------
[INFO] 
[INFO] --- maven-clean-plugin:2.5:clean (default-clean) @ blur-mapred-hadoop1 ---
[INFO] Deleting <https://builds.apache.org/job/Blur-master-jdk7/ws/blur-mapred-hadoop1/target>
[INFO] 
[INFO] --- maven-remote-resources-plugin:1.4:process (default) @ blur-mapred-hadoop1 ---
[INFO] 
[INFO] --- maven-resources-plugin:2.6:resources (default-resources) @ blur-mapred-hadoop1
---
[INFO] Using 'UTF-8' encoding to copy filtered resources.
[INFO] skip non existing resourceDirectory <https://builds.apache.org/job/Blur-master-jdk7/ws/blur-mapred-hadoop1/src/main/resources>
[INFO] Copying 3 resources
[INFO] 
[INFO] --- maven-compiler-plugin:2.5.1:compile (default-compile) @ blur-mapred-hadoop1 ---
[INFO] Compiling 29 source files to <https://builds.apache.org/job/Blur-master-jdk7/ws/blur-mapred-hadoop1/target/classes>
[INFO] -------------------------------------------------------------
[ERROR] COMPILATION ERROR : 
[INFO] -------------------------------------------------------------
[ERROR] <https://builds.apache.org/job/Blur-master-jdk7/ws/blur-mapred-hadoop1/src/main/java/org/apache/blur/mapreduce/lib/BlurOutputCommitter.java>:[89,31]
error: cannot find symbol
[ERROR]   symbol:   method getShardName(String,int)
  location: class BlurUtil
<https://builds.apache.org/job/Blur-master-jdk7/ws/blur-mapred-hadoop1/src/main/java/org/apache/blur/mapreduce/lib/BlurOutputCommitter.java>:[188,33]
error: cannot find symbol
[ERROR]   symbol:   method getShardName(int)
  location: class BlurUtil
<https://builds.apache.org/job/Blur-master-jdk7/ws/blur-mapred-hadoop1/src/main/java/org/apache/blur/mapreduce/lib/GenericBlurRecordWriter.java>:[110,31]
error: cannot find symbol
[INFO] 3 errors 
[INFO] -------------------------------------------------------------
[INFO] ------------------------------------------------------------------------
[INFO] Reactor Summary:
[INFO] 
[INFO] Blur .............................................. SUCCESS [5.648s]
[INFO] Blur Util ......................................... SUCCESS [18.341s]
[INFO] Blur Thrift ....................................... SUCCESS [9.296s]
[INFO] Blur Store ........................................ SUCCESS [1:03.816s]
[INFO] Blur Query ........................................ SUCCESS [4:56.953s]
[INFO] Blur GUI .......................................... SUCCESS [5.847s]
[INFO] Blur Core ......................................... SUCCESS [7:16.287s]
[INFO] Blur Command ...................................... SUCCESS [6.914s]
[INFO] Blur Console ...................................... SUCCESS [1:14.349s]
[INFO] Blur Map Reduce Hadoop1 ........................... FAILURE [1.741s]
[INFO] Blur Shell ........................................ SKIPPED
[INFO] Distribution ...................................... SKIPPED
[INFO] ------------------------------------------------------------------------
[INFO] BUILD FAILURE
[INFO] ------------------------------------------------------------------------
[INFO] Total time: 15:27.973s
[INFO] Finished at: Sun Dec 21 17:12:16 UTC 2014
[INFO] Final Memory: 56M/416M
[INFO] ------------------------------------------------------------------------
Waiting for Jenkins to finish collecting data[ERROR] Failed to execute goal org.apache.maven.plugins:maven-compiler-plugin:2.5.1:compile
(default-compile) on project blur-mapred-hadoop1: Compilation failure: Compilation failure:
[ERROR] <https://builds.apache.org/job/Blur-master-jdk7/ws/blur-mapred-hadoop1/src/main/java/org/apache/blur/mapreduce/lib/BlurOutputCommitter.java>:[89,31]
error: cannot find symbol
[ERROR] symbol:   method getShardName(String,int)
[ERROR] location: class BlurUtil
[ERROR] <https://builds.apache.org/job/Blur-master-jdk7/ws/blur-mapred-hadoop1/src/main/java/org/apache/blur/mapreduce/lib/BlurOutputCommitter.java>:[188,33]
error: cannot find symbol
[ERROR] symbol:   method getShardName(int)
[ERROR] location: class BlurUtil
[ERROR] <https://builds.apache.org/job/Blur-master-jdk7/ws/blur-mapred-hadoop1/src/main/java/org/apache/blur/mapreduce/lib/GenericBlurRecordWriter.java>:[110,31]
error: cannot find symbol
[ERROR] -> [Help 1]
[ERROR] 
[ERROR] To see the full stack trace of the errors, re-run Maven with the -e switch.
[ERROR] Re-run Maven using the -X switch to enable full debug logging.
[ERROR] 
[ERROR] For more information about the errors and possible solutions, please read the following
articles:
[ERROR] [Help 1] http://cwiki.apache.org/confluence/display/MAVEN/MojoFailureException
[ERROR] 
[ERROR] After correcting the problems, you can resume the build with the command
[ERROR]   mvn <goals> -rf :blur-mapred-hadoop1

[JENKINS] Archiving <https://builds.apache.org/job/Blur-master-jdk7/ws/blur-shell/pom.xml>
to org.apache.blur/blur-shell/0.2.4-incubating-SNAPSHOT-hadoop1/blur-shell-0.2.4-incubating-SNAPSHOT-hadoop1.pom
Sending artifact delta relative to Blur-master-jdk7 » Blur Shell #1225
Archived 1 artifacts
Archive block size is 32768
Received 0 blocks and 4686 bytes
Compression is 0.0%
Took 0.25 sec
[JENKINS] Archiving <https://builds.apache.org/job/Blur-master-jdk7/ws/blur-mapred-hadoop1/pom.xml>
to org.apache.blur/blur-mapred-hadoop1/0.2.4-incubating-SNAPSHOT-hadoop1/blur-mapred-hadoop1-0.2.4-incubating-SNAPSHOT-hadoop1.pom
Sending artifact delta relative to Blur-master-jdk7 » Blur Map Reduce Hadoop1 #1225
Archived 1 artifacts
Archive block size is 32768
Received 0 blocks and 6094 bytes
Compression is 0.0%
Took 0.25 sec
[JENKINS] Archiving <https://builds.apache.org/job/Blur-master-jdk7/ws/pom.xml> to org.apache.blur/blur/0.2.4-incubating-SNAPSHOT/blur-0.2.4-incubating-SNAPSHOT.pom
Sending artifact delta relative to Blur-master-jdk7 » Blur #1234
Archived 1 artifacts
Archive block size is 32768
Received 0 blocks and 18106 bytes
Compression is 0.0%
Took 0.13 sec
[JENKINS] Archiving <https://builds.apache.org/job/Blur-master-jdk7/ws/blur-util/pom.xml>
to org.apache.blur/blur-util/0.2.4-incubating-SNAPSHOT-hadoop1/blur-util-0.2.4-incubating-SNAPSHOT-hadoop1.pom
[JENKINS] Archiving <https://builds.apache.org/job/Blur-master-jdk7/ws/blur-util/target/blur-util-0.2.4-incubating-SNAPSHOT-hadoop1.jar>
to org.apache.blur/blur-util/0.2.4-incubating-SNAPSHOT-hadoop1/blur-util-0.2.4-incubating-SNAPSHOT-hadoop1.jar
[JENKINS] Archiving <https://builds.apache.org/job/Blur-master-jdk7/ws/blur-util/target/blur-util-0.2.4-incubating-SNAPSHOT-hadoop1-tests.jar>
to org.apache.blur/blur-util/0.2.4-incubating-SNAPSHOT-hadoop1/blur-util-0.2.4-incubating-SNAPSHOT-hadoop1-tests.jar
Sending artifact delta relative to Blur-master-jdk7 » Blur Util #1234
Archived 3 artifacts
Archive block size is 32768
Received 0 blocks and 167279 bytes
Compression is 0.0%
Took 0.36 sec
[JENKINS] Archiving <https://builds.apache.org/job/Blur-master-jdk7/ws/distribution/pom.xml>
to org.apache.blur/apache-blur/0.2.4-incubating-SNAPSHOT-hadoop1/apache-blur-0.2.4-incubating-SNAPSHOT-hadoop1.pom
Sending artifact delta relative to Blur-master-jdk7 » Distribution #1225
Archived 1 artifacts
Archive block size is 32768
Received 0 blocks and 4548 bytes
Compression is 0.0%
Took 1.9 sec
[JENKINS] Archiving <https://builds.apache.org/job/Blur-master-jdk7/ws/blur-thrift/pom.xml>
to org.apache.blur/blur-thrift/0.2.4-incubating-SNAPSHOT-hadoop1/blur-thrift-0.2.4-incubating-SNAPSHOT-hadoop1.pom
[JENKINS] Archiving <https://builds.apache.org/job/Blur-master-jdk7/ws/blur-thrift/target/blur-thrift-0.2.4-incubating-SNAPSHOT-hadoop1.jar>
to org.apache.blur/blur-thrift/0.2.4-incubating-SNAPSHOT-hadoop1/blur-thrift-0.2.4-incubating-SNAPSHOT-hadoop1.jar
[JENKINS] Archiving <https://builds.apache.org/job/Blur-master-jdk7/ws/blur-thrift/target/blur-thrift-0.2.4-incubating-SNAPSHOT-hadoop1-tests.jar>
to org.apache.blur/blur-thrift/0.2.4-incubating-SNAPSHOT-hadoop1/blur-thrift-0.2.4-incubating-SNAPSHOT-hadoop1-tests.jar
Sending artifact delta relative to Blur-master-jdk7 » Blur Thrift #1234
Archived 3 artifacts
Archive block size is 32768
Received 0 blocks and 2252103 bytes
Compression is 0.0%
Took 0.91 sec
[JENKINS] Archiving <https://builds.apache.org/job/Blur-master-jdk7/ws/blur-query/pom.xml>
to org.apache.blur/blur-query/0.2.4-incubating-SNAPSHOT-hadoop1/blur-query-0.2.4-incubating-SNAPSHOT-hadoop1.pom
[JENKINS] Archiving <https://builds.apache.org/job/Blur-master-jdk7/ws/blur-query/target/blur-query-0.2.4-incubating-SNAPSHOT-hadoop1.jar>
to org.apache.blur/blur-query/0.2.4-incubating-SNAPSHOT-hadoop1/blur-query-0.2.4-incubating-SNAPSHOT-hadoop1.jar
[JENKINS] Archiving <https://builds.apache.org/job/Blur-master-jdk7/ws/blur-query/target/blur-query-0.2.4-incubating-SNAPSHOT-hadoop1-tests.jar>
to org.apache.blur/blur-query/0.2.4-incubating-SNAPSHOT-hadoop1/blur-query-0.2.4-incubating-SNAPSHOT-hadoop1-tests.jar
Sending artifact delta relative to Blur-master-jdk7 » Blur Query #1234
Archived 3 artifacts
Archive block size is 32768
Received 0 blocks and 240050 bytes
Compression is 0.0%
Took 0.18 sec
[JENKINS] Archiving <https://builds.apache.org/job/Blur-master-jdk7/ws/blur-command/pom.xml>
to org.apache.blur/blur-command/0.2.4-incubating-SNAPSHOT-hadoop1/blur-command-0.2.4-incubating-SNAPSHOT-hadoop1.pom
[JENKINS] Archiving <https://builds.apache.org/job/Blur-master-jdk7/ws/blur-command/target/blur-command-0.2.4-incubating-SNAPSHOT-hadoop1.jar>
to org.apache.blur/blur-command/0.2.4-incubating-SNAPSHOT-hadoop1/blur-command-0.2.4-incubating-SNAPSHOT-hadoop1.jar
[JENKINS] Archiving <https://builds.apache.org/job/Blur-master-jdk7/ws/blur-command/target/blur-command-0.2.4-incubating-SNAPSHOT-hadoop1-tests.jar>
to org.apache.blur/blur-command/0.2.4-incubating-SNAPSHOT-hadoop1/blur-command-0.2.4-incubating-SNAPSHOT-hadoop1-tests.jar
Sending artifact delta relative to Blur-master-jdk7 » Blur Command #1234
Archived 3 artifacts
Archive block size is 32768
Received 0 blocks and 66110 bytes
Compression is 0.0%
Took 0.15 sec
[JENKINS] Archiving <https://builds.apache.org/job/Blur-master-jdk7/ws/blur-store/pom.xml>
to org.apache.blur/blur-store/0.2.4-incubating-SNAPSHOT-hadoop1/blur-store-0.2.4-incubating-SNAPSHOT-hadoop1.pom
[JENKINS] Archiving <https://builds.apache.org/job/Blur-master-jdk7/ws/blur-store/target/blur-store-0.2.4-incubating-SNAPSHOT-hadoop1.jar>
to org.apache.blur/blur-store/0.2.4-incubating-SNAPSHOT-hadoop1/blur-store-0.2.4-incubating-SNAPSHOT-hadoop1.jar
[JENKINS] Archiving <https://builds.apache.org/job/Blur-master-jdk7/ws/blur-store/target/blur-store-0.2.4-incubating-SNAPSHOT-hadoop1-tests.jar>
to org.apache.blur/blur-store/0.2.4-incubating-SNAPSHOT-hadoop1/blur-store-0.2.4-incubating-SNAPSHOT-hadoop1-tests.jar
Sending artifact delta relative to Blur-master-jdk7 » Blur Store #1234
Archived 3 artifacts
Archive block size is 32768
Received 0 blocks and 294407 bytes
Compression is 0.0%
Took 0.24 sec
[JENKINS] Archiving <https://builds.apache.org/job/Blur-master-jdk7/ws/blur-core/pom.xml>
to org.apache.blur/blur-core/0.2.4-incubating-SNAPSHOT-hadoop1/blur-core-0.2.4-incubating-SNAPSHOT-hadoop1.pom
[JENKINS] Archiving <https://builds.apache.org/job/Blur-master-jdk7/ws/blur-core/target/blur-core-0.2.4-incubating-SNAPSHOT-hadoop1.jar>
to org.apache.blur/blur-core/0.2.4-incubating-SNAPSHOT-hadoop1/blur-core-0.2.4-incubating-SNAPSHOT-hadoop1.jar
[JENKINS] Archiving <https://builds.apache.org/job/Blur-master-jdk7/ws/blur-core/target/blur-core-0.2.4-incubating-SNAPSHOT-hadoop1-tests.jar>
to org.apache.blur/blur-core/0.2.4-incubating-SNAPSHOT-hadoop1/blur-core-0.2.4-incubating-SNAPSHOT-hadoop1-tests.jar
Sending artifact delta relative to Blur-master-jdk7 » Blur Core #1234
Archived 3 artifacts
Archive block size is 32768
Received 0 blocks and 801408 bytes
Compression is 0.0%
Took 0.47 sec
[JENKINS] Archiving <https://builds.apache.org/job/Blur-master-jdk7/ws/blur-gui/pom.xml>
to org.apache.blur/blur-gui/0.2.4-incubating-SNAPSHOT-hadoop1/blur-gui-0.2.4-incubating-SNAPSHOT-hadoop1.pom
[JENKINS] Archiving <https://builds.apache.org/job/Blur-master-jdk7/ws/blur-gui/target/blur-gui-0.2.4-incubating-SNAPSHOT-hadoop1.war>
to org.apache.blur/blur-gui/0.2.4-incubating-SNAPSHOT-hadoop1/blur-gui-0.2.4-incubating-SNAPSHOT-hadoop1.war
Sending artifact delta relative to Blur-master-jdk7 » Blur GUI #1234
Archived 2 artifacts
Archive block size is 32768
Received 889 blocks and 5230705 bytes
Compression is 84.8%
Took 2.7 sec
[JENKINS] Archiving <https://builds.apache.org/job/Blur-master-jdk7/ws/blur-console/pom.xml>
to org.apache.blur/blur-console/0.2.4-incubating-SNAPSHOT-hadoop1/blur-console-0.2.4-incubating-SNAPSHOT-hadoop1.pom
[JENKINS] Archiving <https://builds.apache.org/job/Blur-master-jdk7/ws/blur-console/target/blur-console-0.2.4-incubating-SNAPSHOT-hadoop1.jar>
to org.apache.blur/blur-console/0.2.4-incubating-SNAPSHOT-hadoop1/blur-console-0.2.4-incubating-SNAPSHOT-hadoop1.jar
[JENKINS] Archiving <https://builds.apache.org/job/Blur-master-jdk7/ws/blur-console/target/blur-console-0.2.4-incubating-SNAPSHOT-hadoop1-tests.jar>
to org.apache.blur/blur-console/0.2.4-incubating-SNAPSHOT-hadoop1/blur-console-0.2.4-incubating-SNAPSHOT-hadoop1-tests.jar
[JENKINS] Archiving <https://builds.apache.org/job/Blur-master-jdk7/ws/blur-console/target/blur-console-0.2.4-incubating-SNAPSHOT-hadoop1-webapp.jar>
to org.apache.blur/blur-console/0.2.4-incubating-SNAPSHOT-hadoop1/blur-console-0.2.4-incubating-SNAPSHOT-hadoop1-webapp.jar
Sending artifact delta relative to Blur-master-jdk7 » Blur Console #1234
Archived 4 artifacts
Archive block size is 32768
Received 24 blocks and 457295 bytes
Compression is 63.2%
Took 0.52 sec
Sending e-mails to: blur-dev@incubator.apache.org
channel stopped

Mime
View raw message