incubator-blur-dev mailing list archives

Site index · List index
Message view « Date » · « Thread »
Top « Date » · « Thread »
From Apache Jenkins Server <jenk...@builds.apache.org>
Subject Build failed in Jenkins: Blur-master-jdk7 » Blur Map Reduce Hadoop1 #1230
Date Sat, 20 Dec 2014 15:04:00 GMT
See <https://builds.apache.org/job/Blur-master-jdk7/org.apache.blur$blur-mapred-hadoop1/1230/>

------------------------------------------
[INFO]                                                                         
[INFO] ------------------------------------------------------------------------
[INFO] Building Blur Map Reduce Hadoop1 0.2.4-incubating-SNAPSHOT-hadoop1
[INFO] ------------------------------------------------------------------------
[INFO] 
[INFO] --- maven-clean-plugin:2.5:clean (default-clean) @ blur-mapred-hadoop1 ---
[INFO] Deleting <https://builds.apache.org/job/Blur-master-jdk7/org.apache.blur$blur-mapred-hadoop1/ws/target>
[INFO] 
[INFO] --- maven-remote-resources-plugin:1.4:process (default) @ blur-mapred-hadoop1 ---
[INFO] 
[INFO] --- maven-resources-plugin:2.6:resources (default-resources) @ blur-mapred-hadoop1
---
[INFO] Using 'UTF-8' encoding to copy filtered resources.
[INFO] skip non existing resourceDirectory <https://builds.apache.org/job/Blur-master-jdk7/org.apache.blur$blur-mapred-hadoop1/ws/src/main/resources>
[INFO] Copying 3 resources
[INFO] 
[INFO] --- maven-compiler-plugin:2.5.1:compile (default-compile) @ blur-mapred-hadoop1 ---
[INFO] Compiling 29 source files to <https://builds.apache.org/job/Blur-master-jdk7/org.apache.blur$blur-mapred-hadoop1/ws/target/classes>
[INFO] -------------------------------------------------------------
[ERROR] COMPILATION ERROR : 
[INFO] -------------------------------------------------------------
[ERROR] <https://builds.apache.org/job/Blur-master-jdk7/org.apache.blur$blur-mapred-hadoop1/ws/src/main/java/org/apache/blur/mapreduce/lib/BlurOutputCommitter.java>:[89,31]
error: cannot find symbol
[ERROR]   symbol:   method getShardName(String,int)
  location: class BlurUtil
<https://builds.apache.org/job/Blur-master-jdk7/org.apache.blur$blur-mapred-hadoop1/ws/src/main/java/org/apache/blur/mapreduce/lib/BlurOutputCommitter.java>:[188,33]
error: cannot find symbol
[ERROR]   symbol:   method getShardName(int)
  location: class BlurUtil
<https://builds.apache.org/job/Blur-master-jdk7/org.apache.blur$blur-mapred-hadoop1/ws/src/main/java/org/apache/blur/mapreduce/lib/GenericBlurRecordWriter.java>:[110,31]
error: cannot find symbol
[INFO] 3 errors 
[INFO] -------------------------------------------------------------

Mime
View raw message