incubator-blur-dev mailing list archives

Site index · List index
Message view « Date » · « Thread »
Top « Date » · « Thread »
From Apache Jenkins Server <jenk...@builds.apache.org>
Subject Build failed in Jenkins: Blur-master-jdk7 #1193
Date Fri, 12 Dec 2014 17:30:27 GMT
See <https://builds.apache.org/job/Blur-master-jdk7/1193/>

------------------------------------------
Started by upstream project "maven-plugins" build number 2481
originally caused by:
 Started by an SCM change
Building remotely on jenkins-ubuntu-1404-4gb-505 (jenkins-cloud-4GB Ubuntu ubuntu) in workspace
<https://builds.apache.org/job/Blur-master-jdk7/ws/>
Cloning the remote Git repository
Cloning repository https://git-wip-us.apache.org/repos/asf/incubator-blur.git
 > git init <https://builds.apache.org/job/Blur-master-jdk7/ws/> # timeout=10
Fetching upstream changes from https://git-wip-us.apache.org/repos/asf/incubator-blur.git
 > git --version # timeout=10
 > git fetch --tags --progress https://git-wip-us.apache.org/repos/asf/incubator-blur.git
+refs/heads/*:refs/remotes/origin/*
 > git config remote.origin.url https://git-wip-us.apache.org/repos/asf/incubator-blur.git
# timeout=10
 > git config remote.origin.fetch +refs/heads/*:refs/remotes/origin/* # timeout=10
 > git config remote.origin.url https://git-wip-us.apache.org/repos/asf/incubator-blur.git
# timeout=10
Fetching upstream changes from https://git-wip-us.apache.org/repos/asf/incubator-blur.git
 > git fetch --tags --progress https://git-wip-us.apache.org/repos/asf/incubator-blur.git
+refs/heads/*:refs/remotes/origin/*
 > git rev-parse refs/remotes/origin/master^{commit} # timeout=10
 > git rev-parse refs/remotes/origin/origin/master^{commit} # timeout=10
Checking out Revision cf2a566f08fd0929c81b1896bfad59d7a6cfbaf4 (refs/remotes/origin/master)
 > git config core.sparsecheckout # timeout=10
 > git checkout -f cf2a566f08fd0929c81b1896bfad59d7a6cfbaf4
 > git rev-list cf2a566f08fd0929c81b1896bfad59d7a6cfbaf4 # timeout=10
Parsing POMs
ERROR: Failed to parse POMs
java.io.IOException: remote file operation failed: <https://builds.apache.org/job/Blur-master-jdk7/ws/>
at hudson.remoting.Channel@75ee55fa:jenkins-ubuntu-1404-4gb-505
	at hudson.FilePath.act(FilePath.java:916)
	at hudson.FilePath.act(FilePath.java:893)
	at hudson.maven.MavenModuleSetBuild$MavenModuleSetBuildExecution.parsePoms(MavenModuleSetBuild.java:950)
	at hudson.maven.MavenModuleSetBuild$MavenModuleSetBuildExecution.doRun(MavenModuleSetBuild.java:677)
	at hudson.model.AbstractBuild$AbstractBuildExecution.run(AbstractBuild.java:529)
	at hudson.model.Run.execute(Run.java:1706)
	at hudson.maven.MavenModuleSetBuild.run(MavenModuleSetBuild.java:529)
	at hudson.model.ResourceController.execute(ResourceController.java:88)
	at hudson.model.Executor.run(Executor.java:232)
Caused by: hudson.remoting.ProxyException: hudson.maven.MavenModuleSetBuild$MavenExecutionException:
hudson.maven.MavenEmbedderException: 1 problem was encountered while building the effective
settings
[FATAL] Non-readable settings /home/jenkins/.m2/settings.xml: input contained no data @ /home/jenkins/.m2/settings.xml

	at hudson.maven.MavenModuleSetBuild$PomParser.invoke(MavenModuleSetBuild.java:1352)
	at hudson.maven.MavenModuleSetBuild$PomParser.invoke(MavenModuleSetBuild.java:1088)
	at hudson.FilePath$FileCallableWrapper.call(FilePath.java:2474)
	at hudson.remoting.UserRequest.perform(UserRequest.java:118)
	at hudson.remoting.UserRequest.perform(UserRequest.java:48)
	at hudson.remoting.Request$2.run(Request.java:328)
	at hudson.remoting.InterceptingExecutorService$1.call(InterceptingExecutorService.java:72)
	at java.util.concurrent.FutureTask.run(FutureTask.java:262)
	at java.util.concurrent.ThreadPoolExecutor.runWorker(ThreadPoolExecutor.java:1145)
	at java.util.concurrent.ThreadPoolExecutor$Worker.run(ThreadPoolExecutor.java:615)
	at java.lang.Thread.run(Thread.java:745)
Caused by: hudson.remoting.ProxyException: hudson.maven.MavenEmbedderException: 1 problem
was encountered while building the effective settings
[FATAL] Non-readable settings /home/jenkins/.m2/settings.xml: input contained no data @ /home/jenkins/.m2/settings.xml

	at hudson.maven.MavenEmbedder.<init>(MavenEmbedder.java:128)
	at hudson.maven.MavenEmbedder.<init>(MavenEmbedder.java:109)
	at hudson.maven.MavenEmbedder.<init>(MavenEmbedder.java:136)
	at hudson.maven.MavenUtil.createEmbedder(MavenUtil.java:212)
	at hudson.maven.MavenModuleSetBuild$PomParser.invoke(MavenModuleSetBuild.java:1285)
	... 10 more
Caused by: hudson.remoting.ProxyException: hudson.maven.MavenEmbedderException: 1 problem
was encountered while building the effective settings
[FATAL] Non-readable settings /home/jenkins/.m2/settings.xml: input contained no data @ /home/jenkins/.m2/settings.xml

	at hudson.maven.MavenEmbedder.getSettings(MavenEmbedder.java:261)
	at hudson.maven.MavenEmbedder.buildMavenExecutionRequest(MavenEmbedder.java:157)
	at hudson.maven.MavenEmbedder.<init>(MavenEmbedder.java:120)
	... 14 more
Caused by: hudson.remoting.ProxyException: org.apache.maven.settings.building.SettingsBuildingException:
1 problem was encountered while building the effective settings
[FATAL] Non-readable settings /home/jenkins/.m2/settings.xml: input contained no data @ /home/jenkins/.m2/settings.xml

	at org.apache.maven.settings.building.DefaultSettingsBuilder.build(DefaultSettingsBuilder.java:116)
	at hudson.maven.MavenEmbedder.getSettings(MavenEmbedder.java:259)
	... 16 more

Mime
View raw message