incubator-blur-dev mailing list archives

Site index · List index
Message view « Date » · « Thread »
Top « Date » · « Thread »
From Apache Jenkins Server <jenk...@builds.apache.org>
Subject Build failed in Jenkins: Blur-master-jdk7 #1143
Date Sun, 30 Nov 2014 17:07:39 GMT
See <https://builds.apache.org/job/Blur-master-jdk7/1143/changes>

Changes:

[rohr.chris] merged in BLUR-367 update

------------------------------------------
[...truncated 26144 lines...]
	at java.lang.Thread.run(Thread.java:724)

WARN  MBeans - Hadoop:service=DataNode,name=DataNodeInfo
javax.management.InstanceNotFoundException: Hadoop:service=DataNode,name=DataNodeInfo
	at com.sun.jmx.interceptor.DefaultMBeanServerInterceptor.getMBean(DefaultMBeanServerInterceptor.java:1095)
	at com.sun.jmx.interceptor.DefaultMBeanServerInterceptor.exclusiveUnregisterMBean(DefaultMBeanServerInterceptor.java:427)
	at com.sun.jmx.interceptor.DefaultMBeanServerInterceptor.unregisterMBean(DefaultMBeanServerInterceptor.java:415)
	at com.sun.jmx.mbeanserver.JmxMBeanServer.unregisterMBean(JmxMBeanServer.java:546)
	at org.apache.hadoop.metrics2.util.MBeans.unregister(MBeans.java:71)
	at org.apache.hadoop.hdfs.server.datanode.DataNode.unRegisterMXBean(DataNode.java:586)
	at org.apache.hadoop.hdfs.server.datanode.DataNode.shutdown(DataNode.java:855)
	at org.apache.hadoop.hdfs.server.datanode.DataNode.run(DataNode.java:1601)
	at java.lang.Thread.run(Thread.java:724)
WARN  MBeans - Hadoop:service=DataNode,name=FSDatasetState-UndefinedStorageId1206421975
javax.management.InstanceNotFoundException: Hadoop:service=DataNode,name=FSDatasetState-UndefinedStorageId1206421975
	at com.sun.jmx.interceptor.DefaultMBeanServerInterceptor.getMBean(DefaultMBeanServerInterceptor.java:1095)
	at com.sun.jmx.interceptor.DefaultMBeanServerInterceptor.exclusiveUnregisterMBean(DefaultMBeanServerInterceptor.java:427)
	at com.sun.jmx.interceptor.DefaultMBeanServerInterceptor.unregisterMBean(DefaultMBeanServerInterceptor.java:415)
	at com.sun.jmx.mbeanserver.JmxMBeanServer.unregisterMBean(JmxMBeanServer.java:546)
	at org.apache.hadoop.metrics2.util.MBeans.unregister(MBeans.java:71)
	at org.apache.hadoop.hdfs.server.datanode.FSDataset.shutdown(FSDataset.java:2093)
	at org.apache.hadoop.hdfs.server.datanode.DataNode.shutdown(DataNode.java:917)
	at org.apache.hadoop.hdfs.MiniDFSCluster.shutdownDataNodes(MiniDFSCluster.java:568)
	at org.apache.hadoop.hdfs.MiniDFSCluster.shutdown(MiniDFSCluster.java:552)
	at org.apache.blur.MiniCluster.shutdownDfs(MiniCluster.java:452)
	at org.apache.blur.MiniCluster.shutdownBlurCluster(MiniCluster.java:177)
	at sun.reflect.NativeMethodAccessorImpl.invoke0(Native Method)
	at sun.reflect.NativeMethodAccessorImpl.invoke(NativeMethodAccessorImpl.java:57)
	at sun.reflect.DelegatingMethodAccessorImpl.invoke(DelegatingMethodAccessorImpl.java:43)
	at java.lang.reflect.Method.invoke(Method.java:606)
	at org.apache.blur.console.util.Config.shutdownMiniCluster(Config.java:137)
	at org.apache.blur.console.ConsoleTestBase.shutdown(ConsoleTestBase.java:62)
	at sun.reflect.NativeMethodAccessorImpl.invoke0(Native Method)
	at sun.reflect.NativeMethodAccessorImpl.invoke(NativeMethodAccessorImpl.java:57)
	at sun.reflect.DelegatingMethodAccessorImpl.invoke(DelegatingMethodAccessorImpl.java:43)
	at java.lang.reflect.Method.invoke(Method.java:606)
	at org.junit.runners.model.FrameworkMethod$1.runReflectiveCall(FrameworkMethod.java:44)
	at org.junit.internal.runners.model.ReflectiveCallable.run(ReflectiveCallable.java:15)
	at org.junit.runners.model.FrameworkMethod.invokeExplosively(FrameworkMethod.java:41)
	at org.junit.internal.runners.statements.RunAfters.evaluate(RunAfters.java:37)
	at org.junit.runners.ParentRunner.run(ParentRunner.java:292)
	at org.apache.maven.surefire.junit4.JUnit4Provider.execute(JUnit4Provider.java:252)
	at org.apache.maven.surefire.junit4.JUnit4Provider.executeTestSet(JUnit4Provider.java:141)
	at org.apache.maven.surefire.junit4.JUnit4Provider.invoke(JUnit4Provider.java:112)
	at sun.reflect.NativeMethodAccessorImpl.invoke0(Native Method)
	at sun.reflect.NativeMethodAccessorImpl.invoke(NativeMethodAccessorImpl.java:57)
	at sun.reflect.DelegatingMethodAccessorImpl.invoke(DelegatingMethodAccessorImpl.java:43)
	at java.lang.reflect.Method.invoke(Method.java:606)
	at org.apache.maven.surefire.util.ReflectionUtils.invokeMethodWithArray(ReflectionUtils.java:189)
	at org.apache.maven.surefire.booter.ProviderFactory$ProviderProxy.invoke(ProviderFactory.java:165)
	at org.apache.maven.surefire.booter.ProviderFactory.invokeProvider(ProviderFactory.java:85)
	at org.apache.maven.surefire.booter.ForkedBooter.runSuitesInProcess(ForkedBooter.java:115)
	at org.apache.maven.surefire.booter.ForkedBooter.main(ForkedBooter.java:75)
WARN  FSDatasetAsyncDiskService - AsyncDiskService has already shut down.
WARN  FSNamesystem - ReplicationMonitor thread received InterruptedExceptionjava.lang.InterruptedException:
sleep interrupted
Tests run: 2, Failures: 0, Errors: 0, Skipped: 0, Time elapsed: 16.699 sec

Results :

Tests run: 9, Failures: 0, Errors: 0, Skipped: 0

[JENKINS] Recording test results
[INFO] 
[INFO] --- maven-jar-plugin:2.4:jar (default-jar) @ blur-console ---
[INFO] Building jar: <https://builds.apache.org/job/Blur-master-jdk7/ws/blur-console/target/blur-console-0.2.4-incubating-SNAPSHOT-hadoop1.jar>
[INFO] 
[INFO] --- maven-site-plugin:3.2:attach-descriptor (attach-descriptor) @ blur-console ---
[INFO] 
[INFO] --- apache-rat-plugin:0.10:check (default) @ blur-console ---
[INFO] 51 implicit excludes (use -debug for more details).
[INFO] Exclude: LICENSE
[INFO] Exclude: CHANGES.txt
[INFO] Exclude: DISCLAIMER
[INFO] Exclude: NOTICE
[INFO] Exclude: README
[INFO] Exclude: **/README.textile
[INFO] Exclude: **/README.md
[INFO] Exclude: **/.classpath
[INFO] Exclude: **/.project
[INFO] Exclude: **/.settings/**
[INFO] Exclude: **/.idea/**
[INFO] Exclude: **/*.iml
[INFO] Exclude: **/target/**
[INFO] Exclude: **/build/**
[INFO] Exclude: **/.codio
[INFO] Exclude: **/src/main/webapp/libs/**
[INFO] Exclude: **/node_modules/**
[INFO] Exclude: **/src/main/webapp/public/css/**
[INFO] Exclude: **/src/main/webapp/js/utils/*
[INFO] Exclude: **/src/main/webapp/public/js/modernizr.js
[INFO] Exclude: **/src/main/webapp/node_modules/**
[INFO] Exclude: **/src/main/webapp/.sass-cache/**
[INFO] Exclude: **/src/main/webapp/.tmp/**
[INFO] Exclude: **/.editorconfig
[INFO] Exclude: **/.jshintrc
[INFO] Exclude: **/package.json
[INFO] Exclude: **/src/main/scripts/grunt.sh
[INFO] Exclude: **/src/main/webapp/coverage/**
[INFO] Exclude: contrib/blur-console-v1/**
[INFO] Exclude: **/src/main/resources/org/apache/blur/thrift/util/words.txt
[INFO] Exclude: **/src/main/webapp/js/d3.v2.js
[INFO] Exclude: **/src/main/webapp/js/d3.v2.min.js
[INFO] Exclude: **/src/main/resources*/license-notes.txt
[INFO] Exclude: **/src/main/resources*/NOTICE-bin.base.txt
[INFO] Exclude: **/src/main/resources*/NOTICE-bin.txt
[INFO] Exclude: **/src/main/resources*/notices/*.src
[INFO] Exclude: **/src/main/scripts/conf/controllers
[INFO] Exclude: **/src/main/scripts/conf/consoles
[INFO] Exclude: **/src/main/scripts/conf/default_zoo.cfg
[INFO] Exclude: **/src/main/scripts/conf/shards
[INFO] Exclude: **/src/main/scripts/conf/zookeepers
[INFO] Exclude: **/src/main/scripts/interface/gen-html/Blur.html
[INFO] Exclude: **/src/main/scripts/interface/gen-html/index.html
[INFO] Exclude: **/.empty
[INFO] 87 resources included (use -debug for more details)
[INFO] Rat check: Summary of files. Unapproved: 1 unknown: 1 generated: 0 approved: 84 licence.
[INFO] ------------------------------------------------------------------------
[INFO] Reactor Summary:
[INFO] 
[INFO] Blur .............................................. SUCCESS [6.659s]
[INFO] Blur Util ......................................... SUCCESS [27.987s]
[INFO] Blur Thrift ....................................... SUCCESS [9.051s]
[INFO] Blur Store ........................................ SUCCESS [1:08.009s]
[INFO] Blur Query ........................................ SUCCESS [4:57.868s]
[INFO] Blur GUI .......................................... SUCCESS [6.934s]
[INFO] Blur Core ......................................... SUCCESS [6:11.826s]
[INFO] Blur Command ...................................... SUCCESS [9.140s]
[INFO] Blur Console ...................................... FAILURE [1:19.513s]
[INFO] Blur Map Reduce Hadoop1 ........................... SKIPPED
[INFO] Blur Shell ........................................ SKIPPED
[INFO] Distribution ...................................... SKIPPED
[INFO] ------------------------------------------------------------------------
[INFO] BUILD FAILURE
[INFO] ------------------------------------------------------------------------
[INFO] Total time: 14:52.392s
[INFO] Finished at: Sun Nov 30 17:07:13 UTC 2014
[INFO] Final Memory: 56M/522M
[INFO] ------------------------------------------------------------------------
Waiting for Jenkins to finish collecting data
[ERROR] Failed to execute goal org.apache.rat:apache-rat-plugin:0.10:check (default) on project
blur-console: Too many files with unapproved license: 1 See RAT report in: <https://builds.apache.org/job/Blur-master-jdk7/ws/blur-console/target/rat.txt>
-> [Help 1]
[ERROR] 
[ERROR] To see the full stack trace of the errors, re-run Maven with the -e switch.
[ERROR] Re-run Maven using the -X switch to enable full debug logging.
[ERROR] 
[ERROR] For more information about the errors and possible solutions, please read the following
articles:
[ERROR] [Help 1] http://cwiki.apache.org/confluence/display/MAVEN/MojoFailureException
[ERROR] 
[ERROR] After correcting the problems, you can resume the build with the command
[ERROR]   mvn <goals> -rf :blur-console
[JENKINS] Archiving <https://builds.apache.org/job/Blur-master-jdk7/ws/blur-shell/pom.xml>
to org.apache.blur/blur-shell/0.2.4-incubating-SNAPSHOT-hadoop1/blur-shell-0.2.4-incubating-SNAPSHOT-hadoop1.pom
Sending artifact delta relative to Blur-master-jdk7 » Blur Shell #1142
Archived 1 artifacts
Archive block size is 32768
Received 0 blocks and 4686 bytes
Compression is 0.0%
Took 99 ms
[JENKINS] Archiving <https://builds.apache.org/job/Blur-master-jdk7/ws/blur-mapred-hadoop1/pom.xml>
to org.apache.blur/blur-mapred-hadoop1/0.2.4-incubating-SNAPSHOT-hadoop1/blur-mapred-hadoop1-0.2.4-incubating-SNAPSHOT-hadoop1.pom
Sending artifact delta relative to Blur-master-jdk7 » Blur Map Reduce Hadoop1 #1142
Archived 1 artifacts
Archive block size is 32768
Received 0 blocks and 6094 bytes
Compression is 0.0%
Took 0.1 sec
[JENKINS] Archiving <https://builds.apache.org/job/Blur-master-jdk7/ws/pom.xml> to org.apache.blur/blur/0.2.4-incubating-SNAPSHOT/blur-0.2.4-incubating-SNAPSHOT.pom
Sending artifact delta relative to Blur-master-jdk7 » Blur #1142
Archived 1 artifacts
Archive block size is 32768
Received 0 blocks and 18041 bytes
Compression is 0.0%
Took 0.12 sec
[JENKINS] Archiving <https://builds.apache.org/job/Blur-master-jdk7/ws/blur-util/pom.xml>
to org.apache.blur/blur-util/0.2.4-incubating-SNAPSHOT-hadoop1/blur-util-0.2.4-incubating-SNAPSHOT-hadoop1.pom
[JENKINS] Archiving <https://builds.apache.org/job/Blur-master-jdk7/ws/blur-util/target/blur-util-0.2.4-incubating-SNAPSHOT-hadoop1.jar>
to org.apache.blur/blur-util/0.2.4-incubating-SNAPSHOT-hadoop1/blur-util-0.2.4-incubating-SNAPSHOT-hadoop1.jar
[JENKINS] Archiving <https://builds.apache.org/job/Blur-master-jdk7/ws/blur-util/target/blur-util-0.2.4-incubating-SNAPSHOT-hadoop1-tests.jar>
to org.apache.blur/blur-util/0.2.4-incubating-SNAPSHOT-hadoop1/blur-util-0.2.4-incubating-SNAPSHOT-hadoop1-tests.jar
Sending artifact delta relative to Blur-master-jdk7 » Blur Util #1142
Archived 3 artifacts
Archive block size is 32768
Received 0 blocks and 167281 bytes
Compression is 0.0%
Took 0.51 sec
[JENKINS] Archiving <https://builds.apache.org/job/Blur-master-jdk7/ws/distribution/pom.xml>
to org.apache.blur/apache-blur/0.2.4-incubating-SNAPSHOT-hadoop1/apache-blur-0.2.4-incubating-SNAPSHOT-hadoop1.pom
Sending artifact delta relative to Blur-master-jdk7 » Distribution #1142
Archived 1 artifacts
Archive block size is 32768
Received 0 blocks and 4548 bytes
Compression is 0.0%
Took 2.3 sec
[JENKINS] Archiving <https://builds.apache.org/job/Blur-master-jdk7/ws/blur-thrift/pom.xml>
to org.apache.blur/blur-thrift/0.2.4-incubating-SNAPSHOT-hadoop1/blur-thrift-0.2.4-incubating-SNAPSHOT-hadoop1.pom
[JENKINS] Archiving <https://builds.apache.org/job/Blur-master-jdk7/ws/blur-thrift/target/blur-thrift-0.2.4-incubating-SNAPSHOT-hadoop1.jar>
to org.apache.blur/blur-thrift/0.2.4-incubating-SNAPSHOT-hadoop1/blur-thrift-0.2.4-incubating-SNAPSHOT-hadoop1.jar
[JENKINS] Archiving <https://builds.apache.org/job/Blur-master-jdk7/ws/blur-thrift/target/blur-thrift-0.2.4-incubating-SNAPSHOT-hadoop1-tests.jar>
to org.apache.blur/blur-thrift/0.2.4-incubating-SNAPSHOT-hadoop1/blur-thrift-0.2.4-incubating-SNAPSHOT-hadoop1-tests.jar
Sending artifact delta relative to Blur-master-jdk7 » Blur Thrift #1142
Archived 3 artifacts
Archive block size is 32768
Received 0 blocks and 2151123 bytes
Compression is 0.0%
Took 2 sec
[JENKINS] Archiving <https://builds.apache.org/job/Blur-master-jdk7/ws/blur-query/pom.xml>
to org.apache.blur/blur-query/0.2.4-incubating-SNAPSHOT-hadoop1/blur-query-0.2.4-incubating-SNAPSHOT-hadoop1.pom
[JENKINS] Archiving <https://builds.apache.org/job/Blur-master-jdk7/ws/blur-query/target/blur-query-0.2.4-incubating-SNAPSHOT-hadoop1.jar>
to org.apache.blur/blur-query/0.2.4-incubating-SNAPSHOT-hadoop1/blur-query-0.2.4-incubating-SNAPSHOT-hadoop1.jar
[JENKINS] Archiving <https://builds.apache.org/job/Blur-master-jdk7/ws/blur-query/target/blur-query-0.2.4-incubating-SNAPSHOT-hadoop1-tests.jar>
to org.apache.blur/blur-query/0.2.4-incubating-SNAPSHOT-hadoop1/blur-query-0.2.4-incubating-SNAPSHOT-hadoop1-tests.jar
Sending artifact delta relative to Blur-master-jdk7 » Blur Query #1142
Archived 3 artifacts
Archive block size is 32768
Received 0 blocks and 239877 bytes
Compression is 0.0%
Took 0.26 sec
[JENKINS] Archiving <https://builds.apache.org/job/Blur-master-jdk7/ws/blur-command/pom.xml>
to org.apache.blur/blur-command/0.2.4-incubating-SNAPSHOT-hadoop1/blur-command-0.2.4-incubating-SNAPSHOT-hadoop1.pom
[JENKINS] Archiving <https://builds.apache.org/job/Blur-master-jdk7/ws/blur-command/target/blur-command-0.2.4-incubating-SNAPSHOT-hadoop1.jar>
to org.apache.blur/blur-command/0.2.4-incubating-SNAPSHOT-hadoop1/blur-command-0.2.4-incubating-SNAPSHOT-hadoop1.jar
[JENKINS] Archiving <https://builds.apache.org/job/Blur-master-jdk7/ws/blur-command/target/blur-command-0.2.4-incubating-SNAPSHOT-hadoop1-tests.jar>
to org.apache.blur/blur-command/0.2.4-incubating-SNAPSHOT-hadoop1/blur-command-0.2.4-incubating-SNAPSHOT-hadoop1-tests.jar
Sending artifact delta relative to Blur-master-jdk7 » Blur Command #1142
Archived 3 artifacts
Archive block size is 32768
Received 0 blocks and 66110 bytes
Compression is 0.0%
Took 0.1 sec
[JENKINS] Archiving <https://builds.apache.org/job/Blur-master-jdk7/ws/blur-store/pom.xml>
to org.apache.blur/blur-store/0.2.4-incubating-SNAPSHOT-hadoop1/blur-store-0.2.4-incubating-SNAPSHOT-hadoop1.pom
[JENKINS] Archiving <https://builds.apache.org/job/Blur-master-jdk7/ws/blur-store/target/blur-store-0.2.4-incubating-SNAPSHOT-hadoop1.jar>
to org.apache.blur/blur-store/0.2.4-incubating-SNAPSHOT-hadoop1/blur-store-0.2.4-incubating-SNAPSHOT-hadoop1.jar
[JENKINS] Archiving <https://builds.apache.org/job/Blur-master-jdk7/ws/blur-store/target/blur-store-0.2.4-incubating-SNAPSHOT-hadoop1-tests.jar>
to org.apache.blur/blur-store/0.2.4-incubating-SNAPSHOT-hadoop1/blur-store-0.2.4-incubating-SNAPSHOT-hadoop1-tests.jar
Sending artifact delta relative to Blur-master-jdk7 » Blur Store #1142
Archived 3 artifacts
Archive block size is 32768
Received 0 blocks and 294407 bytes
Compression is 0.0%
Took 0.16 sec
[JENKINS] Archiving <https://builds.apache.org/job/Blur-master-jdk7/ws/blur-core/pom.xml>
to org.apache.blur/blur-core/0.2.4-incubating-SNAPSHOT-hadoop1/blur-core-0.2.4-incubating-SNAPSHOT-hadoop1.pom
[JENKINS] Archiving <https://builds.apache.org/job/Blur-master-jdk7/ws/blur-core/target/blur-core-0.2.4-incubating-SNAPSHOT-hadoop1.jar>
to org.apache.blur/blur-core/0.2.4-incubating-SNAPSHOT-hadoop1/blur-core-0.2.4-incubating-SNAPSHOT-hadoop1.jar
[JENKINS] Archiving <https://builds.apache.org/job/Blur-master-jdk7/ws/blur-core/target/blur-core-0.2.4-incubating-SNAPSHOT-hadoop1-tests.jar>
to org.apache.blur/blur-core/0.2.4-incubating-SNAPSHOT-hadoop1/blur-core-0.2.4-incubating-SNAPSHOT-hadoop1-tests.jar
Sending artifact delta relative to Blur-master-jdk7 » Blur Core #1142
Archived 3 artifacts
Archive block size is 32768
Received 0 blocks and 759649 bytes
Compression is 0.0%
Took 0.3 sec
[JENKINS] Archiving <https://builds.apache.org/job/Blur-master-jdk7/ws/blur-gui/pom.xml>
to org.apache.blur/blur-gui/0.2.4-incubating-SNAPSHOT-hadoop1/blur-gui-0.2.4-incubating-SNAPSHOT-hadoop1.pom
[JENKINS] Archiving <https://builds.apache.org/job/Blur-master-jdk7/ws/blur-gui/target/blur-gui-0.2.4-incubating-SNAPSHOT-hadoop1.war>
to org.apache.blur/blur-gui/0.2.4-incubating-SNAPSHOT-hadoop1/blur-gui-0.2.4-incubating-SNAPSHOT-hadoop1.war
Sending artifact delta relative to Blur-master-jdk7 » Blur GUI #1142
Archived 2 artifacts
Archive block size is 32768
Received 888 blocks and 5172107 bytes
Compression is 84.9%
Took 4.9 sec
[JENKINS] Archiving <https://builds.apache.org/job/Blur-master-jdk7/ws/blur-console/pom.xml>
to org.apache.blur/blur-console/0.2.4-incubating-SNAPSHOT-hadoop1/blur-console-0.2.4-incubating-SNAPSHOT-hadoop1.pom
[JENKINS] Archiving <https://builds.apache.org/job/Blur-master-jdk7/ws/blur-console/target/blur-console-0.2.4-incubating-SNAPSHOT-hadoop1.jar>
to org.apache.blur/blur-console/0.2.4-incubating-SNAPSHOT-hadoop1/blur-console-0.2.4-incubating-SNAPSHOT-hadoop1.jar
Sending artifact delta relative to Blur-master-jdk7 » Blur Console #1142
Archived 2 artifacts
Archive block size is 32768
Received 0 blocks and 84774 bytes
Compression is 0.0%
Took 0.18 sec
Sending e-mails to: blur-dev@incubator.apache.org
channel stopped

Mime
View raw message