incubator-blur-dev mailing list archives

Site index · List index
Message view « Date » · « Thread »
Top « Date » · « Thread »
From Apache Jenkins Server <jenk...@builds.apache.org>
Subject Build failed in Jenkins: Blur-master-jdk7 #834
Date Wed, 01 Oct 2014 23:33:39 GMT
See <https://builds.apache.org/job/Blur-master-jdk7/834/>

------------------------------------------
[...truncated 16001 lines...]
  location: class Command<R>
  where R is a type-variable:
    R extends Object declared in class Command
<https://builds.apache.org/job/Blur-master-jdk7/ws/blur-core/src/main/java/org/apache/blur/command/Command.java>:[67,13]
error: cannot find symbol
[ERROR]   symbol:   class Argument
  location: class Command<R>
  where R is a type-variable:
    R extends Object declared in class Command
<https://builds.apache.org/job/Blur-master-jdk7/ws/blur-core/src/main/java/org/apache/blur/command/Command.java>:[75,49]
error: cannot find symbol
[ERROR]   symbol:   class Argument
  location: class Command<R>
  where R is a type-variable:
    R extends Object declared in class Command
<https://builds.apache.org/job/Blur-master-jdk7/ws/blur-core/src/main/java/org/apache/blur/command/BaseCommandManager.java>:[107,13]
error: cannot find symbol
[ERROR]   symbol:   class Argument
  location: class BaseCommandManager
<https://builds.apache.org/job/Blur-master-jdk7/ws/blur-core/src/main/java/org/apache/blur/command/BaseCommandManager.java>:[112,13]
error: cannot find symbol
[ERROR]   symbol:   class Argument
  location: class BaseCommandManager
<https://builds.apache.org/job/Blur-master-jdk7/ws/blur-core/src/main/java/org/apache/blur/thrift/ThriftBlurShardServer.java>:[110,15]
VM is internal proprietary API and may be removed in a future release
[ERROR] <https://builds.apache.org/job/Blur-master-jdk7/ws/blur-core/src/main/java/org/apache/blur/thrift/TableAdmin.java>:[37,30]
error: cannot find symbol
[ERROR]   symbol:   class Argument
  location: package org.apache.blur.command
<https://builds.apache.org/job/Blur-master-jdk7/ws/blur-core/src/main/java/org/apache/blur/thrift/TableAdmin.java>:[643,55]
error: cannot find symbol
[ERROR]   symbol:   class Argument
  location: class TableAdmin
<https://builds.apache.org/job/Blur-master-jdk7/ws/blur-core/src/main/java/org/apache/blur/command/Command.java>:[62,8]
error: cannot find symbol
[ERROR]   symbol:   class Argument
  location: class Command<R>
  where R is a type-variable:
    R extends Object declared in class Command
<https://builds.apache.org/job/Blur-master-jdk7/ws/blur-core/src/main/java/org/apache/blur/command/Command.java>:[62,42]
error: cannot find symbol
[ERROR]   symbol:   class Argument
  location: class Command<R>
  where R is a type-variable:
    R extends Object declared in class Command
<https://builds.apache.org/job/Blur-master-jdk7/ws/blur-core/src/main/java/org/apache/blur/command/Command.java>:[68,8]
error: cannot find symbol
[ERROR]   symbol:   class Argument
  location: class Command<R>
  where R is a type-variable:
    R extends Object declared in class Command
<https://builds.apache.org/job/Blur-master-jdk7/ws/blur-core/src/main/java/org/apache/blur/command/Command.java>:[68,42]
error: cannot find symbol
[ERROR]   symbol:   class Argument
  location: class Command<R>
  where R is a type-variable:
    R extends Object declared in class Command
<https://builds.apache.org/job/Blur-master-jdk7/ws/blur-core/src/main/java/org/apache/blur/command/Command.java>:[96,26]
error: cannot find symbol
[ERROR]   symbol:   class Argument
  location: class Command<R>
  where R is a type-variable:
    R extends Object declared in class Command
<https://builds.apache.org/job/Blur-master-jdk7/ws/blur-core/src/main/java/org/apache/blur/command/Command.java>:[100,26]
error: cannot find symbol
[ERROR]   symbol:   class Argument
  location: class Command<R>
  where R is a type-variable:
    R extends Object declared in class Command
<https://builds.apache.org/job/Blur-master-jdk7/ws/blur-core/src/main/java/org/apache/blur/thrift/ThriftBlurShardServer.java>:[170,87]
VM is internal proprietary API and may be removed in a future release
[ERROR] <https://builds.apache.org/job/Blur-master-jdk7/ws/blur-core/src/main/java/org/apache/blur/thrift/TableAdmin.java>:[645,9]
error: cannot find symbol
[INFO] 16 errors 
[INFO] -------------------------------------------------------------
[INFO] ------------------------------------------------------------------------
[INFO] Reactor Summary:
[INFO] 
[INFO] Blur .............................................. SUCCESS [1:41.666s]
[INFO] Blur Util ......................................... SUCCESS [38.777s]
[INFO] Blur Thrift ....................................... SUCCESS [18.010s]
[INFO] Blur Store ........................................ SUCCESS [6:48.465s]
[INFO] Blur Query ........................................ SUCCESS [7:33.123s]
[INFO] Blur GUI .......................................... SUCCESS [9.348s]
[INFO] Blur Core ......................................... FAILURE [8.615s]
[INFO] Blur Console ...................................... SKIPPED
[INFO] Blur Map Reduce Hadoop1 ........................... SKIPPED
[INFO] Blur Shell ........................................ SKIPPED
[INFO] Blur Command ...................................... SKIPPED
[INFO] Distribution ...................................... SKIPPED
[INFO] ------------------------------------------------------------------------
[INFO] BUILD FAILURE
[INFO] ------------------------------------------------------------------------
[INFO] Total time: 17:56.538s
[INFO] Finished at: Wed Oct 01 23:32:19 UTC 2014
[INFO] Final Memory: 38M/207M
[INFO] ------------------------------------------------------------------------
Waiting for Jenkins to finish collecting data
[ERROR] Failed to execute goal org.apache.maven.plugins:maven-compiler-plugin:2.5.1:compile
(default-compile) on project blur-core: Compilation failure: Compilation failure:
[ERROR] <https://builds.apache.org/job/Blur-master-jdk7/ws/blur-core/src/main/java/org/apache/blur/command/Command.java>:[61,13]
error: cannot find symbol
[ERROR] symbol:   class Argument
[ERROR] location: class Command<R>
[ERROR] where R is a type-variable:
[ERROR] R extends Object declared in class Command
[ERROR] <https://builds.apache.org/job/Blur-master-jdk7/ws/blur-core/src/main/java/org/apache/blur/command/Command.java>:[67,13]
error: cannot find symbol
[ERROR] symbol:   class Argument
[ERROR] location: class Command<R>
[ERROR] where R is a type-variable:
[ERROR] R extends Object declared in class Command
[ERROR] <https://builds.apache.org/job/Blur-master-jdk7/ws/blur-core/src/main/java/org/apache/blur/command/Command.java>:[75,49]
error: cannot find symbol
[ERROR] symbol:   class Argument
[ERROR] location: class Command<R>
[ERROR] where R is a type-variable:
[ERROR] R extends Object declared in class Command
[ERROR] <https://builds.apache.org/job/Blur-master-jdk7/ws/blur-core/src/main/java/org/apache/blur/command/BaseCommandManager.java>:[107,13]
error: cannot find symbol
[ERROR] symbol:   class Argument
[ERROR] location: class BaseCommandManager
[ERROR] <https://builds.apache.org/job/Blur-master-jdk7/ws/blur-core/src/main/java/org/apache/blur/command/BaseCommandManager.java>:[112,13]
error: cannot find symbol
[ERROR] symbol:   class Argument
[ERROR] location: class BaseCommandManager
[ERROR] <https://builds.apache.org/job/Blur-master-jdk7/ws/blur-core/src/main/java/org/apache/blur/thrift/ThriftBlurShardServer.java>:[110,15]
VM is internal proprietary API and may be removed in a future release
[ERROR] <https://builds.apache.org/job/Blur-master-jdk7/ws/blur-core/src/main/java/org/apache/blur/thrift/TableAdmin.java>:[37,30]
error: cannot find symbol
[ERROR] symbol:   class Argument
[ERROR] location: package org.apache.blur.command
[ERROR] <https://builds.apache.org/job/Blur-master-jdk7/ws/blur-core/src/main/java/org/apache/blur/thrift/TableAdmin.java>:[643,55]
error: cannot find symbol
[ERROR] symbol:   class Argument
[ERROR] location: class TableAdmin
[ERROR] <https://builds.apache.org/job/Blur-master-jdk7/ws/blur-core/src/main/java/org/apache/blur/command/Command.java>:[62,8]
error: cannot find symbol
[ERROR] symbol:   class Argument
[ERROR] location: class Command<R>
[ERROR] where R is a type-variable:
[ERROR] R extends Object declared in class Command
[ERROR] <https://builds.apache.org/job/Blur-master-jdk7/ws/blur-core/src/main/java/org/apache/blur/command/Command.java>:[62,42]
error: cannot find symbol
[ERROR] symbol:   class Argument
[ERROR] location: class Command<R>
[ERROR] where R is a type-variable:
[ERROR] R extends Object declared in class Command
[ERROR] <https://builds.apache.org/job/Blur-master-jdk7/ws/blur-core/src/main/java/org/apache/blur/command/Command.java>:[68,8]
error: cannot find symbol
[ERROR] symbol:   class Argument
[ERROR] location: class Command<R>
[ERROR] where R is a type-variable:
[ERROR] R extends Object declared in class Command
[ERROR] <https://builds.apache.org/job/Blur-master-jdk7/ws/blur-core/src/main/java/org/apache/blur/command/Command.java>:[68,42]
error: cannot find symbol
[ERROR] symbol:   class Argument
[ERROR] location: class Command<R>
[ERROR] where R is a type-variable:
[ERROR] R extends Object declared in class Command
[ERROR] <https://builds.apache.org/job/Blur-master-jdk7/ws/blur-core/src/main/java/org/apache/blur/command/Command.java>:[96,26]
error: cannot find symbol
[ERROR] symbol:   class Argument
[ERROR] location: class Command<R>
[ERROR] where R is a type-variable:
[ERROR] R extends Object declared in class Command
[ERROR] <https://builds.apache.org/job/Blur-master-jdk7/ws/blur-core/src/main/java/org/apache/blur/command/Command.java>:[100,26]
error: cannot find symbol
[ERROR] symbol:   class Argument
[ERROR] location: class Command<R>
[ERROR] where R is a type-variable:
[ERROR] R extends Object declared in class Command
[ERROR] <https://builds.apache.org/job/Blur-master-jdk7/ws/blur-core/src/main/java/org/apache/blur/thrift/ThriftBlurShardServer.java>:[170,87]
VM is internal proprietary API and may be removed in a future release
[ERROR] <https://builds.apache.org/job/Blur-master-jdk7/ws/blur-core/src/main/java/org/apache/blur/thrift/TableAdmin.java>:[645,9]
error: cannot find symbol
[ERROR] -> [Help 1]
[ERROR] 
[ERROR] To see the full stack trace of the errors, re-run Maven with the -e switch.
[ERROR] Re-run Maven using the -X switch to enable full debug logging.
[ERROR] 
[ERROR] For more information about the errors and possible solutions, please read the following
articles:
[ERROR] [Help 1] http://cwiki.apache.org/confluence/display/MAVEN/MojoFailureException
[ERROR] 
[ERROR] After correcting the problems, you can resume the build with the command
[ERROR]   mvn <goals> -rf :blur-core
[JENKINS] Archiving <https://builds.apache.org/job/Blur-master-jdk7/ws/blur-shell/pom.xml>
to org.apache.blur/blur-shell/0.2.4-incubating-SNAPSHOT-hadoop1/blur-shell-0.2.4-incubating-SNAPSHOT-hadoop1.pom
Sending artifact delta relative to Blur-master-jdk7 » Blur Shell #830
Archived 1 artifacts
Archive block size is 32768
Received 0 blocks and 6060 bytes
Compression is 0.0%
Took 0.29 sec
[JENKINS] Archiving <https://builds.apache.org/job/Blur-master-jdk7/ws/blur-mapred-hadoop1/pom.xml>
to org.apache.blur/blur-mapred-hadoop1/0.2.4-incubating-SNAPSHOT-hadoop1/blur-mapred-hadoop1-0.2.4-incubating-SNAPSHOT-hadoop1.pom
Sending artifact delta relative to Blur-master-jdk7 » Blur Map Reduce Hadoop1 #830
Archived 1 artifacts
Archive block size is 32768
Received 0 blocks and 6094 bytes
Compression is 0.0%
Took 0.36 sec
[JENKINS] Archiving <https://builds.apache.org/job/Blur-master-jdk7/ws/pom.xml> to org.apache.blur/blur/0.2.4-incubating-SNAPSHOT/blur-0.2.4-incubating-SNAPSHOT.pom
Sending artifact delta relative to Blur-master-jdk7 » Blur #833
Archived 1 artifacts
Archive block size is 32768
Received 0 blocks and 14366 bytes
Compression is 0.0%
Took 2.3 sec
[JENKINS] Archiving <https://builds.apache.org/job/Blur-master-jdk7/ws/blur-util/pom.xml>
to org.apache.blur/blur-util/0.2.4-incubating-SNAPSHOT-hadoop1/blur-util-0.2.4-incubating-SNAPSHOT-hadoop1.pom
[JENKINS] Archiving <https://builds.apache.org/job/Blur-master-jdk7/ws/blur-util/target/blur-util-0.2.4-incubating-SNAPSHOT-hadoop1.jar>
to org.apache.blur/blur-util/0.2.4-incubating-SNAPSHOT-hadoop1/blur-util-0.2.4-incubating-SNAPSHOT-hadoop1.jar
[JENKINS] Archiving <https://builds.apache.org/job/Blur-master-jdk7/ws/blur-util/target/blur-util-0.2.4-incubating-SNAPSHOT-hadoop1-tests.jar>
to org.apache.blur/blur-util/0.2.4-incubating-SNAPSHOT-hadoop1/blur-util-0.2.4-incubating-SNAPSHOT-hadoop1-tests.jar
Sending artifact delta relative to Blur-master-jdk7 » Blur Util #833
Archived 3 artifacts
Archive block size is 32768
Received 0 blocks and 169672 bytes
Compression is 0.0%
Took 2.3 sec
[JENKINS] Archiving <https://builds.apache.org/job/Blur-master-jdk7/ws/distribution/pom.xml>
to org.apache.blur/apache-blur/0.2.4-incubating-SNAPSHOT-hadoop1/apache-blur-0.2.4-incubating-SNAPSHOT-hadoop1.pom
Sending artifact delta relative to Blur-master-jdk7 » Distribution #830
Archived 1 artifacts
Archive block size is 32768
Received 0 blocks and 4509 bytes
Compression is 0.0%
Took 2.8 sec
[JENKINS] Archiving <https://builds.apache.org/job/Blur-master-jdk7/ws/blur-thrift/pom.xml>
to org.apache.blur/blur-thrift/0.2.4-incubating-SNAPSHOT-hadoop1/blur-thrift-0.2.4-incubating-SNAPSHOT-hadoop1.pom
[JENKINS] Archiving <https://builds.apache.org/job/Blur-master-jdk7/ws/blur-thrift/target/blur-thrift-0.2.4-incubating-SNAPSHOT-hadoop1.jar>
to org.apache.blur/blur-thrift/0.2.4-incubating-SNAPSHOT-hadoop1/blur-thrift-0.2.4-incubating-SNAPSHOT-hadoop1.jar
[JENKINS] Archiving <https://builds.apache.org/job/Blur-master-jdk7/ws/blur-thrift/target/blur-thrift-0.2.4-incubating-SNAPSHOT-hadoop1-tests.jar>
to org.apache.blur/blur-thrift/0.2.4-incubating-SNAPSHOT-hadoop1/blur-thrift-0.2.4-incubating-SNAPSHOT-hadoop1-tests.jar
Sending artifact delta relative to Blur-master-jdk7 » Blur Thrift #833
Archived 3 artifacts
Archive block size is 32768
Received 0 blocks and 2147907 bytes
Compression is 0.0%
Took 6.9 sec
[JENKINS] Archiving <https://builds.apache.org/job/Blur-master-jdk7/ws/blur-query/pom.xml>
to org.apache.blur/blur-query/0.2.4-incubating-SNAPSHOT-hadoop1/blur-query-0.2.4-incubating-SNAPSHOT-hadoop1.pom
[JENKINS] Archiving <https://builds.apache.org/job/Blur-master-jdk7/ws/blur-query/target/blur-query-0.2.4-incubating-SNAPSHOT-hadoop1.jar>
to org.apache.blur/blur-query/0.2.4-incubating-SNAPSHOT-hadoop1/blur-query-0.2.4-incubating-SNAPSHOT-hadoop1.jar
[JENKINS] Archiving <https://builds.apache.org/job/Blur-master-jdk7/ws/blur-query/target/blur-query-0.2.4-incubating-SNAPSHOT-hadoop1-tests.jar>
to org.apache.blur/blur-query/0.2.4-incubating-SNAPSHOT-hadoop1/blur-query-0.2.4-incubating-SNAPSHOT-hadoop1-tests.jar
Sending artifact delta relative to Blur-master-jdk7 » Blur Query #833
Archived 3 artifacts
Archive block size is 32768
Received 0 blocks and 241292 bytes
Compression is 0.0%
Took 0.46 sec
[JENKINS] Archiving <https://builds.apache.org/job/Blur-master-jdk7/ws/blur-command/pom.xml>
to org.apache.blur/blur-command/0.2.4-incubating-SNAPSHOT-hadoop1/blur-command-0.2.4-incubating-SNAPSHOT-hadoop1.pom
Sending artifact delta relative to Blur-master-jdk7 » Blur Command #830
Archived 1 artifacts
Archive block size is 32768
Received 0 blocks and 7478 bytes
Compression is 0.0%
Took 0.3 sec
[JENKINS] Archiving <https://builds.apache.org/job/Blur-master-jdk7/ws/blur-store/pom.xml>
to org.apache.blur/blur-store/0.2.4-incubating-SNAPSHOT-hadoop1/blur-store-0.2.4-incubating-SNAPSHOT-hadoop1.pom
[JENKINS] Archiving <https://builds.apache.org/job/Blur-master-jdk7/ws/blur-store/target/blur-store-0.2.4-incubating-SNAPSHOT-hadoop1.jar>
to org.apache.blur/blur-store/0.2.4-incubating-SNAPSHOT-hadoop1/blur-store-0.2.4-incubating-SNAPSHOT-hadoop1.jar
[JENKINS] Archiving <https://builds.apache.org/job/Blur-master-jdk7/ws/blur-store/target/blur-store-0.2.4-incubating-SNAPSHOT-hadoop1-tests.jar>
to org.apache.blur/blur-store/0.2.4-incubating-SNAPSHOT-hadoop1/blur-store-0.2.4-incubating-SNAPSHOT-hadoop1-tests.jar
Sending artifact delta relative to Blur-master-jdk7 » Blur Store #833
Archived 3 artifacts
Archive block size is 32768
Received 0 blocks and 316101 bytes
Compression is 0.0%
Took 0.6 sec
[JENKINS] Archiving <https://builds.apache.org/job/Blur-master-jdk7/ws/blur-core/pom.xml>
to org.apache.blur/blur-core/0.2.4-incubating-SNAPSHOT-hadoop1/blur-core-0.2.4-incubating-SNAPSHOT-hadoop1.pom
Sending artifact delta relative to Blur-master-jdk7 » Blur Core #830
Archived 1 artifacts
Archive block size is 32768
Received 0 blocks and 6673 bytes
Compression is 0.0%
Took 0.3 sec
[JENKINS] Archiving <https://builds.apache.org/job/Blur-master-jdk7/ws/blur-gui/pom.xml>
to org.apache.blur/blur-gui/0.2.4-incubating-SNAPSHOT-hadoop1/blur-gui-0.2.4-incubating-SNAPSHOT-hadoop1.pom
[JENKINS] Archiving <https://builds.apache.org/job/Blur-master-jdk7/ws/blur-gui/target/blur-gui-0.2.4-incubating-SNAPSHOT-hadoop1.war>
to org.apache.blur/blur-gui/0.2.4-incubating-SNAPSHOT-hadoop1/blur-gui-0.2.4-incubating-SNAPSHOT-hadoop1.war
Sending artifact delta relative to Blur-master-jdk7 » Blur GUI #833
Archived 2 artifacts
Archive block size is 32768
Received 777 blocks and 4581352 bytes
Compression is 84.8%
Took 6.5 sec
[JENKINS] Archiving <https://builds.apache.org/job/Blur-master-jdk7/ws/blur-console/pom.xml>
to org.apache.blur/blur-console/0.2.4-incubating-SNAPSHOT-hadoop1/blur-console-0.2.4-incubating-SNAPSHOT-hadoop1.pom
Sending artifact delta relative to Blur-master-jdk7 » Blur Console #830
Archived 1 artifacts
Archive block size is 32768
Received 0 blocks and 12877 bytes
Compression is 0.0%
Took 0.37 sec
Sending e-mails to: blur-dev@incubator.apache.org
channel stopped

Mime
View raw message