incubator-blur-dev mailing list archives

Site index · List index
Message view « Date » · « Thread »
Top « Date » · « Thread »
From Apache Jenkins Server <jenk...@builds.apache.org>
Subject Build failed in Jenkins: Blur-master-jdk7 #872
Date Wed, 08 Oct 2014 14:33:40 GMT
See <https://builds.apache.org/job/Blur-master-jdk7/872/changes>

Changes:

[amccurry] Starting to build hive output format, serde, and storagehandler.

[amccurry] More hive integration updates.

[amccurry] More update to the hive blur code.

[amccurry] Blur indexing via Hive now works.  Warning it may be fragile.

------------------------------------------
[...truncated 17 lines...]
[Blur-master-jdk7] $ /home/jenkins/tools/java/latest1.7/bin/java -cp /home/jenkins/jenkins-slave/maven3-agent.jar:/home/jenkins/tools/maven/apache-maven-3.0.4/boot/plexus-classworlds-2.4.jar
org.jvnet.hudson.maven3.agent.Maven3Main /home/jenkins/tools/maven/apache-maven-3.0.4 /home/jenkins/jenkins-slave/slave.jar
/home/jenkins/jenkins-slave/maven3-interceptor.jar /home/jenkins/jenkins-slave/maven3-interceptor-commons.jar
32770
<===[JENKINS REMOTING CAPACITY]===>   channel started
log4j:WARN No appenders could be found for logger (org.apache.commons.beanutils.converters.BooleanConverter).
log4j:WARN Please initialize the log4j system properly.
Executing Maven:  -B -f <https://builds.apache.org/job/Blur-master-jdk7/ws/pom.xml>
-Dmaven.repo.local=/home/jenkins/jenkins-slave/maven-repositories/3 clean install -Dhadoop1
[INFO] Scanning for projects...
[WARNING] 
[WARNING] Some problems were encountered while building the effective model for org.apache.blur:blur-console:jar:0.2.4-incubating-SNAPSHOT-hadoop1
[WARNING] 'version' contains an expression but should be a constant. @ org.apache.blur:blur-console:${projectVersion},
<https://builds.apache.org/job/Blur-master-jdk7/ws/blur-console/pom.xml,> line 26, column
12
[WARNING] 'reporting.plugins.plugin.version' for org.apache.maven.plugins:maven-javadoc-plugin
is missing. @ org.apache.blur:blur:0.2.4-incubating-SNAPSHOT, <https://builds.apache.org/job/Blur-master-jdk7/ws/pom.xml,>
line 371, column 12
[WARNING] 
[WARNING] Some problems were encountered while building the effective model for org.apache.blur:blur-core:jar:0.2.4-incubating-SNAPSHOT-hadoop1
[WARNING] 'version' contains an expression but should be a constant. @ org.apache.blur:blur-core:${projectVersion},
<https://builds.apache.org/job/Blur-master-jdk7/ws/blur-core/pom.xml,> line 31, column
11
[WARNING] 'reporting.plugins.plugin.version' for org.apache.maven.plugins:maven-javadoc-plugin
is missing. @ org.apache.blur:blur:0.2.4-incubating-SNAPSHOT, <https://builds.apache.org/job/Blur-master-jdk7/ws/pom.xml,>
line 371, column 12
[WARNING] 
[WARNING] Some problems were encountered while building the effective model for org.apache.blur:blur-thrift:jar:0.2.4-incubating-SNAPSHOT-hadoop1
[WARNING] 'version' contains an expression but should be a constant. @ org.apache.blur:blur-thrift:${projectVersion},
<https://builds.apache.org/job/Blur-master-jdk7/ws/blur-thrift/pom.xml,> line 31, column
11
[WARNING] 'reporting.plugins.plugin.version' for org.apache.maven.plugins:maven-javadoc-plugin
is missing. @ org.apache.blur:blur:0.2.4-incubating-SNAPSHOT, <https://builds.apache.org/job/Blur-master-jdk7/ws/pom.xml,>
line 371, column 12
[WARNING] 
[WARNING] Some problems were encountered while building the effective model for org.apache.blur:blur-query:jar:0.2.4-incubating-SNAPSHOT-hadoop1
[WARNING] 'version' contains an expression but should be a constant. @ org.apache.blur:blur-query:${projectVersion},
<https://builds.apache.org/job/Blur-master-jdk7/ws/blur-query/pom.xml,> line 31, column
11
[WARNING] 'reporting.plugins.plugin.version' for org.apache.maven.plugins:maven-javadoc-plugin
is missing. @ org.apache.blur:blur:0.2.4-incubating-SNAPSHOT, <https://builds.apache.org/job/Blur-master-jdk7/ws/pom.xml,>
line 371, column 12
[WARNING] 
[WARNING] Some problems were encountered while building the effective model for org.apache.blur:blur-store:jar:0.2.4-incubating-SNAPSHOT-hadoop1
[WARNING] 'version' contains an expression but should be a constant. @ org.apache.blur:blur-store:${projectVersion},
<https://builds.apache.org/job/Blur-master-jdk7/ws/blur-store/pom.xml,> line 31, column
11
[WARNING] 'reporting.plugins.plugin.version' for org.apache.maven.plugins:maven-javadoc-plugin
is missing. @ org.apache.blur:blur:0.2.4-incubating-SNAPSHOT, <https://builds.apache.org/job/Blur-master-jdk7/ws/pom.xml,>
line 371, column 12
[WARNING] 
[WARNING] Some problems were encountered while building the effective model for org.apache.blur:blur-mapred-hadoop1:jar:0.2.4-incubating-SNAPSHOT-hadoop1
[WARNING] 'version' contains an expression but should be a constant. @ org.apache.blur:blur-mapred-hadoop1:${projectVersion},
<https://builds.apache.org/job/Blur-master-jdk7/ws/blur-mapred-hadoop1/pom.xml,> line
31, column 11
[WARNING] 'reporting.plugins.plugin.version' for org.apache.maven.plugins:maven-javadoc-plugin
is missing. @ org.apache.blur:blur:0.2.4-incubating-SNAPSHOT, <https://builds.apache.org/job/Blur-master-jdk7/ws/pom.xml,>
line 371, column 12
[WARNING] 
[WARNING] Some problems were encountered while building the effective model for org.apache.blur:blur-util:jar:0.2.4-incubating-SNAPSHOT-hadoop1
[WARNING] 'version' contains an expression but should be a constant. @ org.apache.blur:blur-util:${projectVersion},
<https://builds.apache.org/job/Blur-master-jdk7/ws/blur-util/pom.xml,> line 31, column
11
[WARNING] 'reporting.plugins.plugin.version' for org.apache.maven.plugins:maven-javadoc-plugin
is missing. @ org.apache.blur:blur:0.2.4-incubating-SNAPSHOT, <https://builds.apache.org/job/Blur-master-jdk7/ws/pom.xml,>
line 371, column 12
[WARNING] 
[WARNING] Some problems were encountered while building the effective model for org.apache.blur:blur-gui:war:0.2.4-incubating-SNAPSHOT-hadoop1
[WARNING] 'version' contains an expression but should be a constant. @ org.apache.blur:blur-gui:${projectVersion},
<https://builds.apache.org/job/Blur-master-jdk7/ws/blur-gui/pom.xml,> line 31, column
11
[WARNING] 'reporting.plugins.plugin.version' for org.apache.maven.plugins:maven-javadoc-plugin
is missing. @ org.apache.blur:blur:0.2.4-incubating-SNAPSHOT, <https://builds.apache.org/job/Blur-master-jdk7/ws/pom.xml,>
line 371, column 12
[WARNING] 
[WARNING] Some problems were encountered while building the effective model for org.apache.blur:blur-shell:jar:0.2.4-incubating-SNAPSHOT-hadoop1
[WARNING] 'version' contains an expression but should be a constant. @ org.apache.blur:blur-shell:${projectVersion},
<https://builds.apache.org/job/Blur-master-jdk7/ws/blur-shell/pom.xml,> line 31, column
11
[WARNING] 'reporting.plugins.plugin.version' for org.apache.maven.plugins:maven-javadoc-plugin
is missing. @ org.apache.blur:blur:0.2.4-incubating-SNAPSHOT, <https://builds.apache.org/job/Blur-master-jdk7/ws/pom.xml,>
line 371, column 12
[WARNING] 
[WARNING] Some problems were encountered while building the effective model for org.apache.blur:blur-command:jar:0.2.4-incubating-SNAPSHOT-hadoop1
[WARNING] 'version' contains an expression but should be a constant. @ org.apache.blur:blur-command:${projectVersion},
<https://builds.apache.org/job/Blur-master-jdk7/ws/blur-command/pom.xml,> line 31, column
11
[WARNING] 'reporting.plugins.plugin.version' for org.apache.maven.plugins:maven-javadoc-plugin
is missing. @ org.apache.blur:blur:0.2.4-incubating-SNAPSHOT, <https://builds.apache.org/job/Blur-master-jdk7/ws/pom.xml,>
line 371, column 12
[WARNING] 
[WARNING] Some problems were encountered while building the effective model for org.apache.blur:apache-blur:pom:0.2.4-incubating-SNAPSHOT-hadoop1
[WARNING] 'version' contains an expression but should be a constant. @ org.apache.blur:apache-blur:${projectVersion},
<https://builds.apache.org/job/Blur-master-jdk7/ws/distribution/pom.xml,> line 31, column
11
[WARNING] 'reporting.plugins.plugin.version' for org.apache.maven.plugins:maven-javadoc-plugin
is missing. @ org.apache.blur:blur:0.2.4-incubating-SNAPSHOT, <https://builds.apache.org/job/Blur-master-jdk7/ws/pom.xml,>
line 371, column 12
[WARNING] 
[WARNING] Some problems were encountered while building the effective model for org.apache.blur:blur:pom:0.2.4-incubating-SNAPSHOT
[WARNING] 'reporting.plugins.plugin.version' for org.apache.maven.plugins:maven-javadoc-plugin
is missing. @ line 371, column 12
[WARNING] 
[WARNING] It is highly recommended to fix these problems because they threaten the stability
of your build.
[WARNING] 
[WARNING] For this reason, future Maven versions might no longer support building such malformed
projects.
[WARNING] 
[INFO] ------------------------------------------------------------------------
[INFO] Reactor Build Order:
[INFO] 
[INFO] Blur
[INFO] Blur Util
[INFO] Blur Thrift
[INFO] Blur Store
[INFO] Blur Query
[INFO] Blur GUI
[INFO] Blur Core
[INFO] Blur Console
[INFO] Blur Map Reduce Hadoop1
[INFO] Blur Shell
[INFO] Blur Command
[INFO] Distribution
[INFO]                                                                         
[INFO] ------------------------------------------------------------------------
[INFO] Building Blur 0.2.4-incubating-SNAPSHOT
[INFO] ------------------------------------------------------------------------
[INFO] 
[INFO] --- maven-clean-plugin:2.5:clean (default-clean) @ blur ---
[INFO] Deleting <https://builds.apache.org/job/Blur-master-jdk7/ws/target>
[INFO] 
[INFO] --- maven-remote-resources-plugin:1.4:process (default) @ blur ---
[INFO] 
[INFO] --- maven-site-plugin:3.2:attach-descriptor (attach-descriptor) @ blur ---
[INFO] 
[INFO] --- apache-rat-plugin:0.10:check (default) @ blur ---
[INFO] 62 implicit excludes (use -debug for more details).
[INFO] Exclude: LICENSE
[INFO] Exclude: CHANGES.txt
[INFO] Exclude: DISCLAIMER
[INFO] Exclude: NOTICE
[INFO] Exclude: README
[INFO] Exclude: **/README.textile
[INFO] Exclude: **/README.md
[INFO] Exclude: **/.classpath
[INFO] Exclude: **/.project
[INFO] Exclude: **/.settings/**
[INFO] Exclude: **/.idea/**
[INFO] Exclude: **/*.iml
[INFO] Exclude: **/target/**
[INFO] Exclude: **/build/**
[INFO] Exclude: **/.codio
[INFO] Exclude: **/src/main/webapp/libs/**
[INFO] Exclude: **/node_modules/**
[INFO] Exclude: **/src/main/webapp/public/css/**
[INFO] Exclude: **/src/main/webapp/js/utils/*
[INFO] Exclude: **/src/main/webapp/public/js/modernizr.js
[INFO] Exclude: **/src/main/webapp/node_modules/**
[INFO] Exclude: **/src/main/webapp/.sass-cache/**
[INFO] Exclude: **/src/main/webapp/.tmp/**
[INFO] Exclude: **/.editorconfig
[INFO] Exclude: **/.jshintrc
[INFO] Exclude: **/package.json
[INFO] Exclude: **/src/main/scripts/grunt.sh
[INFO] Exclude: **/src/main/webapp/coverage/**
[INFO] Exclude: contrib/blur-console-v1/**
[INFO] Exclude: **/src/main/resources/org/apache/blur/thrift/util/words.txt
[INFO] Exclude: **/src/main/webapp/js/d3.v2.js
[INFO] Exclude: **/src/main/webapp/js/d3.v2.min.js
[INFO] Exclude: **/src/main/resources*/license-notes.txt
[INFO] Exclude: **/src/main/resources*/NOTICE-bin.base.txt
[INFO] Exclude: **/src/main/resources*/NOTICE-bin.txt
[INFO] Exclude: **/src/main/resources*/notices/*.src
[INFO] Exclude: **/src/main/scripts/conf/controllers
[INFO] Exclude: **/src/main/scripts/conf/consoles
[INFO] Exclude: **/src/main/scripts/conf/default_zoo.cfg
[INFO] Exclude: **/src/main/scripts/conf/shards
[INFO] Exclude: **/src/main/scripts/conf/zookeepers
[INFO] Exclude: **/src/main/scripts/interface/gen-html/Blur.html
[INFO] Exclude: **/src/main/scripts/interface/gen-html/index.html
[INFO] Exclude: **/.empty
[INFO] 103 resources included (use -debug for more details)
[INFO] Rat check: Summary of files. Unapproved: 1 unknown: 1 generated: 0 approved: 98 licence.
[INFO] ------------------------------------------------------------------------
[INFO] Reactor Summary:
[INFO] 
[INFO] Blur .............................................. FAILURE [17.844s]
[INFO] Blur Util ......................................... SKIPPED
[INFO] Blur Thrift ....................................... SKIPPED
[INFO] Blur Store ........................................ SKIPPED
[INFO] Blur Query ........................................ SKIPPED
[INFO] Blur GUI .......................................... SKIPPED
[INFO] Blur Core ......................................... SKIPPED
[INFO] Blur Console ...................................... SKIPPED
[INFO] Blur Map Reduce Hadoop1 ........................... SKIPPED
[INFO] Blur Shell ........................................ SKIPPED
[INFO] Blur Command ...................................... SKIPPED
[INFO] Distribution ...................................... SKIPPED
[INFO] ------------------------------------------------------------------------
[INFO] BUILD FAILURE
[INFO] ------------------------------------------------------------------------
[INFO] Total time: 19.690s
[INFO] Finished at: Wed Oct 08 14:33:25 UTC 2014
[INFO] Final Memory: 16M/147M
[INFO] ------------------------------------------------------------------------
Waiting for Jenkins to finish collecting data[ERROR] Failed to execute goal org.apache.rat:apache-rat-plugin:0.10:check
(default) on project blur: Too many files with unapproved license: 1 See RAT report in: <https://builds.apache.org/job/Blur-master-jdk7/ws/target/rat.txt>
-> [Help 1]
[ERROR] 
[ERROR] To see the full stack trace of the errors, re-run Maven with the -e switch.
[ERROR] Re-run Maven using the -X switch to enable full debug logging.
[ERROR] 
[ERROR] For more information about the errors and possible solutions, please read the following
articles:
[ERROR] [Help 1] http://cwiki.apache.org/confluence/display/MAVEN/MojoFailureException

[JENKINS] Archiving <https://builds.apache.org/job/Blur-master-jdk7/ws/blur-shell/pom.xml>
to org.apache.blur/blur-shell/0.2.4-incubating-SNAPSHOT-hadoop1/blur-shell-0.2.4-incubating-SNAPSHOT-hadoop1.pom
Sending artifact delta relative to Blur-master-jdk7 » Blur Shell #871
Archived 1 artifacts
Archive block size is 32768
Received 0 blocks and 6060 bytes
Compression is 0.0%
Took 84 ms
[JENKINS] Archiving <https://builds.apache.org/job/Blur-master-jdk7/ws/blur-mapred-hadoop1/pom.xml>
to org.apache.blur/blur-mapred-hadoop1/0.2.4-incubating-SNAPSHOT-hadoop1/blur-mapred-hadoop1-0.2.4-incubating-SNAPSHOT-hadoop1.pom
Sending artifact delta relative to Blur-master-jdk7 » Blur Map Reduce Hadoop1 #871
Archived 1 artifacts
Archive block size is 32768
Received 0 blocks and 6094 bytes
Compression is 0.0%
Took 57 ms
[JENKINS] Archiving <https://builds.apache.org/job/Blur-master-jdk7/ws/pom.xml> to org.apache.blur/blur/0.2.4-incubating-SNAPSHOT/blur-0.2.4-incubating-SNAPSHOT.pom
Sending artifact delta relative to Blur-master-jdk7 » Blur #871
Archived 1 artifacts
Archive block size is 32768
Received 0 blocks and 14366 bytes
Compression is 0.0%
Took 1.7 sec
[JENKINS] Archiving <https://builds.apache.org/job/Blur-master-jdk7/ws/blur-util/pom.xml>
to org.apache.blur/blur-util/0.2.4-incubating-SNAPSHOT-hadoop1/blur-util-0.2.4-incubating-SNAPSHOT-hadoop1.pom
Sending artifact delta relative to Blur-master-jdk7 » Blur Util #871
Archived 1 artifacts
Archive block size is 32768
Received 0 blocks and 7125 bytes
Compression is 0.0%
Took 45 ms
[JENKINS] Archiving <https://builds.apache.org/job/Blur-master-jdk7/ws/distribution/pom.xml>
to org.apache.blur/apache-blur/0.2.4-incubating-SNAPSHOT-hadoop1/apache-blur-0.2.4-incubating-SNAPSHOT-hadoop1.pom
Sending artifact delta relative to Blur-master-jdk7 » Distribution #871
Archived 1 artifacts
Archive block size is 32768
Received 0 blocks and 4509 bytes
Compression is 0.0%
Took 2.9 sec
[JENKINS] Archiving <https://builds.apache.org/job/Blur-master-jdk7/ws/blur-thrift/pom.xml>
to org.apache.blur/blur-thrift/0.2.4-incubating-SNAPSHOT-hadoop1/blur-thrift-0.2.4-incubating-SNAPSHOT-hadoop1.pom
Sending artifact delta relative to Blur-master-jdk7 » Blur Thrift #871
Archived 1 artifacts
Archive block size is 32768
Received 0 blocks and 5416 bytes
Compression is 0.0%
Took 98 ms
[JENKINS] Archiving <https://builds.apache.org/job/Blur-master-jdk7/ws/blur-query/pom.xml>
to org.apache.blur/blur-query/0.2.4-incubating-SNAPSHOT-hadoop1/blur-query-0.2.4-incubating-SNAPSHOT-hadoop1.pom
Sending artifact delta relative to Blur-master-jdk7 » Blur Query #871
Archived 1 artifacts
Archive block size is 32768
Received 0 blocks and 5646 bytes
Compression is 0.0%
Took 45 ms
[JENKINS] Archiving <https://builds.apache.org/job/Blur-master-jdk7/ws/blur-command/pom.xml>
to org.apache.blur/blur-command/0.2.4-incubating-SNAPSHOT-hadoop1/blur-command-0.2.4-incubating-SNAPSHOT-hadoop1.pom
Sending artifact delta relative to Blur-master-jdk7 » Blur Command #871
Archived 1 artifacts
Archive block size is 32768
Received 0 blocks and 7478 bytes
Compression is 0.0%
Took 38 ms
[JENKINS] Archiving <https://builds.apache.org/job/Blur-master-jdk7/ws/blur-store/pom.xml>
to org.apache.blur/blur-store/0.2.4-incubating-SNAPSHOT-hadoop1/blur-store-0.2.4-incubating-SNAPSHOT-hadoop1.pom
Sending artifact delta relative to Blur-master-jdk7 » Blur Store #871
Archived 1 artifacts
Archive block size is 32768
Received 0 blocks and 6828 bytes
Compression is 0.0%
Took 37 ms
[JENKINS] Archiving <https://builds.apache.org/job/Blur-master-jdk7/ws/blur-core/pom.xml>
to org.apache.blur/blur-core/0.2.4-incubating-SNAPSHOT-hadoop1/blur-core-0.2.4-incubating-SNAPSHOT-hadoop1.pom
Sending artifact delta relative to Blur-master-jdk7 » Blur Core #871
Archived 1 artifacts
Archive block size is 32768
Received 0 blocks and 6673 bytes
Compression is 0.0%
Took 46 ms
[JENKINS] Archiving <https://builds.apache.org/job/Blur-master-jdk7/ws/blur-gui/pom.xml>
to org.apache.blur/blur-gui/0.2.4-incubating-SNAPSHOT-hadoop1/blur-gui-0.2.4-incubating-SNAPSHOT-hadoop1.pom
Sending artifact delta relative to Blur-master-jdk7 » Blur GUI #871
Archived 1 artifacts
Archive block size is 32768
Received 0 blocks and 5834 bytes
Compression is 0.0%
Took 0.56 sec
[JENKINS] Archiving <https://builds.apache.org/job/Blur-master-jdk7/ws/blur-console/pom.xml>
to org.apache.blur/blur-console/0.2.4-incubating-SNAPSHOT-hadoop1/blur-console-0.2.4-incubating-SNAPSHOT-hadoop1.pom
Sending artifact delta relative to Blur-master-jdk7 » Blur Console #871
Archived 1 artifacts
Archive block size is 32768
Received 0 blocks and 13053 bytes
Compression is 0.0%
Took 1.9 sec
Sending e-mails to: blur-dev@incubator.apache.org
channel stopped

Mime
View raw message