incubator-blur-dev mailing list archives

Site index · List index
Message view « Date » · « Thread »
Top « Date » · « Thread »
From Apache Jenkins Server <jenk...@builds.apache.org>
Subject Build failed in Jenkins: Blur-master-jdk7 » Blur Command #790
Date Tue, 23 Sep 2014 14:22:40 GMT
See <https://builds.apache.org/job/Blur-master-jdk7/org.apache.blur$blur-command/790/>

------------------------------------------
[INFO]                                                                         
[INFO] ------------------------------------------------------------------------
[INFO] Building Blur Command 0.2.4-incubating-SNAPSHOT-hadoop1
[INFO] ------------------------------------------------------------------------
[INFO] 
[INFO] --- maven-clean-plugin:2.5:clean (default-clean) @ blur-command ---
[INFO] Deleting <https://builds.apache.org/job/Blur-master-jdk7/org.apache.blur$blur-command/ws/target>
[INFO] 
[INFO] --- maven-remote-resources-plugin:1.4:process (default) @ blur-command ---
[INFO] 
[INFO] --- maven-resources-plugin:2.6:resources (default-resources) @ blur-command ---
[INFO] Using 'UTF-8' encoding to copy filtered resources.
[INFO] Copying 1 resource
[INFO] Copying 3 resources
[INFO] 
[INFO] --- maven-compiler-plugin:2.5.1:compile (default-compile) @ blur-command ---
[INFO] Compiling 6 source files to <https://builds.apache.org/job/Blur-master-jdk7/org.apache.blur$blur-command/ws/target/classes>
[INFO] 
[INFO] --- maven-resources-plugin:2.6:testResources (default-testResources) @ blur-command
---
[INFO] Using 'UTF-8' encoding to copy filtered resources.
[INFO] skip non existing resourceDirectory <https://builds.apache.org/job/Blur-master-jdk7/org.apache.blur$blur-command/ws/src/test/resources>
[INFO] Copying 3 resources
[INFO] 
[INFO] --- maven-compiler-plugin:2.5.1:testCompile (default-testCompile) @ blur-command ---
[INFO] Compiling 6 source files to <https://builds.apache.org/job/Blur-master-jdk7/org.apache.blur$blur-command/ws/target/test-classes>
[INFO] -------------------------------------------------------------
[ERROR] COMPILATION ERROR : 
[INFO] -------------------------------------------------------------
[ERROR] <https://builds.apache.org/job/Blur-master-jdk7/org.apache.blur$blur-command/ws/src/test/java/org/apache/blur/command/TermsCommandTest.java>:[72,31]
error: method combine in class TermsCommand cannot be applied to given types;
[ERROR]   required: ServerContext,Map<Shard,List<String>>
  found: Map<Shard,List<String>>
  reason: actual and formal argument lists differ in length
<https://builds.apache.org/job/Blur-master-jdk7/org.apache.blur$blur-command/ws/src/test/java/org/apache/blur/command/TermsCommandTest.java>:[83,31]
error: method combine in class TermsCommand cannot be applied to given types;
[ERROR]   required: ServerContext,Map<Shard,List<String>>
  found: Map<Shard,List<String>>
  reason: actual and formal argument lists differ in length
<https://builds.apache.org/job/Blur-master-jdk7/org.apache.blur$blur-command/ws/src/test/java/org/apache/blur/command/DocumentCountCombinerTest.java>:[54,19]
error: method combine in class DocumentCountCombiner cannot be applied to given types;
[INFO] 3 errors 
[INFO] -------------------------------------------------------------

Mime
View raw message