incubator-blur-dev mailing list archives

Site index · List index
Message view « Date » · « Thread »
Top « Date » · « Thread »
From Apache Jenkins Server <jenk...@builds.apache.org>
Subject Build failed in Jenkins: Blur-master-jdk7 #767
Date Fri, 19 Sep 2014 01:00:10 GMT
See <https://builds.apache.org/job/Blur-master-jdk7/767/changes>

Changes:

[twilliams] merge in start of new tests stuffs blur-374

------------------------------------------
[...truncated 1197 lines...]
55500
56000
56500
57000
57500
58000
58500
59000
59500
60000
60500
61000
61500
62000
62500
63000
63500
64000
64500
65000
65500
66000
66500
67000
67500
68000
68500
69000
69500
70000
70500
71000
71500
72000
72500
73000
73500
74000
74500
75000
75500
76000
76500
77000
77500
78000
78500
79000
79500
80000
80500
81000
81500
82000
82500
83000
83500
84000
84500
85000
85500
86000
86500
87000
87500
88000
88500
89000
89500
90000
90500
91000
91500
92000
92500
93000
93500
94000
94500
95000
95500
96000
96500
97000
97500
98000
98500
99000
99500
done writing
done opening
done fetching
Document<stored,indexed,tokenized,omitNorms,indexOptions=DOCS_ONLY<test:test> stored,indexed,tokenized<test2:test>
stored,indexed,tokenized,omitNorms,indexOptions=DOCS_ONLY<id:e94878de-66af-44c3-8738-efbde66c9ff6>>
done searching
Tests run: 3, Failures: 0, Errors: 0, Skipped: 0, Time elapsed: 5.161 sec
Running org.apache.blur.store.blockcache_v2.CacheIndexInputTest
Using seed [1620924360650627444]
WARN  20140919_00:58:32:865_UTC [main] buffer.BufferStore: Buffer store for size [1,024] already
setup.
WARN  20140919_00:58:32:869_UTC [main] buffer.BufferStore: Buffer store for size [8,192] already
setup.
Using seed [-445703760801126340]
Tests run: 2, Failures: 0, Errors: 0, Skipped: 0, Time elapsed: 13.012 sec
Running org.apache.blur.store.blockcache_v2.cachevalue.ByteArrayCacheValueTest
Tests run: 4, Failures: 0, Errors: 0, Skipped: 0, Time elapsed: 0.293 sec
Running org.apache.blur.store.blockcache_v2.cachevalue.UnsafeCacheValueTest
Tests run: 4, Failures: 0, Errors: 0, Skipped: 0, Time elapsed: 0.293 sec
Running org.apache.blur.store.blockcache_v2.CacheIndexOutputTest
Using seed [2612812737435097610]
WARN  20140919_00:58:34:496_UTC [main] buffer.BufferStore: Buffer store for size [1,024] already
setup.
WARN  20140919_00:58:34:500_UTC [main] buffer.BufferStore: Buffer store for size [8,192] already
setup.
Using seed [-5594012363034022174]
Tests run: 2, Failures: 0, Errors: 0, Skipped: 0, Time elapsed: 12.483 sec
Running org.apache.blur.store.hdfs.HdfsDirectorySymlinkTest
INFO  20140919_00:58:47:975_UTC [main] hdfs.HdfsDirectory: Creating symlink with name [_0.fnm]
to [<https://builds.apache.org/job/Blur-master-jdk7/ws/blur-store/target/tmp/HdfsDirectoryTest/dir1/_0.fnm]>
INFO  20140919_00:58:47:980_UTC [main] hdfs.HdfsDirectory: Creating symlink with name [_0_Lucene41_0.doc]
to [<https://builds.apache.org/job/Blur-master-jdk7/ws/blur-store/target/tmp/HdfsDirectoryTest/dir1/_0_Lucene41_0.doc]>
INFO  20140919_00:58:47:982_UTC [main] hdfs.HdfsDirectory: Creating symlink with name [_0.fdx]
to [<https://builds.apache.org/job/Blur-master-jdk7/ws/blur-store/target/tmp/HdfsDirectoryTest/dir1/_0.fdx]>
INFO  20140919_00:58:47:983_UTC [main] hdfs.HdfsDirectory: Creating symlink with name [_0_Lucene41_0.tim]
to [<https://builds.apache.org/job/Blur-master-jdk7/ws/blur-store/target/tmp/HdfsDirectoryTest/dir1/_0_Lucene41_0.tim]>
INFO  20140919_00:58:47:985_UTC [main] hdfs.HdfsDirectory: Creating symlink with name [_0.fdt]
to [<https://builds.apache.org/job/Blur-master-jdk7/ws/blur-store/target/tmp/HdfsDirectoryTest/dir1/_0.fdt]>
INFO  20140919_00:58:47:986_UTC [main] hdfs.HdfsDirectory: Creating symlink with name [_0_Lucene41_0.tip]
to [<https://builds.apache.org/job/Blur-master-jdk7/ws/blur-store/target/tmp/HdfsDirectoryTest/dir1/_0_Lucene41_0.tip]>
INFO  20140919_00:58:48:056_UTC [main] hdfs.HdfsDirectory: Creating symlink with name [file2]
to [<https://builds.apache.org/job/Blur-master-jdk7/ws/blur-store/target/tmp/HdfsDirectoryTest/dir1/file1]>
Tests run: 2, Failures: 0, Errors: 0, Skipped: 0, Time elapsed: 1.223 sec

Results :

Tests run: 34, Failures: 0, Errors: 0, Skipped: 0

[JENKINS] Recording test results
[INFO] ------------------------------------------------------------------------
[INFO] Reactor Summary:
[INFO] 
[INFO] Blur .............................................. SUCCESS [35.601s]
[INFO] Blur Util ......................................... SUCCESS [18.163s]
[INFO] Blur Thrift ....................................... SUCCESS [14.547s]
[INFO] Blur Store ........................................ FAILURE [7:00.899s]
[INFO] Blur Query ........................................ SKIPPED
[INFO] Blur GUI .......................................... SKIPPED
[INFO] Blur Core ......................................... SKIPPED
[INFO] Blur Console ...................................... SKIPPED
[INFO] Blur Map Reduce Hadoop1 ........................... SKIPPED
[INFO] Blur Shell ........................................ SKIPPED
[INFO] Blur Command ...................................... SKIPPED
[INFO] Distribution ...................................... SKIPPED
[INFO] ------------------------------------------------------------------------
[INFO] BUILD FAILURE
[INFO] ------------------------------------------------------------------------
[INFO] Total time: 8:19.084s
[INFO] Finished at: Fri Sep 19 00:58:50 UTC 2014
[INFO] Final Memory: 30M/151M
[INFO] ------------------------------------------------------------------------
Waiting for Jenkins to finish collecting data
[ERROR] Failed to execute goal org.apache.maven.plugins:maven-surefire-plugin:2.12.4:test
(default-test) on project blur-store: ExecutionException; nested exception is java.util.concurrent.ExecutionException:
java.lang.RuntimeException: The forked VM terminated without saying properly goodbye. VM crash
or System.exit called ? -> [Help 1]
[ERROR] 
[ERROR] To see the full stack trace of the errors, re-run Maven with the -e switch.
[ERROR] Re-run Maven using the -X switch to enable full debug logging.
[ERROR] 
[ERROR] For more information about the errors and possible solutions, please read the following
articles:
[ERROR] [Help 1] http://cwiki.apache.org/confluence/display/MAVEN/MojoExecutionException
[ERROR] 
[ERROR] After correcting the problems, you can resume the build with the command
[ERROR]   mvn <goals> -rf :blur-store
[JENKINS] Archiving <https://builds.apache.org/job/Blur-master-jdk7/ws/blur-shell/pom.xml>
to org.apache.blur/blur-shell/0.2.4-incubating-SNAPSHOT-hadoop1/blur-shell-0.2.4-incubating-SNAPSHOT-hadoop1.pom
Sending artifact delta relative to Blur-master-jdk7 ? Blur Shell #766
Archived 1 artifacts
Archive block size is 32768
Received 0 blocks and 6060 bytes
Compression is 0.0%
Took 82 ms
[JENKINS] Archiving <https://builds.apache.org/job/Blur-master-jdk7/ws/blur-mapred-hadoop1/pom.xml>
to org.apache.blur/blur-mapred-hadoop1/0.2.4-incubating-SNAPSHOT-hadoop1/blur-mapred-hadoop1-0.2.4-incubating-SNAPSHOT-hadoop1.pom
Sending artifact delta relative to Blur-master-jdk7 ? Blur Map Reduce Hadoop1 #766
Archived 1 artifacts
Archive block size is 32768
Received 0 blocks and 6094 bytes
Compression is 0.0%
Took 92 ms
[JENKINS] Archiving <https://builds.apache.org/job/Blur-master-jdk7/ws/pom.xml> to org.apache.blur/blur/0.2.4-incubating-SNAPSHOT/blur-0.2.4-incubating-SNAPSHOT.pom
Sending artifact delta relative to Blur-master-jdk7 ? Blur #766
Archived 1 artifacts
Archive block size is 32768
Received 0 blocks and 14366 bytes
Compression is 0.0%
Took 76 ms
[JENKINS] Archiving <https://builds.apache.org/job/Blur-master-jdk7/ws/blur-util/pom.xml>
to org.apache.blur/blur-util/0.2.4-incubating-SNAPSHOT-hadoop1/blur-util-0.2.4-incubating-SNAPSHOT-hadoop1.pom
[JENKINS] Archiving <https://builds.apache.org/job/Blur-master-jdk7/ws/blur-util/target/blur-util-0.2.4-incubating-SNAPSHOT-hadoop1.jar>
to org.apache.blur/blur-util/0.2.4-incubating-SNAPSHOT-hadoop1/blur-util-0.2.4-incubating-SNAPSHOT-hadoop1.jar
[JENKINS] Archiving <https://builds.apache.org/job/Blur-master-jdk7/ws/blur-util/target/blur-util-0.2.4-incubating-SNAPSHOT-hadoop1-tests.jar>
to org.apache.blur/blur-util/0.2.4-incubating-SNAPSHOT-hadoop1/blur-util-0.2.4-incubating-SNAPSHOT-hadoop1-tests.jar
Sending artifact delta relative to Blur-master-jdk7 ? Blur Util #766
Archived 3 artifacts
Archive block size is 32768
Received 0 blocks and 169428 bytes
Compression is 0.0%
Took 1.6 sec
[JENKINS] Archiving <https://builds.apache.org/job/Blur-master-jdk7/ws/distribution/pom.xml>
to org.apache.blur/apache-blur/0.2.4-incubating-SNAPSHOT-hadoop1/apache-blur-0.2.4-incubating-SNAPSHOT-hadoop1.pom
Sending artifact delta relative to Blur-master-jdk7 ? Distribution #766
Archived 1 artifacts
Archive block size is 32768
Received 0 blocks and 4509 bytes
Compression is 0.0%
Took 2.9 sec
[JENKINS] Archiving <https://builds.apache.org/job/Blur-master-jdk7/ws/blur-thrift/pom.xml>
to org.apache.blur/blur-thrift/0.2.4-incubating-SNAPSHOT-hadoop1/blur-thrift-0.2.4-incubating-SNAPSHOT-hadoop1.pom
[JENKINS] Archiving <https://builds.apache.org/job/Blur-master-jdk7/ws/blur-thrift/target/blur-thrift-0.2.4-incubating-SNAPSHOT-hadoop1.jar>
to org.apache.blur/blur-thrift/0.2.4-incubating-SNAPSHOT-hadoop1/blur-thrift-0.2.4-incubating-SNAPSHOT-hadoop1.jar
[JENKINS] Archiving <https://builds.apache.org/job/Blur-master-jdk7/ws/blur-thrift/target/blur-thrift-0.2.4-incubating-SNAPSHOT-hadoop1-tests.jar>
to org.apache.blur/blur-thrift/0.2.4-incubating-SNAPSHOT-hadoop1/blur-thrift-0.2.4-incubating-SNAPSHOT-hadoop1-tests.jar
Sending artifact delta relative to Blur-master-jdk7 ? Blur Thrift #766
Archived 3 artifacts
Archive block size is 32768
Received 0 blocks and 2094342 bytes
Compression is 0.0%
Took 0.71 sec
[JENKINS] Archiving <https://builds.apache.org/job/Blur-master-jdk7/ws/blur-query/pom.xml>
to org.apache.blur/blur-query/0.2.4-incubating-SNAPSHOT-hadoop1/blur-query-0.2.4-incubating-SNAPSHOT-hadoop1.pom
Sending artifact delta relative to Blur-master-jdk7 ? Blur Query #766
Archived 1 artifacts
Archive block size is 32768
Received 0 blocks and 5646 bytes
Compression is 0.0%
Took 89 ms
[JENKINS] Archiving <https://builds.apache.org/job/Blur-master-jdk7/ws/blur-command/pom.xml>
to org.apache.blur/blur-command/0.2.4-incubating-SNAPSHOT-hadoop1/blur-command-0.2.4-incubating-SNAPSHOT-hadoop1.pom
Sending artifact delta relative to Blur-master-jdk7 ? Blur Command #766
Archived 1 artifacts
Archive block size is 32768
Received 0 blocks and 7261 bytes
Compression is 0.0%
Took 80 ms
[JENKINS] Archiving <https://builds.apache.org/job/Blur-master-jdk7/ws/blur-store/pom.xml>
to org.apache.blur/blur-store/0.2.4-incubating-SNAPSHOT-hadoop1/blur-store-0.2.4-incubating-SNAPSHOT-hadoop1.pom
Sending artifact delta relative to Blur-master-jdk7 ? Blur Store #766
Archived 1 artifacts
Archive block size is 32768
Received 0 blocks and 6828 bytes
Compression is 0.0%
Took 1.6 sec
[JENKINS] Archiving <https://builds.apache.org/job/Blur-master-jdk7/ws/blur-core/pom.xml>
to org.apache.blur/blur-core/0.2.4-incubating-SNAPSHOT-hadoop1/blur-core-0.2.4-incubating-SNAPSHOT-hadoop1.pom
Sending artifact delta relative to Blur-master-jdk7 ? Blur Core #766
Archived 1 artifacts
Archive block size is 32768
Received 0 blocks and 6673 bytes
Compression is 0.0%
Took 0.2 sec
[JENKINS] Archiving <https://builds.apache.org/job/Blur-master-jdk7/ws/blur-gui/pom.xml>
to org.apache.blur/blur-gui/0.2.4-incubating-SNAPSHOT-hadoop1/blur-gui-0.2.4-incubating-SNAPSHOT-hadoop1.pom
Sending artifact delta relative to Blur-master-jdk7 ? Blur GUI #766
Archived 1 artifacts
Archive block size is 32768
Received 0 blocks and 5834 bytes
Compression is 0.0%
Took 0.51 sec
[JENKINS] Archiving <https://builds.apache.org/job/Blur-master-jdk7/ws/blur-console/pom.xml>
to org.apache.blur/blur-console/0.2.4-incubating-SNAPSHOT-hadoop1/blur-console-0.2.4-incubating-SNAPSHOT-hadoop1.pom
Sending artifact delta relative to Blur-master-jdk7 ? Blur Console #766
Archived 1 artifacts
Archive block size is 32768
Received 0 blocks and 12877 bytes
Compression is 0.0%
Took 99 ms
Sending e-mails to: blur-dev@incubator.apache.org
channel stopped

Mime
View raw message