incubator-blur-dev mailing list archives

Site index · List index
Message view « Date » · « Thread »
Top « Date » · « Thread »
From Apache Jenkins Server <jenk...@builds.apache.org>
Subject Build failed in Jenkins: Blur-master-jdk7 » Blur Command #828
Date Wed, 01 Oct 2014 00:01:13 GMT
See <https://builds.apache.org/job/Blur-master-jdk7/org.apache.blur$blur-command/828/>

------------------------------------------
[INFO]                                                                         
[INFO] ------------------------------------------------------------------------
[INFO] Building Blur Command 0.2.4-incubating-SNAPSHOT-hadoop1
[INFO] ------------------------------------------------------------------------
[INFO] 
[INFO] --- maven-clean-plugin:2.5:clean (default-clean) @ blur-command ---
[INFO] Deleting <https://builds.apache.org/job/Blur-master-jdk7/org.apache.blur$blur-command/ws/target>
[INFO] 
[INFO] --- maven-remote-resources-plugin:1.4:process (default) @ blur-command ---
[INFO] 
[INFO] --- maven-resources-plugin:2.6:resources (default-resources) @ blur-command ---
[INFO] Using 'UTF-8' encoding to copy filtered resources.
[INFO] Copying 1 resource
[INFO] Copying 3 resources
[INFO] 
[INFO] --- maven-compiler-plugin:2.5.1:compile (default-compile) @ blur-command ---
[INFO] Compiling 9 source files to <https://builds.apache.org/job/Blur-master-jdk7/org.apache.blur$blur-command/ws/target/classes>
[INFO] 
[INFO] --- maven-resources-plugin:2.6:testResources (default-testResources) @ blur-command
---
[INFO] Using 'UTF-8' encoding to copy filtered resources.
[INFO] skip non existing resourceDirectory <https://builds.apache.org/job/Blur-master-jdk7/org.apache.blur$blur-command/ws/src/test/resources>
[INFO] Copying 3 resources
[INFO] 
[INFO] --- maven-compiler-plugin:2.5.1:testCompile (default-testCompile) @ blur-command ---
[INFO] Compiling 9 source files to <https://builds.apache.org/job/Blur-master-jdk7/org.apache.blur$blur-command/ws/target/test-classes>
[INFO] -------------------------------------------------------------
[ERROR] COMPILATION ERROR : 
[INFO] -------------------------------------------------------------
[ERROR] <https://builds.apache.org/job/Blur-master-jdk7/org.apache.blur$blur-command/ws/src/test/java/org/apache/blur/command/TestContextArgDecorator.java>:[24,7]
error: TestContextArgDecorator is not abstract and does not override abstract method getBlurConfiguration(String)
in BaseContext
[ERROR] <https://builds.apache.org/job/Blur-master-jdk7/org.apache.blur$blur-command/ws/src/test/java/org/apache/blur/command/CoreTestContext.java>:[36,7]
error: CoreTestContext is not abstract and does not override abstract method getBlurConfiguration(String)
in BaseContext
[INFO] 2 errors 
[INFO] -------------------------------------------------------------

Mime
View raw message