incubator-blur-dev mailing list archives

Site index · List index
Message view « Date » · « Thread »
Top « Date » · « Thread »
From Apache Jenkins Server <jenk...@builds.apache.org>
Subject Build failed in Jenkins: Blur-master-jdk7 #510
Date Tue, 01 Jul 2014 13:53:24 GMT
See <https://builds.apache.org/job/Blur-master-jdk7/510/changes>

Changes:

[rohr.chris] Started adding authentication, not finished yet

------------------------------------------
[...truncated 25238 lines...]
INFO  20140701_13:52:51:389_UTC [main] hdfs.HdfsDirectory: Creating symlink with name [_t_Lucene41_0.tip]
to [<https://builds.apache.org/job/Blur-master-jdk7/ws/blur-core/target/tmp-shards-for-testing/shard-00000119/_0_Lucene41_0.tip]>
INFO  20140701_13:52:51:391_UTC [main] hdfs.HdfsDirectory: Creating symlink with name [_u.fnm]
to [<https://builds.apache.org/job/Blur-master-jdk7/ws/blur-core/target/tmp-shards-for-testing/shard-00000123/_0.fnm]>
INFO  20140701_13:52:51:392_UTC [main] hdfs.HdfsDirectory: Creating symlink with name [_u_Lucene41_0.doc]
to [<https://builds.apache.org/job/Blur-master-jdk7/ws/blur-core/target/tmp-shards-for-testing/shard-00000123/_0_Lucene41_0.doc]>
INFO  20140701_13:52:51:393_UTC [main] hdfs.HdfsDirectory: Creating symlink with name [_u.fdx]
to [<https://builds.apache.org/job/Blur-master-jdk7/ws/blur-core/target/tmp-shards-for-testing/shard-00000123/_0.fdx]>
INFO  20140701_13:52:51:393_UTC [main] hdfs.HdfsDirectory: Creating symlink with name [_u_Lucene41_0.tim]
to [<https://builds.apache.org/job/Blur-master-jdk7/ws/blur-core/target/tmp-shards-for-testing/shard-00000123/_0_Lucene41_0.tim]>
INFO  20140701_13:52:51:393_UTC [main] hdfs.HdfsDirectory: Creating symlink with name [_u.fdt]
to [<https://builds.apache.org/job/Blur-master-jdk7/ws/blur-core/target/tmp-shards-for-testing/shard-00000123/_0.fdt]>
INFO  20140701_13:52:51:394_UTC [main] hdfs.HdfsDirectory: Creating symlink with name [_u_Lucene41_0.tip]
to [<https://builds.apache.org/job/Blur-master-jdk7/ws/blur-core/target/tmp-shards-for-testing/shard-00000123/_0_Lucene41_0.tip]>
INFO  20140701_13:52:51:397_UTC [main] hdfs.HdfsDirectory: Creating symlink with name [_v.fnm]
to [<https://builds.apache.org/job/Blur-master-jdk7/ws/blur-core/target/tmp-shards-for-testing/shard-00000127/_0.fnm]>
INFO  20140701_13:52:51:397_UTC [main] hdfs.HdfsDirectory: Creating symlink with name [_v_Lucene41_0.doc]
to [<https://builds.apache.org/job/Blur-master-jdk7/ws/blur-core/target/tmp-shards-for-testing/shard-00000127/_0_Lucene41_0.doc]>
INFO  20140701_13:52:51:397_UTC [main] hdfs.HdfsDirectory: Creating symlink with name [_v.fdx]
to [<https://builds.apache.org/job/Blur-master-jdk7/ws/blur-core/target/tmp-shards-for-testing/shard-00000127/_0.fdx]>
INFO  20140701_13:52:51:398_UTC [main] hdfs.HdfsDirectory: Creating symlink with name [_v_Lucene41_0.tim]
to [<https://builds.apache.org/job/Blur-master-jdk7/ws/blur-core/target/tmp-shards-for-testing/shard-00000127/_0_Lucene41_0.tim]>
INFO  20140701_13:52:51:398_UTC [main] hdfs.HdfsDirectory: Creating symlink with name [_v.fdt]
to [<https://builds.apache.org/job/Blur-master-jdk7/ws/blur-core/target/tmp-shards-for-testing/shard-00000127/_0.fdt]>
INFO  20140701_13:52:51:399_UTC [main] hdfs.HdfsDirectory: Creating symlink with name [_v_Lucene41_0.tip]
to [<https://builds.apache.org/job/Blur-master-jdk7/ws/blur-core/target/tmp-shards-for-testing/shard-00000127/_0_Lucene41_0.tip]>
Tests run: 1, Failures: 0, Errors: 0, Skipped: 0, Time elapsed: 5.481 sec
Running org.apache.blur.utils.BlurUtilsTest
ERROR 20140701_13:52:53:016_UTC [main] utils.BlurUtil: Path [<https://builds.apache.org/job/Blur-master-jdk7/ws/blur-core/target/target/tmp/ValidateShardCount-test/shard-00000009]>
for shard [9] does not exist.
ERROR 20140701_13:52:53:041_UTC [main] utils.BlurUtil: Number of directories in table path
[<https://builds.apache.org/job/Blur-master-jdk7/ws/blur-core/target/target/tmp/ValidateShardCount-test/shard-00000010]>
exceeds definition of [10] shard count.
Tests run: 13, Failures: 0, Errors: 0, Skipped: 0, Time elapsed: 0.955 sec
Running org.apache.blur.utils.TermDocIterableTest
71.872727 0 0
39.127012 1 0
32.488533 2 0
32.011196 3 0
30.539707 4 0
11.344364 5 0
7.115519 6 0
6.237764 7 0
6.227398 8 0
6.482564 9 0
Tests run: 1, Failures: 0, Errors: 0, Skipped: 0, Time elapsed: 1.249 sec

Results :

Tests run: 147, Failures: 0, Errors: 0, Skipped: 0

[JENKINS] Recording test results
[INFO] 
[INFO] --- maven-jar-plugin:2.4:jar (default-jar) @ blur-core ---
[INFO] Building jar: <https://builds.apache.org/job/Blur-master-jdk7/ws/blur-core/target/blur-core-0.2.2-incubating-hadoop1.jar>
[INFO] 
[INFO] --- maven-site-plugin:3.2:attach-descriptor (attach-descriptor) @ blur-core ---
[INFO] 
[INFO] --- apache-rat-plugin:0.10:check (default) @ blur-core ---
[INFO] 51 implicit excludes (use -debug for more details).
[INFO] Exclude: LICENSE
[INFO] Exclude: CHANGES.txt
[INFO] Exclude: DISCLAIMER
[INFO] Exclude: NOTICE
[INFO] Exclude: README
[INFO] Exclude: **/README.textile
[INFO] Exclude: **/README.md
[INFO] Exclude: **/.classpath
[INFO] Exclude: **/.project
[INFO] Exclude: **/.settings/**
[INFO] Exclude: **/.idea/**
[INFO] Exclude: **/*.iml
[INFO] Exclude: **/target/**
[INFO] Exclude: **/build/**
[INFO] Exclude: **/.codio
[INFO] Exclude: **/src/main/webapp/libs/**
[INFO] Exclude: **/node_modules/**
[INFO] Exclude: **/src/main/webapp/public/css/**
[INFO] Exclude: **/src/main/webapp/js/utils/*
[INFO] Exclude: **/src/main/webapp/public/js/modernizr.js
[INFO] Exclude: **/src/main/webapp/node_modules/**
[INFO] Exclude: **/src/main/webapp/.sass-cache/**
[INFO] Exclude: **/src/main/webapp/.tmp/**
[INFO] Exclude: **/.bowerrc
[INFO] Exclude: **/.editorconfig
[INFO] Exclude: **/.jshintrc
[INFO] Exclude: **/package.json
[INFO] Exclude: **/bower.json
[INFO] Exclude: **/src/main/scripts/grunt.sh
[INFO] Exclude: contrib/blur-console-v1/**
[INFO] Exclude: **/src/main/resources/org/apache/blur/thrift/util/words.txt
[INFO] Exclude: **/src/main/webapp/js/d3.v2.js
[INFO] Exclude: **/src/main/webapp/js/d3.v2.min.js
[INFO] Exclude: **/src/main/resources*/license-notes.txt
[INFO] Exclude: **/src/main/resources*/NOTICE-bin.base.txt
[INFO] Exclude: **/src/main/resources*/NOTICE-bin.txt
[INFO] Exclude: **/src/main/resources*/notices/*.src
[INFO] Exclude: **/src/main/scripts/conf/controllers
[INFO] Exclude: **/src/main/scripts/conf/consoles
[INFO] Exclude: **/src/main/scripts/conf/default_zoo.cfg
[INFO] Exclude: **/src/main/scripts/conf/shards
[INFO] Exclude: **/src/main/scripts/conf/zookeepers
[INFO] Exclude: **/src/main/scripts/interface/gen-html/Blur.html
[INFO] Exclude: **/src/main/scripts/interface/gen-html/index.html
[INFO] Exclude: **/.empty
[INFO] 131 resources included (use -debug for more details)
[INFO] Rat check: Summary of files. Unapproved: 0 unknown: 0 generated: 0 approved: 131 licence.
[INFO] 
[INFO] --- maven-jar-plugin:2.4:test-jar (default) @ blur-core ---
[INFO] Building jar: <https://builds.apache.org/job/Blur-master-jdk7/ws/blur-core/target/blur-core-0.2.2-incubating-hadoop1-tests.jar>
[INFO] 
[INFO] --- maven-install-plugin:2.3.1:install (default-install) @ blur-core ---
[INFO] Installing <https://builds.apache.org/job/Blur-master-jdk7/ws/blur-core/target/blur-core-0.2.2-incubating-hadoop1.jar>
to /home/jenkins/jenkins-slave/maven-repositories/0/org/apache/blur/blur-core/0.2.2-incubating-hadoop1/blur-core-0.2.2-incubating-hadoop1.jar
[INFO] Installing <https://builds.apache.org/job/Blur-master-jdk7/ws/blur-core/pom.xml>
to /home/jenkins/jenkins-slave/maven-repositories/0/org/apache/blur/blur-core/0.2.2-incubating-hadoop1/blur-core-0.2.2-incubating-hadoop1.pom
[INFO] Installing <https://builds.apache.org/job/Blur-master-jdk7/ws/blur-core/target/blur-core-0.2.2-incubating-hadoop1-tests.jar>
to /home/jenkins/jenkins-slave/maven-repositories/0/org/apache/blur/blur-core/0.2.2-incubating-hadoop1/blur-core-0.2.2-incubating-hadoop1-tests.jar
[INFO]                                                                         
[INFO] ------------------------------------------------------------------------
[INFO] Building Blur Console 0.2.2-incubating-hadoop1
[INFO] ------------------------------------------------------------------------
[INFO] 
[INFO] --- maven-clean-plugin:2.5:clean (default-clean) @ blur-console ---
[INFO] Deleting <https://builds.apache.org/job/Blur-master-jdk7/ws/blur-console/target>
[INFO] 
[INFO] --- cobertura-maven-plugin:2.6:clean (default) @ blur-console ---
[INFO] 
[INFO] --- maven-remote-resources-plugin:1.4:process (default) @ blur-console ---
[INFO] 
[INFO] --- maven-resources-plugin:2.6:resources (default-resources) @ blur-console ---
[INFO] Using 'UTF-8' encoding to copy filtered resources.
[INFO] Copying 0 resource
[INFO] Copying 1 resource
[INFO] Copying 3 resources
[INFO] 
[INFO] --- maven-compiler-plugin:2.5.1:compile (default-compile) @ blur-console ---
[INFO] Compiling 18 source files to <https://builds.apache.org/job/Blur-master-jdk7/ws/blur-console/target/classes>
[INFO] -------------------------------------------------------------
[ERROR] COMPILATION ERROR : 
[INFO] -------------------------------------------------------------
[ERROR] <https://builds.apache.org/job/Blur-master-jdk7/ws/blur-console/src/main/java/org/apache/blur/console/servlets/AuthServlet.java>:[67,39]
error: method getFirstParam in class HttpUtil cannot be applied to given types;
[INFO] 1 error
[INFO] -------------------------------------------------------------
[INFO] ------------------------------------------------------------------------
[INFO] Reactor Summary:
[INFO] 
[INFO] Blur .............................................. SUCCESS [14.417s]
[INFO] Blur Util ......................................... SUCCESS [12.414s]
[INFO] Blur Thrift ....................................... SUCCESS [11.682s]
[INFO] Blur Store ........................................ SUCCESS [6:41.805s]
[INFO] Blur Query ........................................ SUCCESS [4:11.544s]
[INFO] Blur GUI .......................................... SUCCESS [7.547s]
[INFO] Blur Core ......................................... SUCCESS [7:22.020s]
[INFO] Blur Console ...................................... FAILURE [4.447s]
[INFO] Blur Map Reduce Hadoop1 ........................... SKIPPED
[INFO] Blur Shell ........................................ SKIPPED
[INFO] Distribution ...................................... SKIPPED
[INFO] ------------------------------------------------------------------------
[INFO] BUILD FAILURE
[INFO] ------------------------------------------------------------------------
[INFO] Total time: 19:19.202s
[INFO] Finished at: Tue Jul 01 13:53:05 UTC 2014
[INFO] Final Memory: 36M/181M
[INFO] ------------------------------------------------------------------------
Waiting for Jenkins to finish collecting data
[ERROR] Failed to execute goal org.apache.maven.plugins:maven-compiler-plugin:2.5.1:compile
(default-compile) on project blur-console: Compilation failure
[ERROR] <https://builds.apache.org/job/Blur-master-jdk7/ws/blur-console/src/main/java/org/apache/blur/console/servlets/AuthServlet.java>:[67,39]
error: method getFirstParam in class HttpUtil cannot be applied to given types;
[ERROR] -> [Help 1]
[ERROR] 
[ERROR] To see the full stack trace of the errors, re-run Maven with the -e switch.
[ERROR] Re-run Maven using the -X switch to enable full debug logging.
[ERROR] 
[ERROR] For more information about the errors and possible solutions, please read the following
articles:
[ERROR] [Help 1] http://cwiki.apache.org/confluence/display/MAVEN/MojoFailureException
[ERROR] 
[ERROR] After correcting the problems, you can resume the build with the command
[ERROR]   mvn <goals> -rf :blur-console
[JENKINS] Archiving <https://builds.apache.org/job/Blur-master-jdk7/ws/blur-shell/pom.xml>
to org.apache.blur/blur-shell/0.2.2-incubating-hadoop1/blur-shell-0.2.2-incubating-hadoop1.pom
Sending artifact delta relative to Blur-master-jdk7 ? Blur Shell #509
Archived 1 artifacts
Archive block size is 32768
Received 0 blocks and 5207 bytes
Compression is 0.0%
Took 0.18 sec
[JENKINS] Archiving <https://builds.apache.org/job/Blur-master-jdk7/ws/blur-mapred-hadoop1/pom.xml>
to org.apache.blur/blur-mapred-hadoop1/0.2.2-incubating-hadoop1/blur-mapred-hadoop1-0.2.2-incubating-hadoop1.pom
Sending artifact delta relative to Blur-master-jdk7 ? Blur Map Reduce Hadoop1 #509
Archived 1 artifacts
Archive block size is 32768
Received 0 blocks and 5137 bytes
Compression is 0.0%
Took 31 ms
[JENKINS] Archiving <https://builds.apache.org/job/Blur-master-jdk7/ws/pom.xml> to org.apache.blur/blur/0.2.2-incubating/blur-0.2.2-incubating.pom
Sending artifact delta relative to Blur-master-jdk7 ? Blur #509
Archived 1 artifacts
Archive block size is 32768
Received 0 blocks and 13679 bytes
Compression is 0.0%
Took 32 ms
[JENKINS] Archiving <https://builds.apache.org/job/Blur-master-jdk7/ws/blur-util/pom.xml>
to org.apache.blur/blur-util/0.2.2-incubating-hadoop1/blur-util-0.2.2-incubating-hadoop1.pom
[JENKINS] Archiving <https://builds.apache.org/job/Blur-master-jdk7/ws/blur-util/target/blur-util-0.2.2-incubating-hadoop1.jar>
to org.apache.blur/blur-util/0.2.2-incubating-hadoop1/blur-util-0.2.2-incubating-hadoop1.jar
[JENKINS] Archiving <https://builds.apache.org/job/Blur-master-jdk7/ws/blur-util/target/blur-util-0.2.2-incubating-hadoop1-tests.jar>
to org.apache.blur/blur-util/0.2.2-incubating-hadoop1/blur-util-0.2.2-incubating-hadoop1-tests.jar
Sending artifact delta relative to Blur-master-jdk7 ? Blur Util #509
Archived 3 artifacts
Archive block size is 32768
Received 0 blocks and 167652 bytes
Compression is 0.0%
Took 0.25 sec
[JENKINS] Archiving <https://builds.apache.org/job/Blur-master-jdk7/ws/distribution/pom.xml>
to org.apache.blur/apache-blur/0.2.2-incubating-hadoop1/apache-blur-0.2.2-incubating-hadoop1.pom
Sending artifact delta relative to Blur-master-jdk7 ? Distribution #509
Archived 1 artifacts
Archive block size is 32768
Received 0 blocks and 3947 bytes
Compression is 0.0%
Took 3 sec
[JENKINS] Archiving <https://builds.apache.org/job/Blur-master-jdk7/ws/blur-thrift/pom.xml>
to org.apache.blur/blur-thrift/0.2.2-incubating-hadoop1/blur-thrift-0.2.2-incubating-hadoop1.pom
[JENKINS] Archiving <https://builds.apache.org/job/Blur-master-jdk7/ws/blur-thrift/target/blur-thrift-0.2.2-incubating-hadoop1.jar>
to org.apache.blur/blur-thrift/0.2.2-incubating-hadoop1/blur-thrift-0.2.2-incubating-hadoop1.jar
[JENKINS] Archiving <https://builds.apache.org/job/Blur-master-jdk7/ws/blur-thrift/target/blur-thrift-0.2.2-incubating-hadoop1-tests.jar>
to org.apache.blur/blur-thrift/0.2.2-incubating-hadoop1/blur-thrift-0.2.2-incubating-hadoop1-tests.jar
Sending artifact delta relative to Blur-master-jdk7 ? Blur Thrift #509
Archived 3 artifacts
Archive block size is 32768
Received 0 blocks and 1854086 bytes
Compression is 0.0%
Took 2.2 sec
[JENKINS] Archiving <https://builds.apache.org/job/Blur-master-jdk7/ws/blur-query/pom.xml>
to org.apache.blur/blur-query/0.2.2-incubating-hadoop1/blur-query-0.2.2-incubating-hadoop1.pom
[JENKINS] Archiving <https://builds.apache.org/job/Blur-master-jdk7/ws/blur-query/target/blur-query-0.2.2-incubating-hadoop1.jar>
to org.apache.blur/blur-query/0.2.2-incubating-hadoop1/blur-query-0.2.2-incubating-hadoop1.jar
[JENKINS] Archiving <https://builds.apache.org/job/Blur-master-jdk7/ws/blur-query/target/blur-query-0.2.2-incubating-hadoop1-tests.jar>
to org.apache.blur/blur-query/0.2.2-incubating-hadoop1/blur-query-0.2.2-incubating-hadoop1-tests.jar
Sending artifact delta relative to Blur-master-jdk7 ? Blur Query #509
Archived 3 artifacts
Archive block size is 32768
Received 0 blocks and 222193 bytes
Compression is 0.0%
Took 0.11 sec
[JENKINS] Archiving <https://builds.apache.org/job/Blur-master-jdk7/ws/blur-store/pom.xml>
to org.apache.blur/blur-store/0.2.2-incubating-hadoop1/blur-store-0.2.2-incubating-hadoop1.pom
[JENKINS] Archiving <https://builds.apache.org/job/Blur-master-jdk7/ws/blur-store/target/blur-store-0.2.2-incubating-hadoop1.jar>
to org.apache.blur/blur-store/0.2.2-incubating-hadoop1/blur-store-0.2.2-incubating-hadoop1.jar
[JENKINS] Archiving <https://builds.apache.org/job/Blur-master-jdk7/ws/blur-store/target/blur-store-0.2.2-incubating-hadoop1-tests.jar>
to org.apache.blur/blur-store/0.2.2-incubating-hadoop1/blur-store-0.2.2-incubating-hadoop1-tests.jar
Sending artifact delta relative to Blur-master-jdk7 ? Blur Store #509
Archived 3 artifacts
Archive block size is 32768
Received 0 blocks and 291303 bytes
Compression is 0.0%
Took 0.15 sec
[JENKINS] Archiving <https://builds.apache.org/job/Blur-master-jdk7/ws/blur-core/pom.xml>
to org.apache.blur/blur-core/0.2.2-incubating-hadoop1/blur-core-0.2.2-incubating-hadoop1.pom
[JENKINS] Archiving <https://builds.apache.org/job/Blur-master-jdk7/ws/blur-core/target/blur-core-0.2.2-incubating-hadoop1.jar>
to org.apache.blur/blur-core/0.2.2-incubating-hadoop1/blur-core-0.2.2-incubating-hadoop1.jar
[JENKINS] Archiving <https://builds.apache.org/job/Blur-master-jdk7/ws/blur-core/target/blur-core-0.2.2-incubating-hadoop1-tests.jar>
to org.apache.blur/blur-core/0.2.2-incubating-hadoop1/blur-core-0.2.2-incubating-hadoop1-tests.jar
Sending artifact delta relative to Blur-master-jdk7 ? Blur Core #509
Archived 3 artifacts
Archive block size is 32768
Received 0 blocks and 633705 bytes
Compression is 0.0%
Took 0.28 sec
[JENKINS] Archiving <https://builds.apache.org/job/Blur-master-jdk7/ws/blur-gui/pom.xml>
to org.apache.blur/blur-gui/0.2.2-incubating-hadoop1/blur-gui-0.2.2-incubating-hadoop1.pom
[JENKINS] Archiving <https://builds.apache.org/job/Blur-master-jdk7/ws/blur-gui/target/blur-gui-0.2.2-incubating-hadoop1.war>
to org.apache.blur/blur-gui/0.2.2-incubating-hadoop1/blur-gui-0.2.2-incubating-hadoop1.war
Sending artifact delta relative to Blur-master-jdk7 ? Blur GUI #509
Archived 2 artifacts
Archive block size is 32768
Received 779 blocks and 4230145 bytes
Compression is 85.8%
Took 5.5 sec
[JENKINS] Archiving <https://builds.apache.org/job/Blur-master-jdk7/ws/blur-console/pom.xml>
to org.apache.blur/blur-console/0.2.2-incubating-hadoop1/blur-console-0.2.2-incubating-hadoop1.pom
Sending artifact delta relative to Blur-master-jdk7 ? Blur Console #509
Archived 1 artifacts
Archive block size is 32768
Received 0 blocks and 9943 bytes
Compression is 0.0%
Took 85 ms
Sending e-mails to: blur-dev@incubator.apache.org
channel stopped

Mime
View raw message