incubator-blur-dev mailing list archives

Site index · List index
Message view « Date » · « Thread »
Top « Date » · « Thread »
From Apache Jenkins Server <jenk...@builds.apache.org>
Subject Build failed in Jenkins: Blur-master-jdk7 #582
Date Mon, 21 Jul 2014 19:22:34 GMT
See <https://builds.apache.org/job/Blur-master-jdk7/582/>

------------------------------------------
[...truncated 14775 lines...]
time [149] total hits [13245] searches [2] position [104] doc id [13140] score [0.9999245]
time [149] total hits [13245] searches [2] position [105] doc id [13139] score [0.9999245]
time [149] total hits [13245] searches [2] position [106] doc id [13138] score [0.9999245]
time [149] total hits [13245] searches [2] position [107] doc id [13137] score [0.9999245]
time [149] total hits [13245] searches [2] position [108] doc id [13136] score [0.9999245]
time [149] total hits [13245] searches [2] position [109] doc id [13135] score [0.9999245]
heap size=7944216
14/07/21 19:22:48 WARN search.IterablePaging: Skipping [90], Key [DeepPageKey [_indexKey=StandardDirectoryReader(segments_1:3
_0(4.3):C13245), _query=f1:value, _sort=null]] was missing, having to execute extra searches.
time [9] total hits [13245] searches [1] position [90] doc id [90] score [0.9999245]
time [9] total hits [13245] searches [1] position [91] doc id [91] score [0.9999245]
time [9] total hits [13245] searches [1] position [92] doc id [92] score [0.9999245]
time [9] total hits [13245] searches [1] position [93] doc id [93] score [0.9999245]
time [9] total hits [13245] searches [1] position [94] doc id [94] score [0.9999245]
time [9] total hits [13245] searches [1] position [95] doc id [95] score [0.9999245]
time [9] total hits [13245] searches [1] position [96] doc id [96] score [0.9999245]
time [9] total hits [13245] searches [1] position [97] doc id [97] score [0.9999245]
time [9] total hits [13245] searches [1] position [98] doc id [98] score [0.9999245]
time [9] total hits [13245] searches [1] position [99] doc id [99] score [0.9999245]
time [19] total hits [13245] searches [2] position [100] doc id [100] score [0.9999245]
time [19] total hits [13245] searches [2] position [101] doc id [101] score [0.9999245]
time [19] total hits [13245] searches [2] position [102] doc id [102] score [0.9999245]
time [19] total hits [13245] searches [2] position [103] doc id [103] score [0.9999245]
time [19] total hits [13245] searches [2] position [104] doc id [104] score [0.9999245]
time [19] total hits [13245] searches [2] position [105] doc id [105] score [0.9999245]
time [19] total hits [13245] searches [2] position [106] doc id [106] score [0.9999245]
time [19] total hits [13245] searches [2] position [107] doc id [107] score [0.9999245]
time [19] total hits [13245] searches [2] position [108] doc id [108] score [0.9999245]
time [19] total hits [13245] searches [2] position [109] doc id [109] score [0.9999245]
Tests run: 3, Failures: 0, Errors: 0, Skipped: 0, Time elapsed: 5.204 sec
Running org.apache.blur.lucene.search.SuperParserTest
expected =+<a.a:a a.d:e a.b:b>
actual   =+<a.a:a a.d:e a.b:b>
expected =<a.c:c a.d:d>
actual   =<a.c:c a.d:d>
expected =<a:a> <d:e> <b:b>
actual   =<a:a> <d:e> <b:b>
expected =<a.a:a a.d:e a.b:b> -<b.c:c b.d:d>
actual   =<a.a:a a.d:e a.b:b> -<b.c:c b.d:d>
expected =<a.a:a a.d:{e TO f} a.b:b a.test:hello<> -<g.c:c g.d:d>
actual   =<a.a:a a.d:{e TO f} a.b:b a.test:hello<> -<g.c:c g.d:d>
<a.b:cool> <+a.c:cool a.b:cool>
<a.b:cool> <+a.c:cool a.b:cool>
expected =<a.b:cool> <+a.c:cool a.b:cool>
actual   =<a.b:cool> <+a.c:cool a.b:cool>
expected =<a.b:cool> <a.c:cool a.b:cool>
actual   =<a.b:cool> <a.c:cool a.b:cool>
expected =<a.b:cool> <a.c:cool a.b:cool>
actual   =<a.b:cool> <a.c:cool a.b:cool>
expected =<a.b:cool> <a.c:cool> <a.b:cool>
actual   =<a.b:cool> <a.c:cool> <a.b:cool>
expected =<a.b:cool> <+a.c:cool c.b:cool>
actual   =<a.b:cool> <+a.c:cool c.b:cool>
expected =<a.b:cool> <a.c:cool c.b:cool>
actual   =<a.b:cool> <a.c:cool c.b:cool>
expected =<a.b:cool> <a.c:cool c.b:cool>
actual   =<a.b:cool> <a.c:cool c.b:cool>
expected =<a.b:cool> <a.c:cool> <c.b:cool>
actual   =<a.b:cool> <a.c:cool> <c.b:cool>
expected =<a.id_l:[0 TO 2]>
actual   =<a.id_l:[0 TO 2]>
expected =<a.id_d:[0.0 TO 2.0]>
actual   =<a.id_d:[0.0 TO 2.0]>
expected =<a.id_f:[0.0 TO 2.0]>
actual   =<a.id_f:[0.0 TO 2.0]>
expected =<a.id_i:[0 TO 2]>
actual   =<a.id_i:[0 TO 2]>
expected =<super:word1>
actual   =<super:word1>
expected =<super:word1> <super:word2>
actual   =<super:word1> <super:word2>
expected =<f1:word1> <super:word2>
actual   =<f1:word1> <super:word2>
expected =<f1:word1> <super:word2> <super:word3>
actual   =<f1:word1> <super:word2> <super:word3>
expected =<f1:word1> <super:word3> <super:word2>
actual   =<f1:word1> <super:word3> <super:word2>
expected =<f1:word1> +<super:word6> <super:word3> <super:word2>
actual   =<f1:word1> +<super:word6> <super:word3> <super:word2>
expected =+<super:leading> <f1:word1> +<super:word6> <super:word3>
<super:word2>
actual   =+<super:leading> <f1:word1> +<super:word6> <super:word3>
<super:word2>
expected =+<super:leading> +<f1:word1> <super:word6> <super:word3>
<super:word2>
actual   =+<super:leading> +<f1:word1> <super:word6> <super:word3>
<super:word2>
expected =-<super:leading> <f1:word1> +<super:word6> <super:word3>
<super:word2>
actual   =-<super:leading> <f1:word1> +<super:word6> <super:word3>
<super:word2>
expected =<rowid:1>
actual   =<rowid:1>
expected =<a.id_date:[1379030400 TO 1379030400]>
actual   =<a.id_date:[1379030400 TO 1379030400]>
expected =<a.id_date:[1379030400 TO 1384300800]>
actual   =<a.id_date:[1379030400 TO 1384300800]>
expected =<a.id_date:{1379030400 TO 1384300800}>
actual   =<a.id_date:{1379030400 TO 1384300800}>
expected =<rowid:123-456>
actual   =<rowid:123-456>
expected =<family:123-456>
actual   =<family:123-456>
expected =<recordid:123-456>
actual   =<recordid:123-456>
expected =<_default_.bin:cool>
actual   =<_default_.bin:cool>
expected =-<f.c:a> -<f.c:b> _primedoc_:true
actual   =-<f.c:a> -<f.c:b> _primedoc_:true
expected =<-f.c:a *:*> <-f.c:b *:*>
actual   =<-f.c:a *:*> <-f.c:b *:*>
expected =-<-f.c:a *:*> -<-f.c:b *:*> _primedoc_:true
actual   =-<-f.c:a *:*> -<-f.c:b *:*> _primedoc_:true
Tests run: 41, Failures: 0, Errors: 0, Skipped: 0, Time elapsed: 0.472 sec
Running org.apache.blur.lucene.search.SuperQueryTest
doc 0 score 3.5917075
doc 1 score 2.3944716
doc 2 score 0.5986179
doc 0 score 2.3944716
doc 1 score 2.3944716
doc 2 score 0.5986179
doc 0 score 2.0
doc 1 score 2.0
doc 2 score 0.5
doc 0 score 3.261864
doc 1 score 3.1695762
doc 2 score 0.79239404
doc 0 score 3.261864
doc 1 score 3.1695762
doc 2 score 0.79239404
Tests run: 6, Failures: 0, Errors: 0, Skipped: 0, Time elapsed: 0.761 sec
Running org.apache.blur.lucene.serializer.QueryWritableTest
Tests run: 1, Failures: 0, Errors: 0, Skipped: 0, Time elapsed: 0.141 sec

Results :

Tests run: 77, Failures: 0, Errors: 0, Skipped: 0

[JENKINS] Recording test results
[INFO] ------------------------------------------------------------------------
[INFO] Reactor Summary:
[INFO] 
[INFO] Blur .............................................. SUCCESS [35.450s]
[INFO] Blur Util ......................................... SUCCESS [15.805s]
[INFO] Blur Thrift ....................................... SUCCESS [12.703s]
[INFO] Blur Store ........................................ SUCCESS [6:54.026s]
[INFO] Blur Query ........................................ FAILURE [2:14.782s]
[INFO] Blur GUI .......................................... SKIPPED
[INFO] Blur Core ......................................... SKIPPED
[INFO] Blur Console ...................................... SKIPPED
[INFO] Blur Map Reduce Hadoop1 ........................... SKIPPED
[INFO] Blur Shell ........................................ SKIPPED
[INFO] Distribution ...................................... SKIPPED
[INFO] ------------------------------------------------------------------------
[INFO] BUILD FAILURE
[INFO] ------------------------------------------------------------------------
[INFO] Total time: 10:22.832s
[INFO] Finished at: Mon Jul 21 19:22:58 UTC 2014
[INFO] Final Memory: 35M/305M
[INFO] ------------------------------------------------------------------------
Waiting for Jenkins to finish collecting data[ERROR] Failed to execute goal org.apache.maven.plugins:maven-surefire-plugin:2.12.4:test
(default-test) on project blur-query: ExecutionException; nested exception is java.util.concurrent.ExecutionException:
java.lang.RuntimeException: The forked VM terminated without saying properly goodbye. VM crash
or System.exit called ? -> [Help 1]
[ERROR] 
[ERROR] To see the full stack trace of the errors, re-run Maven with the -e switch.
[ERROR] Re-run Maven using the -X switch to enable full debug logging.
[ERROR] 
[ERROR] For more information about the errors and possible solutions, please read the following
articles:
[ERROR] [Help 1] http://cwiki.apache.org/confluence/display/MAVEN/MojoExecutionException
[ERROR] 
[ERROR] After correcting the problems, you can resume the build with the command
[ERROR]   mvn <goals> -rf :blur-query

[JENKINS] Archiving <https://builds.apache.org/job/Blur-master-jdk7/ws/blur-shell/pom.xml>
to org.apache.blur/blur-shell/0.2.3-incubating-hadoop1/blur-shell-0.2.3-incubating-hadoop1.pom
Sending artifact delta relative to Blur-master-jdk7 ? Blur Shell #581
Archived 1 artifacts
Archive block size is 32768
Received 0 blocks and 6033 bytes
Compression is 0.0%
Took 0.21 sec
[JENKINS] Archiving <https://builds.apache.org/job/Blur-master-jdk7/ws/blur-mapred-hadoop1/pom.xml>
to org.apache.blur/blur-mapred-hadoop1/0.2.3-incubating-hadoop1/blur-mapred-hadoop1-0.2.3-incubating-hadoop1.pom
Sending artifact delta relative to Blur-master-jdk7 ? Blur Map Reduce Hadoop1 #581
Archived 1 artifacts
Archive block size is 32768
Received 0 blocks and 6067 bytes
Compression is 0.0%
Took 0.11 sec
[JENKINS] Archiving <https://builds.apache.org/job/Blur-master-jdk7/ws/pom.xml> to org.apache.blur/blur/0.2.3-incubating/blur-0.2.3-incubating.pom
Sending artifact delta relative to Blur-master-jdk7 ? Blur #581
Archived 1 artifacts
Archive block size is 32768
Received 0 blocks and 14271 bytes
Compression is 0.0%
Took 98 ms
[JENKINS] Archiving <https://builds.apache.org/job/Blur-master-jdk7/ws/blur-util/pom.xml>
to org.apache.blur/blur-util/0.2.3-incubating-hadoop1/blur-util-0.2.3-incubating-hadoop1.pom
[JENKINS] Archiving <https://builds.apache.org/job/Blur-master-jdk7/ws/blur-util/target/blur-util-0.2.3-incubating-hadoop1.jar>
to org.apache.blur/blur-util/0.2.3-incubating-hadoop1/blur-util-0.2.3-incubating-hadoop1.jar
[JENKINS] Archiving <https://builds.apache.org/job/Blur-master-jdk7/ws/blur-util/target/blur-util-0.2.3-incubating-hadoop1-tests.jar>
to org.apache.blur/blur-util/0.2.3-incubating-hadoop1/blur-util-0.2.3-incubating-hadoop1-tests.jar
Sending artifact delta relative to Blur-master-jdk7 ? Blur Util #581
Archived 3 artifacts
Archive block size is 32768
Received 0 blocks and 168108 bytes
Compression is 0.0%
Took 0.22 sec
[JENKINS] Archiving <https://builds.apache.org/job/Blur-master-jdk7/ws/distribution/pom.xml>
to org.apache.blur/apache-blur/0.2.3-incubating-hadoop1/apache-blur-0.2.3-incubating-hadoop1.pom
Sending artifact delta relative to Blur-master-jdk7 ? Distribution #581
Archived 1 artifacts
Archive block size is 32768
Received 0 blocks and 4482 bytes
Compression is 0.0%
Took 2.9 sec
[JENKINS] Archiving <https://builds.apache.org/job/Blur-master-jdk7/ws/blur-thrift/pom.xml>
to org.apache.blur/blur-thrift/0.2.3-incubating-hadoop1/blur-thrift-0.2.3-incubating-hadoop1.pom
[JENKINS] Archiving <https://builds.apache.org/job/Blur-master-jdk7/ws/blur-thrift/target/blur-thrift-0.2.3-incubating-hadoop1.jar>
to org.apache.blur/blur-thrift/0.2.3-incubating-hadoop1/blur-thrift-0.2.3-incubating-hadoop1.jar
[JENKINS] Archiving <https://builds.apache.org/job/Blur-master-jdk7/ws/blur-thrift/target/blur-thrift-0.2.3-incubating-hadoop1-tests.jar>
to org.apache.blur/blur-thrift/0.2.3-incubating-hadoop1/blur-thrift-0.2.3-incubating-hadoop1-tests.jar
Sending artifact delta relative to Blur-master-jdk7 ? Blur Thrift #581
Archived 3 artifacts
Archive block size is 32768
Received 0 blocks and 1854591 bytes
Compression is 0.0%
Took 2.4 sec
[JENKINS] Archiving <https://builds.apache.org/job/Blur-master-jdk7/ws/blur-query/pom.xml>
to org.apache.blur/blur-query/0.2.3-incubating-hadoop1/blur-query-0.2.3-incubating-hadoop1.pom
Sending artifact delta relative to Blur-master-jdk7 ? Blur Query #581
Archived 1 artifacts
Archive block size is 32768
Received 0 blocks and 5619 bytes
Compression is 0.0%
Took 0.19 sec
[JENKINS] Archiving <https://builds.apache.org/job/Blur-master-jdk7/ws/blur-store/pom.xml>
to org.apache.blur/blur-store/0.2.3-incubating-hadoop1/blur-store-0.2.3-incubating-hadoop1.pom
[JENKINS] Archiving <https://builds.apache.org/job/Blur-master-jdk7/ws/blur-store/target/blur-store-0.2.3-incubating-hadoop1.jar>
to org.apache.blur/blur-store/0.2.3-incubating-hadoop1/blur-store-0.2.3-incubating-hadoop1.jar
[JENKINS] Archiving <https://builds.apache.org/job/Blur-master-jdk7/ws/blur-store/target/blur-store-0.2.3-incubating-hadoop1-tests.jar>
to org.apache.blur/blur-store/0.2.3-incubating-hadoop1/blur-store-0.2.3-incubating-hadoop1-tests.jar
Sending artifact delta relative to Blur-master-jdk7 ? Blur Store #581
Archived 3 artifacts
Archive block size is 32768
Received 0 blocks and 291985 bytes
Compression is 0.0%
Took 0.19 sec
[JENKINS] Archiving <https://builds.apache.org/job/Blur-master-jdk7/ws/blur-core/pom.xml>
to org.apache.blur/blur-core/0.2.3-incubating-hadoop1/blur-core-0.2.3-incubating-hadoop1.pom
Sending artifact delta relative to Blur-master-jdk7 ? Blur Core #581
Archived 1 artifacts
Archive block size is 32768
Received 0 blocks and 6646 bytes
Compression is 0.0%
Took 1.8 sec
[JENKINS] Archiving <https://builds.apache.org/job/Blur-master-jdk7/ws/blur-gui/pom.xml>
to org.apache.blur/blur-gui/0.2.3-incubating-hadoop1/blur-gui-0.2.3-incubating-hadoop1.pom
Sending artifact delta relative to Blur-master-jdk7 ? Blur GUI #581
Archived 1 artifacts
Archive block size is 32768
Received 0 blocks and 5807 bytes
Compression is 0.0%
Took 0.59 sec
[JENKINS] Archiving <https://builds.apache.org/job/Blur-master-jdk7/ws/blur-console/pom.xml>
to org.apache.blur/blur-console/0.2.3-incubating-hadoop1/blur-console-0.2.3-incubating-hadoop1.pom
Sending artifact delta relative to Blur-master-jdk7 ? Blur Console #581
Archived 1 artifacts
Archive block size is 32768
Received 0 blocks and 12191 bytes
Compression is 0.0%
Took 0.15 sec
Sending e-mails to: blur-dev@incubator.apache.org
channel stopped

Mime
View raw message