incubator-blur-dev mailing list archives

Site index · List index
Message view « Date » · « Thread »
Top « Date » · « Thread »
From Apache Jenkins Server <jenk...@builds.apache.org>
Subject Build failed in Jenkins: Blur-master-jdk7 #524
Date Sat, 05 Jul 2014 07:31:27 GMT
See <https://builds.apache.org/job/Blur-master-jdk7/524/>

------------------------------------------
[...truncated 925 lines...]
55000
55500
56000
56500
57000
57500
58000
58500
59000
59500
60000
60500
61000
61500
62000
62500
63000
63500
64000
64500
65000
65500
66000
66500
67000
67500
68000
68500
69000
69500
70000
70500
71000
71500
72000
72500
73000
73500
74000
74500
75000
75500
76000
76500
77000
77500
78000
78500
79000
79500
80000
80500
81000
81500
82000
82500
83000
83500
84000
84500
85000
85500
86000
86500
87000
87500
88000
88500
89000
89500
90000
90500
91000
91500
92000
92500
93000
93500
94000
94500
95000
95500
96000
96500
97000
97500
98000
98500
99000
99500
done writing
done opening
done fetching
Document<stored,indexed,tokenized,omitNorms,indexOptions=DOCS_ONLY<test:test> stored,indexed,tokenized<test2:test>
stored,indexed,tokenized,omitNorms,indexOptions=DOCS_ONLY<id:2310511a-4953-4bb4-bd81-73550dddbf50>>
done searching
WARN  20140705_07:27:12:586_UTC [main] buffer.BufferStore: Buffer store for size [1,024] already
setup.
WARN  20140705_07:27:12:589_UTC [main] buffer.BufferStore: Buffer store for size [8,192] already
setup.
WARN  20140705_07:27:12:590_UTC [main] buffer.BufferStore: Buffer store for size [1,024] already
setup.
WARN  20140705_07:27:12:590_UTC [main] buffer.BufferStore: Buffer store for size [8,192] already
setup.
Tests run: 3, Failures: 0, Errors: 0, Skipped: 0, Time elapsed: 5.971 sec
Running org.apache.blur.lucene.codec.Blur022CodecTest
22.792065
26.297192
doc1 17416201995
doc2 16678607598
20.136116
21.192855
doc1 16634564153
doc2 16834066912
_1.fdt
13789
_0.fdt
22097
4.174339
2.675587
doc1 14421085
doc2 11528603
0.873066
0.884868
doc1 17943757
doc2 27046018
_1.fdt
134339
_0.fdt
210030
Tests run: 2, Failures: 0, Errors: 0, Skipped: 0, Time elapsed: 1.548 sec
Running org.apache.blur.lucene.warmup.IndexWarmupTest
Killed

Results :

Tests run: 32, Failures: 0, Errors: 0, Skipped: 0

[JENKINS] Recording test results
[INFO] ------------------------------------------------------------------------
[INFO] Reactor Summary:
[INFO] 
[INFO] Blur .............................................. SUCCESS [54.045s]
[INFO] Blur Util ......................................... SUCCESS [24.085s]
[INFO] Blur Thrift ....................................... SUCCESS [12.599s]
[INFO] Blur Store ........................................ FAILURE [4:21.119s]
[INFO] Blur Query ........................................ SKIPPED
[INFO] Blur GUI .......................................... SKIPPED
[INFO] Blur Core ......................................... SKIPPED
[INFO] Blur Console ...................................... SKIPPED
[INFO] Blur Map Reduce Hadoop1 ........................... SKIPPED
[INFO] Blur Shell ........................................ SKIPPED
[INFO] Distribution ...................................... SKIPPED
[INFO] ------------------------------------------------------------------------
[INFO] BUILD FAILURE
[INFO] ------------------------------------------------------------------------
[INFO] Total time: 6:04.949s
[INFO] Finished at: Sat Jul 05 07:29:48 UTC 2014
[INFO] Final Memory: 30M/183M
[INFO] ------------------------------------------------------------------------
Waiting for Jenkins to finish collecting data
[ERROR] Failed to execute goal org.apache.maven.plugins:maven-surefire-plugin:2.12.4:test
(default-test) on project blur-store: ExecutionException; nested exception is java.util.concurrent.ExecutionException:
java.lang.RuntimeException: The forked VM terminated without saying properly goodbye. VM crash
or System.exit called ? -> [Help 1]
[ERROR] 
[ERROR] To see the full stack trace of the errors, re-run Maven with the -e switch.
[ERROR] Re-run Maven using the -X switch to enable full debug logging.
[ERROR] 
[ERROR] For more information about the errors and possible solutions, please read the following
articles:
[ERROR] [Help 1] http://cwiki.apache.org/confluence/display/MAVEN/MojoExecutionException
[ERROR] 
[ERROR] After correcting the problems, you can resume the build with the command
[ERROR]   mvn <goals> -rf :blur-store
[JENKINS] Archiving <https://builds.apache.org/job/Blur-master-jdk7/ws/blur-shell/pom.xml>
to org.apache.blur/blur-shell/0.2.2-incubating-hadoop1/blur-shell-0.2.2-incubating-hadoop1.pom
Sending artifact delta relative to Blur-master-jdk7 ? Blur Shell #523
Archived 1 artifacts
Archive block size is 32768
Received 0 blocks and 5846 bytes
Compression is 0.0%
Took 0.18 sec
[JENKINS] Archiving <https://builds.apache.org/job/Blur-master-jdk7/ws/blur-mapred-hadoop1/pom.xml>
to org.apache.blur/blur-mapred-hadoop1/0.2.2-incubating-hadoop1/blur-mapred-hadoop1-0.2.2-incubating-hadoop1.pom
Sending artifact delta relative to Blur-master-jdk7 ? Blur Map Reduce Hadoop1 #523
Archived 1 artifacts
Archive block size is 32768
Received 0 blocks and 6067 bytes
Compression is 0.0%
Took 1.7 sec
[JENKINS] Archiving <https://builds.apache.org/job/Blur-master-jdk7/ws/pom.xml> to org.apache.blur/blur/0.2.2-incubating/blur-0.2.2-incubating.pom
Sending artifact delta relative to Blur-master-jdk7 ? Blur #523
Archived 1 artifacts
Archive block size is 32768
Received 0 blocks and 14291 bytes
Compression is 0.0%
Took 0.15 sec
[JENKINS] Archiving <https://builds.apache.org/job/Blur-master-jdk7/ws/blur-util/pom.xml>
to org.apache.blur/blur-util/0.2.2-incubating-hadoop1/blur-util-0.2.2-incubating-hadoop1.pom
[JENKINS] Archiving <https://builds.apache.org/job/Blur-master-jdk7/ws/blur-util/target/blur-util-0.2.2-incubating-hadoop1.jar>
to org.apache.blur/blur-util/0.2.2-incubating-hadoop1/blur-util-0.2.2-incubating-hadoop1.jar
[JENKINS] Archiving <https://builds.apache.org/job/Blur-master-jdk7/ws/blur-util/target/blur-util-0.2.2-incubating-hadoop1-tests.jar>
to org.apache.blur/blur-util/0.2.2-incubating-hadoop1/blur-util-0.2.2-incubating-hadoop1-tests.jar
Sending artifact delta relative to Blur-master-jdk7 ? Blur Util #523
Archived 3 artifacts
Archive block size is 32768
Received 0 blocks and 167934 bytes
Compression is 0.0%
Took 0.25 sec
[JENKINS] Archiving <https://builds.apache.org/job/Blur-master-jdk7/ws/distribution/pom.xml>
to org.apache.blur/apache-blur/0.2.2-incubating-hadoop1/apache-blur-0.2.2-incubating-hadoop1.pom
Sending artifact delta relative to Blur-master-jdk7 ? Distribution #523
Archived 1 artifacts
Archive block size is 32768
Received 0 blocks and 4482 bytes
Compression is 0.0%
Took 3 sec
[JENKINS] Archiving <https://builds.apache.org/job/Blur-master-jdk7/ws/blur-thrift/pom.xml>
to org.apache.blur/blur-thrift/0.2.2-incubating-hadoop1/blur-thrift-0.2.2-incubating-hadoop1.pom
[JENKINS] Archiving <https://builds.apache.org/job/Blur-master-jdk7/ws/blur-thrift/target/blur-thrift-0.2.2-incubating-hadoop1.jar>
to org.apache.blur/blur-thrift/0.2.2-incubating-hadoop1/blur-thrift-0.2.2-incubating-hadoop1.jar
[JENKINS] Archiving <https://builds.apache.org/job/Blur-master-jdk7/ws/blur-thrift/target/blur-thrift-0.2.2-incubating-hadoop1-tests.jar>
to org.apache.blur/blur-thrift/0.2.2-incubating-hadoop1/blur-thrift-0.2.2-incubating-hadoop1-tests.jar
Sending artifact delta relative to Blur-master-jdk7 ? Blur Thrift #523
Archived 3 artifacts
Archive block size is 32768
Received 0 blocks and 1854588 bytes
Compression is 0.0%
Took 2.5 sec
[JENKINS] Archiving <https://builds.apache.org/job/Blur-master-jdk7/ws/blur-query/pom.xml>
to org.apache.blur/blur-query/0.2.2-incubating-hadoop1/blur-query-0.2.2-incubating-hadoop1.pom
Sending artifact delta relative to Blur-master-jdk7 ? Blur Query #523
Archived 1 artifacts
Archive block size is 32768
Received 0 blocks and 5619 bytes
Compression is 0.0%
Took 0.27 sec
[JENKINS] Archiving <https://builds.apache.org/job/Blur-master-jdk7/ws/blur-store/pom.xml>
to org.apache.blur/blur-store/0.2.2-incubating-hadoop1/blur-store-0.2.2-incubating-hadoop1.pom
Sending artifact delta relative to Blur-master-jdk7 ? Blur Store #523
Archived 1 artifacts
Archive block size is 32768
Received 0 blocks and 6801 bytes
Compression is 0.0%
Took 1.8 sec
[JENKINS] Archiving <https://builds.apache.org/job/Blur-master-jdk7/ws/blur-core/pom.xml>
to org.apache.blur/blur-core/0.2.2-incubating-hadoop1/blur-core-0.2.2-incubating-hadoop1.pom
Sending artifact delta relative to Blur-master-jdk7 ? Blur Core #523
Archived 1 artifacts
Archive block size is 32768
Received 0 blocks and 6646 bytes
Compression is 0.0%
Took 0.32 sec
[JENKINS] Archiving <https://builds.apache.org/job/Blur-master-jdk7/ws/blur-gui/pom.xml>
to org.apache.blur/blur-gui/0.2.2-incubating-hadoop1/blur-gui-0.2.2-incubating-hadoop1.pom
Sending artifact delta relative to Blur-master-jdk7 ? Blur GUI #523
Archived 1 artifacts
Archive block size is 32768
Received 0 blocks and 5807 bytes
Compression is 0.0%
Took 3.5 sec
[JENKINS] Archiving <https://builds.apache.org/job/Blur-master-jdk7/ws/blur-console/pom.xml>
to org.apache.blur/blur-console/0.2.2-incubating-hadoop1/blur-console-0.2.2-incubating-hadoop1.pom
Sending artifact delta relative to Blur-master-jdk7 ? Blur Console #523
Archived 1 artifacts
Archive block size is 32768
Received 0 blocks and 10582 bytes
Compression is 0.0%
Took 0.22 sec
Sending e-mails to: blur-dev@incubator.apache.org
channel stopped

Mime
View raw message