incubator-blur-dev mailing list archives

Site index · List index
Message view « Date » · « Thread »
Top « Date » · « Thread »
From Apache Jenkins Server <jenk...@builds.apache.org>
Subject Build failed in Jenkins: Blur-master-jdk7 #473
Date Sat, 21 Jun 2014 10:00:22 GMT
See <https://builds.apache.org/job/Blur-master-jdk7/473/>

------------------------------------------
[...truncated 25093 lines...]
	at org.apache.zookeeper.KeeperException.create(KeeperException.java:51)
	at org.apache.zookeeper.ZooKeeper.exists(ZooKeeper.java:1041)
	at org.apache.zookeeper.ZooKeeper.exists(ZooKeeper.java:1069)
	at org.apache.blur.zookeeper.WatchChildren$2.run(WatchChildren.java:143)
	at java.lang.Thread.run(Thread.java:724)
ERROR SimpleUncaughtExceptionHandler - Unknown error in thread [Thread[Watch Children [/blur/clusters/default/tables][b829b8bd-00b8-407f-b2ee-7d261e96e93c],5,main]]
java.lang.RuntimeException: org.apache.zookeeper.KeeperException$ConnectionLossException:
KeeperErrorCode = ConnectionLoss for /blur/clusters/default/tables
	at org.apache.blur.zookeeper.WatchChildren$1.run(WatchChildren.java:116)
	at java.lang.Thread.run(Thread.java:724)
Caused by: org.apache.zookeeper.KeeperException$ConnectionLossException: KeeperErrorCode =
ConnectionLoss for /blur/clusters/default/tables
	at org.apache.zookeeper.KeeperException.create(KeeperException.java:99)
	at org.apache.zookeeper.KeeperException.create(KeeperException.java:51)
	at org.apache.zookeeper.ZooKeeper.getChildren(ZooKeeper.java:1468)
	at org.apache.blur.zookeeper.WatchChildren$1.run(WatchChildren.java:88)
	... 1 more
ERROR SimpleUncaughtExceptionHandler - Unknown error in thread [Thread[Poll Watch Children
[/blur/clusters][7b2dafdf-89df-47f6-a63d-85e87ff312d4],5,main]]
java.lang.RuntimeException: org.apache.zookeeper.KeeperException$ConnectionLossException:
KeeperErrorCode = ConnectionLoss for /blur/clusters
	at org.apache.blur.zookeeper.WatchChildren$2.run(WatchChildren.java:164)
	at java.lang.Thread.run(Thread.java:724)
Caused by: org.apache.zookeeper.KeeperException$ConnectionLossException: KeeperErrorCode =
ConnectionLoss for /blur/clusters
	at org.apache.zookeeper.KeeperException.create(KeeperException.java:99)
	at org.apache.zookeeper.KeeperException.create(KeeperException.java:51)
	at org.apache.zookeeper.ZooKeeper.exists(ZooKeeper.java:1041)
	at org.apache.zookeeper.ZooKeeper.exists(ZooKeeper.java:1069)
	at org.apache.blur.zookeeper.WatchChildren$2.run(WatchChildren.java:143)
	... 1 more
ERROR SimpleUncaughtExceptionHandler - Unknown error in thread [Thread[Watch Children [/blur/clusters][7b2dafdf-89df-47f6-a63d-85e87ff312d4],5,main]]
java.lang.RuntimeException: org.apache.zookeeper.KeeperException$ConnectionLossException:
KeeperErrorCode = ConnectionLoss for /blur/clusters
	at org.apache.blur.zookeeper.WatchChildren$1.run(WatchChildren.java:116)
	at java.lang.Thread.run(Thread.java:724)
Caused by: org.apache.zookeeper.KeeperException$ConnectionLossException: KeeperErrorCode =
ConnectionLoss for /blur/clusters
	at org.apache.zookeeper.KeeperException.create(KeeperException.java:99)
	at org.apache.zookeeper.KeeperException.create(KeeperException.java:51)
	at org.apache.zookeeper.ZooKeeper.getChildren(ZooKeeper.java:1468)
	at org.apache.blur.zookeeper.WatchChildren$1.run(WatchChildren.java:88)
	... 1 more
ERROR SimpleUncaughtExceptionHandler - Unknown error in thread [Thread[Watch Data [/blur/clusters/default/tables/tableUnitTable][532063f4-56a9-43ef-9504-6548b33a34c7],5,main]]
java.lang.RuntimeException: org.apache.zookeeper.KeeperException$ConnectionLossException:
KeeperErrorCode = ConnectionLoss for /blur/clusters/default/tables/tableUnitTable
	at org.apache.blur.zookeeper.WatchNodeData$1.run(WatchNodeData.java:93)
	at java.lang.Thread.run(Thread.java:724)
Caused by: org.apache.zookeeper.KeeperException$ConnectionLossException: KeeperErrorCode =
ConnectionLoss for /blur/clusters/default/tables/tableUnitTable
	at org.apache.zookeeper.KeeperException.create(KeeperException.java:99)
	at org.apache.zookeeper.KeeperException.create(KeeperException.java:51)
	at org.apache.zookeeper.ZooKeeper.exists(ZooKeeper.java:1041)
	at org.apache.zookeeper.ZooKeeper.exists(ZooKeeper.java:1069)
	at org.apache.blur.zookeeper.WatchNodeData$1.run(WatchNodeData.java:74)
	... 1 more
ERROR SimpleUncaughtExceptionHandler - Unknown error in thread [Thread[Poll Watch Children
[/blur/clusters/default/tables][b829b8bd-00b8-407f-b2ee-7d261e96e93c],5,main]]
java.lang.RuntimeException: org.apache.zookeeper.KeeperException$ConnectionLossException:
KeeperErrorCode = ConnectionLoss for /blur/clusters/default/tables
	at org.apache.blur.zookeeper.WatchChildren$2.run(WatchChildren.java:164)
	at java.lang.Thread.run(Thread.java:724)
Caused by: org.apache.zookeeper.KeeperException$ConnectionLossException: KeeperErrorCode =
ConnectionLoss for /blur/clusters/default/tables
	at org.apache.zookeeper.KeeperException.create(KeeperException.java:99)
	at org.apache.zookeeper.KeeperException.create(KeeperException.java:51)
	at org.apache.zookeeper.ZooKeeper.exists(ZooKeeper.java:1041)
	at org.apache.zookeeper.ZooKeeper.exists(ZooKeeper.java:1069)
	at org.apache.blur.zookeeper.WatchChildren$2.run(WatchChildren.java:143)
	... 1 more
Tests run: 11, Failures: 0, Errors: 0, Skipped: 0, Time elapsed: 33.798 sec

Results :

Tests run: 11, Failures: 0, Errors: 0, Skipped: 0

[JENKINS] Recording test results
[INFO] 
[INFO] --- maven-jar-plugin:2.4:jar (default-jar) @ blur-console ---
[INFO] Building jar: <https://builds.apache.org/job/Blur-master-jdk7/ws/blur-console/target/blur-console-0.2.2-incubating-hadoop1.jar>
[INFO] 
[INFO] --- maven-assembly-plugin:2.2.1:single (make-assembly) @ blur-console ---
[INFO] Reading assembly descriptor: src/assemble/webapp.xml
[INFO] Building jar: <https://builds.apache.org/job/Blur-master-jdk7/ws/blur-console/target/blur-console-0.2.2-incubating-hadoop1-webapp.jar>
[INFO] 
[INFO] --- maven-site-plugin:3.3:attach-descriptor (attach-descriptor) @ blur-console ---
[INFO] 
[INFO] --- apache-rat-plugin:0.10:check (default) @ blur-console ---
[INFO] 51 implicit excludes (use -debug for more details).
[INFO] Exclude: LICENSE
[INFO] Exclude: CHANGES.txt
[INFO] Exclude: DISCLAIMER
[INFO] Exclude: NOTICE
[INFO] Exclude: README
[INFO] Exclude: **/README.textile
[INFO] Exclude: **/README.md
[INFO] Exclude: **/.classpath
[INFO] Exclude: **/.project
[INFO] Exclude: **/.settings/**
[INFO] Exclude: **/.idea/**
[INFO] Exclude: **/*.iml
[INFO] Exclude: **/target/**
[INFO] Exclude: **/build/**
[INFO] Exclude: **/.codio
[INFO] Exclude: **/src/main/webapp/libs/**
[INFO] Exclude: **/src/main/webapp/css/**
[INFO] Exclude: **/src/main/webapp/js/utils/*
[INFO] Exclude: **/src/main/webapp/public/js/modernizr.js
[INFO] Exclude: **/src/main/webapp/public/css/*.map
[INFO] Exclude: **/src/main/webapp/public/css/glyphicons*
[INFO] Exclude: **/src/main/webapp/node_modules/**
[INFO] Exclude: **/src/main/webapp/.sass-cache/**
[INFO] Exclude: **/src/main/webapp/.tmp/**
[INFO] Exclude: **/.bowerrc
[INFO] Exclude: **/.editorconfig
[INFO] Exclude: **/.jshintrc
[INFO] Exclude: **/package.json
[INFO] Exclude: **/bower.json
[INFO] Exclude: **/src/main/scripts/grunt.sh
[INFO] Exclude: contrib/blur-console-v1/**
[INFO] Exclude: **/src/main/resources/org/apache/blur/thrift/util/words.txt
[INFO] Exclude: **/src/main/webapp/js/d3.v2.js
[INFO] Exclude: **/src/main/webapp/js/d3.v2.min.js
[INFO] Exclude: **/src/main/resources*/license-notes.txt
[INFO] Exclude: **/src/main/resources*/NOTICE-bin.base.txt
[INFO] Exclude: **/src/main/resources*/NOTICE-bin.txt
[INFO] Exclude: **/src/main/resources*/notices/*.src
[INFO] Exclude: **/src/main/scripts/conf/controllers
[INFO] Exclude: **/src/main/scripts/conf/consoles
[INFO] Exclude: **/src/main/scripts/conf/default_zoo.cfg
[INFO] Exclude: **/src/main/scripts/conf/shards
[INFO] Exclude: **/src/main/scripts/conf/zookeepers
[INFO] Exclude: **/src/main/scripts/interface/gen-html/Blur.html
[INFO] Exclude: **/src/main/scripts/interface/gen-html/index.html
[INFO] Exclude: **/.empty
[INFO] 165 resources included (use -debug for more details)
[INFO] Rat check: Summary of files. Unapproved: 2 unknown: 2 generated: 0 approved: 64 licence.
[INFO] ------------------------------------------------------------------------
[INFO] Reactor Summary:
[INFO] 
[INFO] Blur .............................................. SUCCESS [47.387s]
[INFO] Blur Util ......................................... SUCCESS [21.213s]
[INFO] Blur Thrift ....................................... SUCCESS [14.558s]
[INFO] Blur Store ........................................ SUCCESS [6:54.354s]
[INFO] Blur Query ........................................ SUCCESS [5:11.133s]
[INFO] Blur GUI .......................................... SUCCESS [11.042s]
[INFO] Blur Core ......................................... SUCCESS [6:50.439s]
[INFO] Blur Console ...................................... FAILURE [1:31.674s]
[INFO] Blur Map Reduce Hadoop1 ........................... SKIPPED
[INFO] Blur Shell ........................................ SKIPPED
[INFO] Distribution ...................................... SKIPPED
[INFO] ------------------------------------------------------------------------
[INFO] BUILD FAILURE
[INFO] ------------------------------------------------------------------------
[INFO] Total time: 22:17.271s
[INFO] Finished at: Sat Jun 21 09:59:07 UTC 2014
[INFO] Final Memory: 38M/214M
[INFO] ------------------------------------------------------------------------
Waiting for Jenkins to finish collecting data
[ERROR] Failed to execute goal org.apache.rat:apache-rat-plugin:0.10:check (default) on project
blur-console: Too many files with unapproved license: 2 See RAT report in: <https://builds.apache.org/job/Blur-master-jdk7/ws/blur-console/target/rat.txt>
-> [Help 1]
[ERROR] 
[ERROR] To see the full stack trace of the errors, re-run Maven with the -e switch.
[ERROR] Re-run Maven using the -X switch to enable full debug logging.
[ERROR] 
[ERROR] For more information about the errors and possible solutions, please read the following
articles:
[ERROR] [Help 1] http://cwiki.apache.org/confluence/display/MAVEN/MojoFailureException
[ERROR] 
[ERROR] After correcting the problems, you can resume the build with the command
[ERROR]   mvn <goals> -rf :blur-console
[JENKINS] Archiving <https://builds.apache.org/job/Blur-master-jdk7/ws/blur-shell/pom.xml>
to org.apache.blur/blur-shell/0.2.2-incubating-hadoop1/blur-shell-0.2.2-incubating-hadoop1.pom
Sending artifact delta relative to Blur-master-jdk7 ? Blur Shell #467
Archived 1 artifacts
Archive block size is 32768
Received 0 blocks and 5207 bytes
Compression is 0.0%
Took 0.21 sec
[JENKINS] Archiving <https://builds.apache.org/job/Blur-master-jdk7/ws/blur-mapred-hadoop1/pom.xml>
to org.apache.blur/blur-mapred-hadoop1/0.2.2-incubating-hadoop1/blur-mapred-hadoop1-0.2.2-incubating-hadoop1.pom
Sending artifact delta relative to Blur-master-jdk7 ? Blur Map Reduce Hadoop1 #467
Archived 1 artifacts
Archive block size is 32768
Received 0 blocks and 5137 bytes
Compression is 0.0%
Took 0.17 sec
[JENKINS] Archiving <https://builds.apache.org/job/Blur-master-jdk7/ws/pom.xml> to org.apache.blur/blur/0.2.2-incubating/blur-0.2.2-incubating.pom
Sending artifact delta relative to Blur-master-jdk7 ? Blur #472
Archived 1 artifacts
Archive block size is 32768
Received 0 blocks and 13981 bytes
Compression is 0.0%
Took 2.4 sec
[JENKINS] Archiving <https://builds.apache.org/job/Blur-master-jdk7/ws/blur-util/pom.xml>
to org.apache.blur/blur-util/0.2.2-incubating-hadoop1/blur-util-0.2.2-incubating-hadoop1.pom
[JENKINS] Archiving <https://builds.apache.org/job/Blur-master-jdk7/ws/blur-util/target/blur-util-0.2.2-incubating-hadoop1.jar>
to org.apache.blur/blur-util/0.2.2-incubating-hadoop1/blur-util-0.2.2-incubating-hadoop1.jar
[JENKINS] Archiving <https://builds.apache.org/job/Blur-master-jdk7/ws/blur-util/target/blur-util-0.2.2-incubating-hadoop1-tests.jar>
to org.apache.blur/blur-util/0.2.2-incubating-hadoop1/blur-util-0.2.2-incubating-hadoop1-tests.jar
Sending artifact delta relative to Blur-master-jdk7 ? Blur Util #472
Archived 3 artifacts
Archive block size is 32768
Received 0 blocks and 167654 bytes
Compression is 0.0%
Took 2.6 sec
[JENKINS] Archiving <https://builds.apache.org/job/Blur-master-jdk7/ws/distribution/pom.xml>
to org.apache.blur/apache-blur/0.2.2-incubating-hadoop1/apache-blur-0.2.2-incubating-hadoop1.pom
Sending artifact delta relative to Blur-master-jdk7 ? Distribution #467
Archived 1 artifacts
Archive block size is 32768
Received 0 blocks and 3947 bytes
Compression is 0.0%
Took 2.9 sec
[JENKINS] Archiving <https://builds.apache.org/job/Blur-master-jdk7/ws/blur-thrift/pom.xml>
to org.apache.blur/blur-thrift/0.2.2-incubating-hadoop1/blur-thrift-0.2.2-incubating-hadoop1.pom
[JENKINS] Archiving <https://builds.apache.org/job/Blur-master-jdk7/ws/blur-thrift/target/blur-thrift-0.2.2-incubating-hadoop1.jar>
to org.apache.blur/blur-thrift/0.2.2-incubating-hadoop1/blur-thrift-0.2.2-incubating-hadoop1.jar
[JENKINS] Archiving <https://builds.apache.org/job/Blur-master-jdk7/ws/blur-thrift/target/blur-thrift-0.2.2-incubating-hadoop1-tests.jar>
to org.apache.blur/blur-thrift/0.2.2-incubating-hadoop1/blur-thrift-0.2.2-incubating-hadoop1-tests.jar
Sending artifact delta relative to Blur-master-jdk7 ? Blur Thrift #472
Archived 3 artifacts
Archive block size is 32768
Received 0 blocks and 1852253 bytes
Compression is 0.0%
Took 5.6 sec
[JENKINS] Archiving <https://builds.apache.org/job/Blur-master-jdk7/ws/blur-query/pom.xml>
to org.apache.blur/blur-query/0.2.2-incubating-hadoop1/blur-query-0.2.2-incubating-hadoop1.pom
[JENKINS] Archiving <https://builds.apache.org/job/Blur-master-jdk7/ws/blur-query/target/blur-query-0.2.2-incubating-hadoop1.jar>
to org.apache.blur/blur-query/0.2.2-incubating-hadoop1/blur-query-0.2.2-incubating-hadoop1.jar
[JENKINS] Archiving <https://builds.apache.org/job/Blur-master-jdk7/ws/blur-query/target/blur-query-0.2.2-incubating-hadoop1-tests.jar>
to org.apache.blur/blur-query/0.2.2-incubating-hadoop1/blur-query-0.2.2-incubating-hadoop1-tests.jar
Sending artifact delta relative to Blur-master-jdk7 ? Blur Query #472
Archived 3 artifacts
Archive block size is 32768
Received 0 blocks and 221369 bytes
Compression is 0.0%
Took 0.46 sec
[JENKINS] Archiving <https://builds.apache.org/job/Blur-master-jdk7/ws/blur-store/pom.xml>
to org.apache.blur/blur-store/0.2.2-incubating-hadoop1/blur-store-0.2.2-incubating-hadoop1.pom
[JENKINS] Archiving <https://builds.apache.org/job/Blur-master-jdk7/ws/blur-store/target/blur-store-0.2.2-incubating-hadoop1.jar>
to org.apache.blur/blur-store/0.2.2-incubating-hadoop1/blur-store-0.2.2-incubating-hadoop1.jar
[JENKINS] Archiving <https://builds.apache.org/job/Blur-master-jdk7/ws/blur-store/target/blur-store-0.2.2-incubating-hadoop1-tests.jar>
to org.apache.blur/blur-store/0.2.2-incubating-hadoop1/blur-store-0.2.2-incubating-hadoop1-tests.jar
Sending artifact delta relative to Blur-master-jdk7 ? Blur Store #472
Archived 3 artifacts
Archive block size is 32768
Received 0 blocks and 290953 bytes
Compression is 0.0%
Took 0.54 sec
[JENKINS] Archiving <https://builds.apache.org/job/Blur-master-jdk7/ws/blur-core/pom.xml>
to org.apache.blur/blur-core/0.2.2-incubating-hadoop1/blur-core-0.2.2-incubating-hadoop1.pom
[JENKINS] Archiving <https://builds.apache.org/job/Blur-master-jdk7/ws/blur-core/target/blur-core-0.2.2-incubating-hadoop1.jar>
to org.apache.blur/blur-core/0.2.2-incubating-hadoop1/blur-core-0.2.2-incubating-hadoop1.jar
[JENKINS] Archiving <https://builds.apache.org/job/Blur-master-jdk7/ws/blur-core/target/blur-core-0.2.2-incubating-hadoop1-tests.jar>
to org.apache.blur/blur-core/0.2.2-incubating-hadoop1/blur-core-0.2.2-incubating-hadoop1-tests.jar
Sending artifact delta relative to Blur-master-jdk7 ? Blur Core #472
Archived 3 artifacts
Archive block size is 32768
Received 0 blocks and 631598 bytes
Compression is 0.0%
Took 5.2 sec
[JENKINS] Archiving <https://builds.apache.org/job/Blur-master-jdk7/ws/blur-gui/pom.xml>
to org.apache.blur/blur-gui/0.2.2-incubating-hadoop1/blur-gui-0.2.2-incubating-hadoop1.pom
[JENKINS] Archiving <https://builds.apache.org/job/Blur-master-jdk7/ws/blur-gui/target/blur-gui-0.2.2-incubating-hadoop1.war>
to org.apache.blur/blur-gui/0.2.2-incubating-hadoop1/blur-gui-0.2.2-incubating-hadoop1.war
Sending artifact delta relative to Blur-master-jdk7 ? Blur GUI #472
Archived 2 artifacts
Archive block size is 32768
Received 778 blocks and 4261289 bytes
Compression is 85.7%
Took 8.2 sec
[JENKINS] Archiving <https://builds.apache.org/job/Blur-master-jdk7/ws/blur-console/pom.xml>
to org.apache.blur/blur-console/0.2.2-incubating-hadoop1/blur-console-0.2.2-incubating-hadoop1.pom
[JENKINS] Archiving <https://builds.apache.org/job/Blur-master-jdk7/ws/blur-console/target/blur-console-0.2.2-incubating-hadoop1.jar>
to org.apache.blur/blur-console/0.2.2-incubating-hadoop1/blur-console-0.2.2-incubating-hadoop1.jar
[JENKINS] Archiving <https://builds.apache.org/job/Blur-master-jdk7/ws/blur-console/target/blur-console-0.2.2-incubating-hadoop1-webapp.jar>
to org.apache.blur/blur-console/0.2.2-incubating-hadoop1/blur-console-0.2.2-incubating-hadoop1-webapp.jar
Sending artifact delta relative to Blur-master-jdk7 ? Blur Console #467
Archived 3 artifacts
Archive block size is 32768
Received 1 blocks and 561625 bytes
Compression is 5.5%
Took 0.53 sec
Sending e-mails to: blur-dev@incubator.apache.org
channel stopped

Mime
View raw message