incubator-blur-dev mailing list archives

Site index · List index
Message view « Date » · « Thread »
Top « Date » · « Thread »
From Apache Jenkins Server <jenk...@builds.apache.org>
Subject Build failed in Jenkins: Blur-master-jdk7 » Blur Console #461
Date Tue, 17 Jun 2014 21:15:03 GMT
See <https://builds.apache.org/job/Blur-master-jdk7/org.apache.blur$blur-console/461/changes>

Changes:

[amccurry] Moving blur console to the root of the project.

[amccurry] Making some changes so that the blur-console artifact can be produced without the
need to have all the webapp dev tools installed.

[amccurry] To turn on the development environment for blur console you will have to export
BLUR_CONSOLE_DEV=true into your development env.

------------------------------------------
[...truncated 628 lines...]
WARN  BlurQueryChecker - Number of rows/records requested to be fetched [150] is greater than
the minimum number of results [1]
WARN  BlurQueryChecker - Number of rows/records requested to be fetched [150] is greater than
the minimum number of results [1]
WARN  WatchChildren - Closing [13713ece-4b91-4e76-8b61-3d2f50d578b2]
WARN  WatchChildren - Closing [c86588f9-b37c-48e0-8eb5-e9101581d2d2]
WARN  WatchChildren - Closing [3ced5aea-a418-44fc-b5f1-2916b31539ac]
WARN  WatchChildren - Closing [b3415c42-532e-4675-9dbb-c17234019992]
WARN  WatchChildren - Closing [1122b228-4b8b-4e6c-8074-eb99b9984efb]
WARN  WatchChildren - Closing [27ca1f89-84dc-4ace-96eb-bdaa45fe71b4]
WARN  WatchChildren - Closing [44f589e5-fe87-41ca-8e45-49edb215886a]
WARN  WatchChildren - Closing [5af70c26-cf6f-40f6-8851-b87068c6ffbd]
WARN  WatchChildren - Closing [1443e823-87c5-4649-9b85-d4e876162792]
WARN  WatchChildren - Closing [c0b23ecd-f313-4890-b891-922e60ed7511]
WARN  WatchChildren - Closing [5fd2317f-0256-423c-81e6-2ad652d23082]
WARN  WatchChildren - Closing [f11d909a-2beb-4b2d-9af3-990c7b5ad0c6]
WARN  WatchNodeExistance - Closing [82136f44-8fdb-4223-a2ba-b88671845a89]
WARN  WatchChildren - Closing [2b97dcca-32f5-40e5-a813-4498d846cc12]
WARN  WatchChildren - Closing [a07e83d9-3c7b-489b-82e6-a7d4e662df0d]
WARN  WatchChildren - Closing [d02e5ccb-9bfd-4c72-8ddb-40f955a239e9]
WARN  WatchChildren - Closing [88d06598-443a-42a2-b625-98ba73ad1369]
WARN  WatchChildren - Closing [98d3eff8-f41f-498b-96ac-49752d190411]
WARN  WatchChildren - Closing [adb568ce-0472-4823-8d18-297f14692aba]
WARN  WatchNodeExistance - Closing [b6f26fce-4c5e-452e-a076-73ec01df1231]
WARN  WatchChildren - Closing [d069a4c1-b315-4683-a4c8-05845aea4c20]
WARN  WatchChildren - Closing [789990cf-07c0-4a02-bee7-e197025d5d49]
WARN  WatchChildren - Closing [5181c90a-7128-4e35-9759-890211ba7a7b]
Shutting down the Mini HDFS Cluster
Shutting down DataNode 0
WARN  MBeanRegistry - Failed to unregister MBean InMemoryDataTree
WARN  MBeanRegistry - Error during unregister
javax.management.InstanceNotFoundException: org.apache.ZooKeeperService:name0=StandaloneServer_port-1,name1=InMemoryDataTree
	at com.sun.jmx.interceptor.DefaultMBeanServerInterceptor.getMBean(DefaultMBeanServerInterceptor.java:1095)
	at com.sun.jmx.interceptor.DefaultMBeanServerInterceptor.exclusiveUnregisterMBean(DefaultMBeanServerInterceptor.java:427)
	at com.sun.jmx.interceptor.DefaultMBeanServerInterceptor.unregisterMBean(DefaultMBeanServerInterceptor.java:415)
	at com.sun.jmx.mbeanserver.JmxMBeanServer.unregisterMBean(JmxMBeanServer.java:546)
	at org.apache.zookeeper.jmx.MBeanRegistry.unregister(MBeanRegistry.java:115)
	at org.apache.zookeeper.jmx.MBeanRegistry.unregister(MBeanRegistry.java:132)
	at org.apache.zookeeper.server.ZooKeeperServer.unregisterJMX(ZooKeeperServer.java:443)
	at org.apache.zookeeper.server.ZooKeeperServer.shutdown(ZooKeeperServer.java:436)
	at org.apache.zookeeper.server.ZooKeeperServerMain.runFromConfig(ZooKeeperServerMain.java:115)
	at org.apache.blur.zookeeper.ZkMiniCluster$2.run(ZkMiniCluster.java:151)
	at java.lang.Thread.run(Thread.java:724)
WARN  DataNode - DatanodeRegistration(127.0.0.1:48996, storageID=DS-214617318-67.195.138.8-48996-1403039649760,
infoPort=37199, ipcPort=58705):DataXceiveServer:java.nio.channels.AsynchronousCloseException
	at java.nio.channels.spi.AbstractInterruptibleChannel.end(AbstractInterruptibleChannel.java:205)
	at sun.nio.ch.ServerSocketChannelImpl.accept(ServerSocketChannelImpl.java:248)
	at sun.nio.ch.ServerSocketAdaptor.accept(ServerSocketAdaptor.java:100)
	at org.apache.hadoop.hdfs.server.datanode.DataXceiverServer.run(DataXceiverServer.java:132)
	at java.lang.Thread.run(Thread.java:724)

WARN  MBeans - Hadoop:service=DataNode,name=DataNodeInfo
javax.management.InstanceNotFoundException: Hadoop:service=DataNode,name=DataNodeInfo
	at com.sun.jmx.interceptor.DefaultMBeanServerInterceptor.getMBean(DefaultMBeanServerInterceptor.java:1095)
	at com.sun.jmx.interceptor.DefaultMBeanServerInterceptor.exclusiveUnregisterMBean(DefaultMBeanServerInterceptor.java:427)
	at com.sun.jmx.interceptor.DefaultMBeanServerInterceptor.unregisterMBean(DefaultMBeanServerInterceptor.java:415)
	at com.sun.jmx.mbeanserver.JmxMBeanServer.unregisterMBean(JmxMBeanServer.java:546)
	at org.apache.hadoop.metrics2.util.MBeans.unregister(MBeans.java:71)
	at org.apache.hadoop.hdfs.server.datanode.DataNode.unRegisterMXBean(DataNode.java:586)
	at org.apache.hadoop.hdfs.server.datanode.DataNode.shutdown(DataNode.java:855)
	at org.apache.hadoop.hdfs.server.datanode.DataNode.run(DataNode.java:1601)
	at java.lang.Thread.run(Thread.java:724)
WARN  MBeans - Hadoop:service=DataNode,name=FSDatasetState-UndefinedStorageId1963313475
javax.management.InstanceNotFoundException: Hadoop:service=DataNode,name=FSDatasetState-UndefinedStorageId1963313475
	at com.sun.jmx.interceptor.DefaultMBeanServerInterceptor.getMBean(DefaultMBeanServerInterceptor.java:1095)
	at com.sun.jmx.interceptor.DefaultMBeanServerInterceptor.exclusiveUnregisterMBean(DefaultMBeanServerInterceptor.java:427)
	at com.sun.jmx.interceptor.DefaultMBeanServerInterceptor.unregisterMBean(DefaultMBeanServerInterceptor.java:415)
	at com.sun.jmx.mbeanserver.JmxMBeanServer.unregisterMBean(JmxMBeanServer.java:546)
	at org.apache.hadoop.metrics2.util.MBeans.unregister(MBeans.java:71)
	at org.apache.hadoop.hdfs.server.datanode.FSDataset.shutdown(FSDataset.java:2093)
	at org.apache.hadoop.hdfs.server.datanode.DataNode.shutdown(DataNode.java:917)
	at org.apache.hadoop.hdfs.MiniDFSCluster.shutdownDataNodes(MiniDFSCluster.java:568)
	at org.apache.hadoop.hdfs.MiniDFSCluster.shutdown(MiniDFSCluster.java:552)
	at org.apache.blur.MiniCluster.shutdownDfs(MiniCluster.java:442)
	at org.apache.blur.MiniCluster.shutdownBlurCluster(MiniCluster.java:173)
	at sun.reflect.NativeMethodAccessorImpl.invoke0(Native Method)
	at sun.reflect.NativeMethodAccessorImpl.invoke(NativeMethodAccessorImpl.java:57)
	at sun.reflect.DelegatingMethodAccessorImpl.invoke(DelegatingMethodAccessorImpl.java:43)
	at java.lang.reflect.Method.invoke(Method.java:606)
	at org.apache.blur.console.util.Config.shutdownMiniCluster(Config.java:118)
	at org.apache.blur.console.ConsoleTestBase.shutdown(ConsoleTestBase.java:37)
	at sun.reflect.NativeMethodAccessorImpl.invoke0(Native Method)
	at sun.reflect.NativeMethodAccessorImpl.invoke(NativeMethodAccessorImpl.java:57)
	at sun.reflect.DelegatingMethodAccessorImpl.invoke(DelegatingMethodAccessorImpl.java:43)
	at java.lang.reflect.Method.invoke(Method.java:606)
	at org.junit.runners.model.FrameworkMethod$1.runReflectiveCall(FrameworkMethod.java:44)
	at org.junit.internal.runners.model.ReflectiveCallable.run(ReflectiveCallable.java:15)
	at org.junit.runners.model.FrameworkMethod.invokeExplosively(FrameworkMethod.java:41)
	at org.junit.internal.runners.statements.RunAfters.evaluate(RunAfters.java:37)
	at org.junit.runners.ParentRunner.run(ParentRunner.java:236)
	at org.apache.maven.surefire.junit4.JUnit4Provider.execute(JUnit4Provider.java:252)
	at org.apache.maven.surefire.junit4.JUnit4Provider.executeTestSet(JUnit4Provider.java:141)
	at org.apache.maven.surefire.junit4.JUnit4Provider.invoke(JUnit4Provider.java:112)
	at sun.reflect.NativeMethodAccessorImpl.invoke0(Native Method)
	at sun.reflect.NativeMethodAccessorImpl.invoke(NativeMethodAccessorImpl.java:57)
	at sun.reflect.DelegatingMethodAccessorImpl.invoke(DelegatingMethodAccessorImpl.java:43)
	at java.lang.reflect.Method.invoke(Method.java:606)
	at org.apache.maven.surefire.util.ReflectionUtils.invokeMethodWithArray(ReflectionUtils.java:189)
	at org.apache.maven.surefire.booter.ProviderFactory$ProviderProxy.invoke(ProviderFactory.java:165)
	at org.apache.maven.surefire.booter.ProviderFactory.invokeProvider(ProviderFactory.java:85)
	at org.apache.maven.surefire.booter.ForkedBooter.runSuitesInProcess(ForkedBooter.java:115)
	at org.apache.maven.surefire.booter.ForkedBooter.main(ForkedBooter.java:75)
WARN  FSDatasetAsyncDiskService - AsyncDiskService has already shut down.
WARN  FSNamesystem - ReplicationMonitor thread received InterruptedExceptionjava.lang.InterruptedException:
sleep interrupted
Tests run: 2, Failures: 2, Errors: 0, Skipped: 0, Time elapsed: 19.533 sec <<< FAILURE!
testGetQueries(org.apache.blur.console.util.QueryUtilTest)  Time elapsed: 4.639 sec  <<<
FAILURE!
java.lang.AssertionError: expected:<2> but was:<1>
	at org.junit.Assert.fail(Assert.java:91)
	at org.junit.Assert.failNotEquals(Assert.java:645)
	at org.junit.Assert.assertEquals(Assert.java:126)
	at org.junit.Assert.assertEquals(Assert.java:470)
	at org.junit.Assert.assertEquals(Assert.java:454)
	at org.apache.blur.console.util.QueryUtilTest.testGetQueries(QueryUtilTest.java:96)
	at sun.reflect.NativeMethodAccessorImpl.invoke0(Native Method)
	at sun.reflect.NativeMethodAccessorImpl.invoke(NativeMethodAccessorImpl.java:57)
	at sun.reflect.DelegatingMethodAccessorImpl.invoke(DelegatingMethodAccessorImpl.java:43)
	at java.lang.reflect.Method.invoke(Method.java:606)
	at org.junit.runners.model.FrameworkMethod$1.runReflectiveCall(FrameworkMethod.java:44)
	at org.junit.internal.runners.model.ReflectiveCallable.run(ReflectiveCallable.java:15)
	at org.junit.runners.model.FrameworkMethod.invokeExplosively(FrameworkMethod.java:41)
	at org.junit.internal.runners.statements.InvokeMethod.evaluate(InvokeMethod.java:20)
	at org.junit.internal.runners.statements.RunBefores.evaluate(RunBefores.java:28)
	at org.junit.runners.BlockJUnit4ClassRunner.runChild(BlockJUnit4ClassRunner.java:76)
	at org.junit.runners.BlockJUnit4ClassRunner.runChild(BlockJUnit4ClassRunner.java:50)
	at org.junit.runners.ParentRunner$3.run(ParentRunner.java:193)
	at org.junit.runners.ParentRunner$1.schedule(ParentRunner.java:52)
	at org.junit.runners.ParentRunner.runChildren(ParentRunner.java:191)
	at org.junit.runners.ParentRunner.access$000(ParentRunner.java:42)
	at org.junit.runners.ParentRunner$2.evaluate(ParentRunner.java:184)
	at org.junit.internal.runners.statements.RunBefores.evaluate(RunBefores.java:28)
	at org.junit.internal.runners.statements.RunAfters.evaluate(RunAfters.java:31)
	at org.junit.runners.ParentRunner.run(ParentRunner.java:236)
	at org.apache.maven.surefire.junit4.JUnit4Provider.execute(JUnit4Provider.java:252)
	at org.apache.maven.surefire.junit4.JUnit4Provider.executeTestSet(JUnit4Provider.java:141)
	at org.apache.maven.surefire.junit4.JUnit4Provider.invoke(JUnit4Provider.java:112)
	at sun.reflect.NativeMethodAccessorImpl.invoke0(Native Method)
	at sun.reflect.NativeMethodAccessorImpl.invoke(NativeMethodAccessorImpl.java:57)
	at sun.reflect.DelegatingMethodAccessorImpl.invoke(DelegatingMethodAccessorImpl.java:43)
	at java.lang.reflect.Method.invoke(Method.java:606)
	at org.apache.maven.surefire.util.ReflectionUtils.invokeMethodWithArray(ReflectionUtils.java:189)
	at org.apache.maven.surefire.booter.ProviderFactory$ProviderProxy.invoke(ProviderFactory.java:165)
	at org.apache.maven.surefire.booter.ProviderFactory.invokeProvider(ProviderFactory.java:85)
	at org.apache.maven.surefire.booter.ForkedBooter.runSuitesInProcess(ForkedBooter.java:115)
	at org.apache.maven.surefire.booter.ForkedBooter.main(ForkedBooter.java:75)

testGetCurrentQueryCount(org.apache.blur.console.util.QueryUtilTest)  Time elapsed: 0.015
sec  <<< FAILURE!
java.lang.AssertionError: expected:<1> but was:<2>
	at org.junit.Assert.fail(Assert.java:91)
	at org.junit.Assert.failNotEquals(Assert.java:645)
	at org.junit.Assert.assertEquals(Assert.java:126)
	at org.junit.Assert.assertEquals(Assert.java:470)
	at org.junit.Assert.assertEquals(Assert.java:454)
	at org.apache.blur.console.util.QueryUtilTest.testGetCurrentQueryCount(QueryUtilTest.java:79)
	at sun.reflect.NativeMethodAccessorImpl.invoke0(Native Method)
	at sun.reflect.NativeMethodAccessorImpl.invoke(NativeMethodAccessorImpl.java:57)
	at sun.reflect.DelegatingMethodAccessorImpl.invoke(DelegatingMethodAccessorImpl.java:43)
	at java.lang.reflect.Method.invoke(Method.java:606)
	at org.junit.runners.model.FrameworkMethod$1.runReflectiveCall(FrameworkMethod.java:44)
	at org.junit.internal.runners.model.ReflectiveCallable.run(ReflectiveCallable.java:15)
	at org.junit.runners.model.FrameworkMethod.invokeExplosively(FrameworkMethod.java:41)
	at org.junit.internal.runners.statements.InvokeMethod.evaluate(InvokeMethod.java:20)
	at org.junit.internal.runners.statements.RunBefores.evaluate(RunBefores.java:28)
	at org.junit.runners.BlockJUnit4ClassRunner.runChild(BlockJUnit4ClassRunner.java:76)
	at org.junit.runners.BlockJUnit4ClassRunner.runChild(BlockJUnit4ClassRunner.java:50)
	at org.junit.runners.ParentRunner$3.run(ParentRunner.java:193)
	at org.junit.runners.ParentRunner$1.schedule(ParentRunner.java:52)
	at org.junit.runners.ParentRunner.runChildren(ParentRunner.java:191)
	at org.junit.runners.ParentRunner.access$000(ParentRunner.java:42)
	at org.junit.runners.ParentRunner$2.evaluate(ParentRunner.java:184)
	at org.junit.internal.runners.statements.RunBefores.evaluate(RunBefores.java:28)
	at org.junit.internal.runners.statements.RunAfters.evaluate(RunAfters.java:31)
	at org.junit.runners.ParentRunner.run(ParentRunner.java:236)
	at org.apache.maven.surefire.junit4.JUnit4Provider.execute(JUnit4Provider.java:252)
	at org.apache.maven.surefire.junit4.JUnit4Provider.executeTestSet(JUnit4Provider.java:141)
	at org.apache.maven.surefire.junit4.JUnit4Provider.invoke(JUnit4Provider.java:112)
	at sun.reflect.NativeMethodAccessorImpl.invoke0(Native Method)
	at sun.reflect.NativeMethodAccessorImpl.invoke(NativeMethodAccessorImpl.java:57)
	at sun.reflect.DelegatingMethodAccessorImpl.invoke(DelegatingMethodAccessorImpl.java:43)
	at java.lang.reflect.Method.invoke(Method.java:606)
	at org.apache.maven.surefire.util.ReflectionUtils.invokeMethodWithArray(ReflectionUtils.java:189)
	at org.apache.maven.surefire.booter.ProviderFactory$ProviderProxy.invoke(ProviderFactory.java:165)
	at org.apache.maven.surefire.booter.ProviderFactory.invokeProvider(ProviderFactory.java:85)
	at org.apache.maven.surefire.booter.ForkedBooter.runSuitesInProcess(ForkedBooter.java:115)
	at org.apache.maven.surefire.booter.ForkedBooter.main(ForkedBooter.java:75)


Results :

Failed tests:   testGetQueries(org.apache.blur.console.util.QueryUtilTest): expected:<2>
but was:<1>
  testGetCurrentQueryCount(org.apache.blur.console.util.QueryUtilTest): expected:<1>
but was:<2>

Tests run: 11, Failures: 2, Errors: 0, Skipped: 0

[ERROR] There are test failures.

Please refer to <https://builds.apache.org/job/Blur-master-jdk7/org.apache.blur$blur-console/ws/target/surefire-reports>
for the individual test results.
[JENKINS] Recording test results
[INFO] 
[INFO] --- maven-jar-plugin:2.4:jar (default-jar) @ blur-console ---
[INFO] Building jar: <https://builds.apache.org/job/Blur-master-jdk7/org.apache.blur$blur-console/ws/target/blur-console-0.2.2-incubating-hadoop1.jar>
[INFO] 
[INFO] --- maven-site-plugin:3.2:attach-descriptor (attach-descriptor) @ blur-console ---
[INFO] 
[INFO] --- apache-rat-plugin:0.10:check (default) @ blur-console ---
[INFO] 51 implicit excludes (use -debug for more details).
[INFO] Exclude: LICENSE
[INFO] Exclude: CHANGES.txt
[INFO] Exclude: DISCLAIMER
[INFO] Exclude: NOTICE
[INFO] Exclude: README
[INFO] Exclude: **/README.textile
[INFO] Exclude: **/README.md
[INFO] Exclude: **/.classpath
[INFO] Exclude: **/.project
[INFO] Exclude: **/.settings/**
[INFO] Exclude: **/.idea/**
[INFO] Exclude: **/*.iml
[INFO] Exclude: **/target/**
[INFO] Exclude: **/build/**
[INFO] Exclude: **/.codio
[INFO] Exclude: **/src/main/webapp/libs/**
[INFO] Exclude: **/src/main/webapp/css/**
[INFO] Exclude: **/src/main/webapp/js/utils/*
[INFO] Exclude: **/src/main/webapp/public/js/modernizr.js
[INFO] Exclude: **/src/main/webapp/public/css/*.map
[INFO] Exclude: **/src/main/webapp/public/css/glyphicons*
[INFO] Exclude: **/src/main/webapp/node_modules/**
[INFO] Exclude: **/src/main/webapp/.sass-cache/**
[INFO] Exclude: **/src/main/webapp/.tmp/**
[INFO] Exclude: **/.bowerrc
[INFO] Exclude: **/.editorconfig
[INFO] Exclude: **/.jshintrc
[INFO] Exclude: **/package.json
[INFO] Exclude: **/bower.json
[INFO] Exclude: **/src/main/scripts/grunt.sh
[INFO] Exclude: contrib/blur-console-v1/**
[INFO] Exclude: **/src/main/resources/org/apache/blur/thrift/util/words.txt
[INFO] Exclude: **/src/main/webapp/js/d3.v2.js
[INFO] Exclude: **/src/main/webapp/js/d3.v2.min.js
[INFO] Exclude: **/src/main/resources*/license-notes.txt
[INFO] Exclude: **/src/main/resources*/NOTICE-bin.base.txt
[INFO] Exclude: **/src/main/resources*/NOTICE-bin.txt
[INFO] Exclude: **/src/main/resources*/notices/*.src
[INFO] Exclude: **/src/main/scripts/conf/controllers
[INFO] Exclude: **/src/main/scripts/conf/default_zoo.cfg
[INFO] Exclude: **/src/main/scripts/conf/shards
[INFO] Exclude: **/src/main/scripts/conf/zookeepers
[INFO] Exclude: **/src/main/scripts/interface/gen-html/Blur.html
[INFO] Exclude: **/src/main/scripts/interface/gen-html/index.html
[INFO] Exclude: **/.empty
[INFO] 167 resources included (use -debug for more details)
[INFO] Rat check: Summary of files. Unapproved: 1 unknown: 1 generated: 0 approved: 67 licence.

Mime
View raw message