incubator-blur-dev mailing list archives

Site index · List index
Message view « Date » · « Thread »
Top « Date » · « Thread »
From Apache Jenkins Server <jenk...@builds.apache.org>
Subject Build failed in Jenkins: Blur-master-jdk6 #15
Date Sun, 22 Sep 2013 01:38:10 GMT
See <https://builds.apache.org/job/Blur-master-jdk6/15/changes>

Changes:

[amccurry] Adding back the v2 block cache.

[amccurry] Updating version for new branch.

[amccurry] More fixes to the v2 block cache.

[amccurry] Adding MIN and MAX keywords for Numeric types.

[amccurry] Correcting some mutation behavior.  While updating a Row and using replace columns
or append columns if the record was missing an exception was thrown.  This was incorrect,
the behavior should be to simply add the record if it did not exist.

[amccurry] Cleaning up some code

[amccurry] Adding test for deletion of column during row update where the record mutation
type is replace columns.  If the column value is null then the column is removed form the
record.  Also fixing a NPE in the transaction recorder.

[amccurry] Fixed BLUR-225

[amccurry] Fixing issue with the source artifact having the binary artifact LICENSE and NOTICE
files.  Also have moved the bin version of the two files into 'distribution/src/main/resources/'
directory and the source versions now live at the root of the source project (where they should
be).  Also had to modify the rat exclusion list because of the new NOTICE-bin.base.txt file.

[amccurry] Initial commit. terms -F crashes console

[amccurry] Fixes frequency command, fixes use of period instead of colon. Fixes frequency
printing

[amccurry] All functionality in place

[amccurry] Tidying up code

[amccurry] Made frequency text little less confusing

[amccurry] Fixed the NPE with an incorrect option for the terms command

[amccurry] Fixed BLUR-226

[challapallirahul] Exposed snapshot functionality through the shell

[challapallirahul] Made the Snapshot Command classes implement the TableFirstArgCommand marker
interface

[amccurry] Working on BLUR-232

[amccurry] Adding another exclude to the rat excludes.  '**/target/**'  Not sure why, I thought
it was built into rat, but on ubuntu server it was needed to pass.

[williamstw] Let terms command return empty list when field isn't in the index.

[challapallirahul] Added apache license headers to the new snapshot command files

[amccurry] Updating the version.

[amccurry] Updating the version.

[amccurry] Adding missing APLv2 header.

[amccurry] Adding softlink directory.

[amccurry] Closing resources that need to be closed.

[amccurry] Some more refactoring and adding more tests for the CacheDirectory.

[amccurry] Added test for CacheDirectory for Off heap memory.

[amccurry] Fixed BLUR-222.

[amccurry] Fixed for linux (ubuntu), hopefully this will work on other distros.

------------------------------------------
[...truncated 85 lines...]
INFO: Blur Shell
Sep 22, 2013 1:37:28 AM org.apache.maven.cli.event.ExecutionEventLogger sessionStarted
INFO: Blur JDBC
Sep 22, 2013 1:37:28 AM org.apache.maven.cli.event.ExecutionEventLogger sessionStarted
INFO: Distribution
Sep 22, 2013 1:37:31 AM org.apache.maven.cli.event.ExecutionEventLogger projectStarted
INFO:                                                                         
Sep 22, 2013 1:37:31 AM org.apache.maven.cli.event.ExecutionEventLogger projectStarted
INFO: ------------------------------------------------------------------------
Sep 22, 2013 1:37:31 AM org.apache.maven.cli.event.ExecutionEventLogger projectStarted
INFO: Building Blur 0.3.0-incubating-SNAPSHOT
Sep 22, 2013 1:37:31 AM org.apache.maven.cli.event.ExecutionEventLogger projectStarted
INFO: ------------------------------------------------------------------------
Downloading: http://repo.maven.apache.org/maven2/org/jasig/maven/maven-notice-plugin/maven-metadata.xml
Downloaded: http://repo.maven.apache.org/maven2/org/jasig/maven/maven-notice-plugin/maven-metadata.xml
(496 B at 4.2 KB/sec)
Downloading: http://repo.maven.apache.org/maven2/org/jasig/maven/maven-notice-plugin/1.0.5/maven-notice-plugin-1.0.5.pom
Downloaded: http://repo.maven.apache.org/maven2/org/jasig/maven/maven-notice-plugin/1.0.5/maven-notice-plugin-1.0.5.pom
(15 KB at 944.1 KB/sec)
Downloading: http://repo.maven.apache.org/maven2/org/jasig/parent/jasig-parent/33/jasig-parent-33.pom
Downloaded: http://repo.maven.apache.org/maven2/org/jasig/parent/jasig-parent/33/jasig-parent-33.pom
(16 KB at 1387.7 KB/sec)
Downloading: http://repo.maven.apache.org/maven2/org/jasig/maven/maven-notice-plugin/1.0.5/maven-notice-plugin-1.0.5.jar
Downloaded: http://repo.maven.apache.org/maven2/org/jasig/maven/maven-notice-plugin/1.0.5/maven-notice-plugin-1.0.5.jar
(42 KB at 2597.0 KB/sec)
Sep 22, 2013 1:37:32 AM org.apache.maven.cli.event.ExecutionEventLogger mojoStarted
INFO: 
Sep 22, 2013 1:37:32 AM org.apache.maven.cli.event.ExecutionEventLogger mojoStarted
INFO: --- maven-remote-resources-plugin:1.4:process (default) @ blur ---
Sep 22, 2013 1:37:43 AM org.apache.maven.cli.event.ExecutionEventLogger mojoStarted
INFO: 
Sep 22, 2013 1:37:43 AM org.apache.maven.cli.event.ExecutionEventLogger mojoStarted
INFO: --- maven-site-plugin:3.2:attach-descriptor (attach-descriptor) @ blur ---
Sep 22, 2013 1:37:45 AM org.apache.maven.cli.event.ExecutionEventLogger mojoStarted
INFO: 
Sep 22, 2013 1:37:45 AM org.apache.maven.cli.event.ExecutionEventLogger mojoStarted
INFO: --- apache-rat-plugin:0.9:check (default) @ blur ---
[INFO] 61 implicit excludes (use -debug for more details).
[INFO] Exclude: LICENSE
[INFO] Exclude: CHANGES.txt
[INFO] Exclude: DISCLAIMER
[INFO] Exclude: NOTICE
[INFO] Exclude: README
[INFO] Exclude: **/README.textile
[INFO] Exclude: **/.classpath
[INFO] Exclude: **/.project
[INFO] Exclude: **/.settings/**
[INFO] Exclude: **/target/**
[INFO] Exclude: contrib/blur-console/blur-admin/vendor/assets/javascripts/d3/**
[INFO] Exclude: contrib/blur-console/blur-admin/vendor/assets/javascripts/backbone/**
[INFO] Exclude: contrib/blur-console/blur-admin/vendor/assets/javascripts/flot/**
[INFO] Exclude: contrib/blur-console/blur-admin/vendor/assets/javascripts/jquery.*.js
[INFO] Exclude: contrib/blur-console/blur-admin/vendor/assets/javascripts/modernizr.js
[INFO] Exclude: contrib/blur-console/blur-admin/vendor/assets/javascripts/sorttable.js
[INFO] Exclude: contrib/blur-console/blur-admin/vendor/assets/javascripts/underscore.js
[INFO] Exclude: contrib/blur-console/blur-admin/vendor/assets/javascripts/datatables.fnReloadAjax.js
[INFO] Exclude: contrib/blur-console/blur-admin/vendor/assets/stylesheets/jquery*.css
[INFO] Exclude: contrib/blur-console/blur-admin/vendor/assets/stylesheets/ui.dynatree.css
[INFO] Exclude: contrib/blur-console/blur-admin/vendor/gems/cancan/**
[INFO] Exclude: contrib/blur-console/blur-admin/Gemfile.lock
[INFO] Exclude: **/src/main/resources/org/apache/blur/thrift/util/words.txt
[INFO] Exclude: **/src/main/webapp/js/d3.v2.js
[INFO] Exclude: **/src/main/webapp/js/d3.v2.min.js
[INFO] Exclude: **/src/main/resources/license-notes.txt
[INFO] Exclude: **/src/main/resources/NOTICE-bin.base.txt
[INFO] Exclude: **/src/main/resources/NOTICE-bin.txt
[INFO] Exclude: **/src/main/scripts/conf/controllers
[INFO] Exclude: **/src/main/scripts/conf/default_zoo.cfg
[INFO] Exclude: **/src/main/scripts/conf/shards
[INFO] Exclude: **/src/main/scripts/conf/zookeepers
[INFO] Exclude: **/src/main/scripts/interface/gen-html/Blur.html
[INFO] Exclude: **/src/main/scripts/interface/gen-html/index.html
[INFO] Exclude: **/.empty
[INFO] 446 resources included (use -debug for more details)
[INFO] Rat check: Summary of files. Unapproved: 0 unknown: 0 generated: 0 approved: 402 licence.
Sep 22, 2013 1:37:48 AM org.apache.maven.cli.event.ExecutionEventLogger mojoStarted
INFO: 
Sep 22, 2013 1:37:48 AM org.apache.maven.cli.event.ExecutionEventLogger mojoStarted
INFO: --- maven-install-plugin:2.3.1:install (default-install) @ blur ---
[INFO] Installing <https://builds.apache.org/job/Blur-master-jdk6/ws/pom.xml> to /home/jenkins/jenkins-slave/maven-repositories/1/org/apache/blur/blur/0.3.0-incubating-SNAPSHOT/blur-0.3.0-incubating-SNAPSHOT.pom
Sep 22, 2013 1:37:49 AM org.apache.maven.cli.event.ExecutionEventLogger projectStarted
INFO:                                                                         
Sep 22, 2013 1:37:49 AM org.apache.maven.cli.event.ExecutionEventLogger projectStarted
INFO: ------------------------------------------------------------------------
Sep 22, 2013 1:37:49 AM org.apache.maven.cli.event.ExecutionEventLogger projectStarted
INFO: Building Blur Util 0.3.0-incubating-SNAPSHOT
Sep 22, 2013 1:37:49 AM org.apache.maven.cli.event.ExecutionEventLogger projectStarted
INFO: ------------------------------------------------------------------------
Sep 22, 2013 1:37:50 AM org.apache.maven.cli.event.ExecutionEventLogger mojoStarted
INFO: 
Sep 22, 2013 1:37:50 AM org.apache.maven.cli.event.ExecutionEventLogger mojoStarted
INFO: --- maven-remote-resources-plugin:1.4:process (default) @ blur-util ---
Sep 22, 2013 1:37:51 AM org.apache.maven.cli.event.ExecutionEventLogger mojoStarted
INFO: 
Sep 22, 2013 1:37:51 AM org.apache.maven.cli.event.ExecutionEventLogger mojoStarted
INFO: --- maven-resources-plugin:2.6:resources (default-resources) @ blur-util ---
[INFO] Using 'UTF-8' encoding to copy filtered resources.
[INFO] Copying 4 resources
[INFO] Copying 3 resources
Sep 22, 2013 1:37:51 AM org.apache.maven.cli.event.ExecutionEventLogger mojoStarted
INFO: 
Sep 22, 2013 1:37:51 AM org.apache.maven.cli.event.ExecutionEventLogger mojoStarted
INFO: --- maven-compiler-plugin:2.5.1:compile (default-compile) @ blur-util ---
[INFO] Compiling 28 source files to <https://builds.apache.org/job/Blur-master-jdk6/ws/blur-util/target/classes>
Sep 22, 2013 1:37:55 AM org.apache.maven.cli.event.ExecutionEventLogger mojoStarted
INFO: 
Sep 22, 2013 1:37:55 AM org.apache.maven.cli.event.ExecutionEventLogger mojoStarted
INFO: --- maven-resources-plugin:2.6:testResources (default-testResources) @ blur-util ---
[INFO] Using 'UTF-8' encoding to copy filtered resources.
[INFO] Copying 1 resource
[INFO] Copying 3 resources
Sep 22, 2013 1:37:55 AM org.apache.maven.cli.event.ExecutionEventLogger mojoStarted
INFO: 
Sep 22, 2013 1:37:55 AM org.apache.maven.cli.event.ExecutionEventLogger mojoStarted
INFO: --- maven-compiler-plugin:2.5.1:testCompile (default-testCompile) @ blur-util ---
[INFO] Compiling 1 source file to <https://builds.apache.org/job/Blur-master-jdk6/ws/blur-util/target/test-classes>
Sep 22, 2013 1:37:55 AM org.apache.maven.cli.event.ExecutionEventLogger mojoStarted
INFO: 
Sep 22, 2013 1:37:55 AM org.apache.maven.cli.event.ExecutionEventLogger mojoStarted
INFO: --- maven-surefire-plugin:2.12.4:test (default-test) @ blur-util ---
[INFO] Surefire report directory: <https://builds.apache.org/job/Blur-master-jdk6/ws/blur-util/target/surefire-reports>

-------------------------------------------------------
 T E S T S
-------------------------------------------------------
Running org.apache.blur.zookeeper.ZkUtilsTest
SLF4J: The following loggers will not work becasue they were created
SLF4J: during the default configuration phase of the underlying logging system.
SLF4J: See also http://www.slf4j.org/codes.html#substituteLogger
SLF4J: org.apache.zookeeper.server.quorum.QuorumPeerMain
13/09/22 01:37:56 INFO quorum.QuorumPeerConfig: Reading configuration from: ./src/test/resources/zoo.cfg
13/09/22 01:37:56 INFO server.DatadirCleanupManager: autopurge.snapRetainCount set to 3
13/09/22 01:37:56 INFO server.DatadirCleanupManager: autopurge.purgeInterval set to 0
13/09/22 01:37:56 INFO server.DatadirCleanupManager: Purge task is not scheduled.
13/09/22 01:37:56 INFO zookeeper.ZooKeeper: Client environment:zookeeper.version=3.4.5-1392090,
built on 09/30/2012 17:52 GMT
13/09/22 01:37:56 INFO zookeeper.ZooKeeper: Client environment:host.name=minerva.apache.org
13/09/22 01:37:56 INFO zookeeper.ZooKeeper: Client environment:java.version=1.6.0_45
13/09/22 01:37:56 INFO zookeeper.ZooKeeper: Client environment:java.vendor=Sun Microsystems
Inc.
13/09/22 01:37:56 INFO zookeeper.ZooKeeper: Client environment:java.home=/home/jenkins/tools/java/jdk1.6.0_45-32/jre
13/09/22 01:37:56 INFO zookeeper.ZooKeeper: Client environment:java.class.path=<https://builds.apache.org/job/Blur-master-jdk6/ws/blur-util/target/test-classes>:<https://builds.apache.org/job/Blur-master-jdk6/ws/blur-util/target/classes>:/home/jenkins/jenkins-slave/maven-repositories/1/org/apache/zookeeper/zookeeper/3.4.5/zookeeper-3.4.5.jar:/home/jenkins/jenkins-slave/maven-repositories/1/jline/jline/0.9.94/jline-0.9.94.jar:/home/jenkins/jenkins-slave/maven-repositories/1/org/jboss/netty/netty/3.2.2.Final/netty-3.2.2.Final.jar:/home/jenkins/jenkins-slave/maven-repositories/1/junit/junit/4.7/junit-4.7.jar:/home/jenkins/jenkins-slave/maven-repositories/1/org/slf4j/slf4j-api/1.6.1/slf4j-api-1.6.1.jar:/home/jenkins/jenkins-slave/maven-repositories/1/org/slf4j/slf4j-log4j12/1.6.1/slf4j-log4j12-1.6.1.jar:/home/jenkins/jenkins-slave/maven-repositories/1/org/json/json/20090211/json-20090211.jar:/home/jenkins/jenkins-slave/maven-repositories/1/log4j/log4j/1.2.15/log4j-1.2.15.jar:/home/jenkins/jenkins-slave/maven-repositories/1/com/yammer/metrics/metrics-core/2.2.0/metrics-core-2.2.0.jar:/home/jenkins/jenkins-slave/maven-repositories/1/com/yammer/metrics/metrics-ganglia/2.2.0/metrics-ganglia-2.2.0.jar:/home/jenkins/jenkins-slave/maven-repositories/1/com/yammer/metrics/metrics-graphite/2.2.0/metrics-graphite-2.2.0.jar:/home/jenkins/jenkins-slave/maven-repositories/1/com/google/guava/guava/14.0/guava-14.0.jar:/home/jenkins/jenkins-slave/maven-repositories/1/org/mockito/mockito-core/1.9.0/mockito-core-1.9.0.jar:/home/jenkins/jenkins-slave/maven-repositories/1/org/hamcrest/hamcrest-core/1.1/hamcrest-core-1.1.jar:/home/jenkins/jenkins-slave/maven-repositories/1/org/objenesis/objenesis/1.0/objenesis-1.0.jar:/home/jenkins/jenkins-slave/maven-repositories/1/com/yammer/metrics/metrics-servlet/2.2.0/metrics-servlet-2.2.0.jar:/home/jenkins/jenkins-slave/maven-repositories/1/com/fasterxml/jackson/core/jackson-databind/2.1.1/jackson-databind-2.1.1.jar:/home/jenkins/jenkins-slave/maven-repositories/1/com/fasterxml/jackson/core/jackson-annotations/2.1.1/jackson-annotations-2.1.1.jar:/home/jenkins/jenkins-slave/maven-repositories/1/com/fasterxml/jackson/core/jackson-core/2.1.1/jackson-core-2.1.1.jar:/home/jenkins/jenkins-slave/maven-repositories/1/org/apache/hadoop/hadoop-core/1.2.1/hadoop-core-1.2.1.jar:/home/jenkins/jenkins-slave/maven-repositories/1/commons-cli/commons-cli/1.2/commons-cli-1.2.jar:/home/jenkins/jenkins-slave/maven-repositories/1/xmlenc/xmlenc/0.52/xmlenc-0.52.jar:/home/jenkins/jenkins-slave/maven-repositories/1/com/sun/jersey/jersey-core/1.8/jersey-core-1.8.jar:/home/jenkins/jenkins-slave/maven-repositories/1/com/sun/jersey/jersey-json/1.8/jersey-json-1.8.jar:/home/jenkins/jenkins-slave/maven-repositories/1/org/codehaus/jettison/jettison/1.1/jettison-1.1.jar:/home/jenkins/jenkins-slave/maven-repositories/1/stax/stax-api/1.0.1/stax-api-1.0.1.jar:/home/jenkins/jenkins-slave/maven-repositories/1/com/sun/xml/bind/jaxb-impl/2.2.3-1/jaxb-impl-2.2.3-1.jar:/home/jenkins/jenkins-slave/maven-repositories/1/javax/xml/bind/jaxb-api/2.2.2/jaxb-api-2.2.2.jar:/home/jenkins/jenkins-slave/maven-repositories/1/javax/xml/stream/stax-api/1.0-2/stax-api-1.0-2.jar:/home/jenkins/jenkins-slave/maven-repositories/1/javax/activation/activation/1.1/activation-1.1.jar:/home/jenkins/jenkins-slave/maven-repositories/1/org/codehaus/jackson/jackson-core-asl/1.7.1/jackson-core-asl-1.7.1.jar:/home/jenkins/jenkins-slave/maven-repositories/1/org/codehaus/jackson/jackson-jaxrs/1.7.1/jackson-jaxrs-1.7.1.jar:/home/jenkins/jenkins-slave/maven-repositories/1/org/codehaus/jackson/jackson-xc/1.7.1/jackson-xc-1.7.1.jar:/home/jenkins/jenkins-slave/maven-repositories/1/com/sun/jersey/jersey-server/1.8/jersey-server-1.8.jar:/home/jenkins/jenkins-slave/maven-repositories/1/asm/asm/3.1/asm-3.1.jar:/home/jenkins/jenkins-slave/maven-repositories/1/commons-io/commons-io/2.1/commons-io-2.1.jar:/home/jenkins/jenkins-slave/maven-repositories/1/commons-httpclient/commons-httpclient/3.0.1/commons-httpclient-3.0.1.jar:/home/jenkins/jenkins-slave/maven-repositories/1/commons-logging/commons-logging/1.0.3/commons-logging-1.0.3.jar:/home/jenkins/jenkins-slave/maven-repositories/1/commons-codec/commons-codec/1.4/commons-codec-1.4.jar:/home/jenkins/jenkins-slave/maven-repositories/1/org/apache/commons/commons-math/2.1/commons-math-2.1.jar:/home/jenkins/jenkins-slave/maven-repositories/1/commons-configuration/commons-configuration/1.6/commons-configuration-1.6.jar:/home/jenkins/jenkins-slave/maven-repositories/1/commons-collections/commons-collections/3.2.1/commons-collections-3.2.1.jar:/home/jenkins/jenkins-slave/maven-repositories/1/commons-lang/commons-lang/2.4/commons-lang-2.4.jar:/home/jenkins/jenkins-slave/maven-repositories/1/commons-digester/commons-digester/1.8/commons-digester-1.8.jar:/home/jenkins/jenkins-slave/maven-repositories/1/commons-beanutils/commons-beanutils/1.7.0/commons-beanutils-1.7.0.jar:/home/jenkins/jenkins-slave/maven-repositories/1/commons-beanutils/commons-beanutils-core/1.8.0/commons-beanutils-core-1.8.0.jar:/home/jenkins/jenkins-slave/maven-repositories/1/commons-net/commons-net/1.4.1/commons-net-1.4.1.jar:/home/jenkins/jenkins-slave/maven-repositories/1/org/mortbay/jetty/jetty/6.1.26/jetty-6.1.26.jar:/home/jenkins/jenkins-slave/maven-repositories/1/org/mortbay/jetty/servlet-api/2.5-20081211/servlet-api-2.5-20081211.jar:/home/jenkins/jenkins-slave/maven-repositories/1/org/mortbay/jetty/jetty-util/6.1.26/jetty-util-6.1.26.jar:/home/jenkins/jenkins-slave/maven-repositories/1/tomcat/jasper-runtime/5.5.12/jasper-runtime-5.5.12.jar:/home/jenkins/jenkins-slave/maven-repositories/1/tomcat/jasper-compiler/5.5.12/jasper-compiler-5.5.12.jar:/home/jenkins/jenkins-slave/maven-repositories/1/org/mortbay/jetty/jsp-api-2.1/6.1.14/jsp-api-2.1-6.1.14.jar:/home/jenkins/jenkins-slave/maven-repositories/1/org/mortbay/jetty/servlet-api-2.5/6.1.14/servlet-api-2.5-6.1.14.jar:/home/jenkins/jenkins-slave/maven-repositories/1/org/mortbay/jetty/jsp-2.1/6.1.14/jsp-2.1-6.1.14.jar:/home/jenkins/jenkins-slave/maven-repositories/1/ant/ant/1.6.5/ant-1.6.5.jar:/home/jenkins/jenkins-slave/maven-repositories/1/commons-el/commons-el/1.0/commons-el-1.0.jar:/home/jenkins/jenkins-slave/maven-repositories/1/net/java/dev/jets3t/jets3t/0.6.1/jets3t-0.6.1.jar:/home/jenkins/jenkins-slave/maven-repositories/1/hsqldb/hsqldb/1.8.0.10/hsqldb-1.8.0.10.jar:/home/jenkins/jenkins-slave/maven-repositories/1/oro/oro/2.0.8/oro-2.0.8.jar:/home/jenkins/jenkins-slave/maven-repositories/1/org/eclipse/jdt/core/3.1.1/core-3.1.1.jar:/home/jenkins/jenkins-slave/maven-repositories/1/org/codehaus/jackson/jackson-mapper-asl/1.8.8/jackson-mapper-asl-1.8.8.jar:
13/09/22 01:37:56 INFO zookeeper.ZooKeeper: Client environment:java.library.path=/home/jenkins/tools/java/jdk1.6.0_45-32/jre/lib/i386/server:/home/jenkins/tools/java/jdk1.6.0_45-32/jre/lib/i386:/home/jenkins/tools/java/jdk1.6.0_45-32/jre/../lib/i386:/usr/lib/jvm/java-6-openjdk-amd64/jre/lib/amd64/server:/usr/lib/jvm/java-6-openjdk-amd64/jre/lib/amd64:/usr/lib/jvm/java-6-openjdk-amd64/jre/../lib/amd64:/usr/java/packages/lib/i386:/lib:/usr/lib
13/09/22 01:37:56 INFO zookeeper.ZooKeeper: Client environment:java.io.tmpdir=/tmp
13/09/22 01:37:56 INFO zookeeper.ZooKeeper: Client environment:java.compiler=<NA>
13/09/22 01:37:56 INFO zookeeper.ZooKeeper: Client environment:os.name=Linux
13/09/22 01:37:56 INFO zookeeper.ZooKeeper: Client environment:os.arch=i386
13/09/22 01:37:56 INFO zookeeper.ZooKeeper: Client environment:os.version=3.2.0-51-generic
13/09/22 01:37:56 INFO zookeeper.ZooKeeper: Client environment:user.name=jenkins
13/09/22 01:37:56 INFO zookeeper.ZooKeeper: Client environment:user.home=/home/jenkins
13/09/22 01:37:56 INFO zookeeper.ZooKeeper: Client environment:user.dir=<https://builds.apache.org/job/Blur-master-jdk6/ws/blur-util>
13/09/22 01:37:56 INFO zookeeper.ZooKeeper: Initiating client connection, connectString=127.0.0.1:10101
sessionTimeout=10000 watcher=org.apache.blur.zookeeper.ZkUtilsTest$2@73a7ab
13/09/22 01:37:56 INFO zookeeper.ClientCnxn: Opening socket connection to server localhost/127.0.0.1:10101.
Will not attempt to authenticate using SASL (Unable to locate a login configuration)
13/09/22 01:37:56 INFO zookeeper.ClientCnxn: Socket connection established to localhost/127.0.0.1:10101,
initiating session
13/09/22 01:37:56 INFO zookeeper.ClientCnxn: Unable to read additional data from server sessionid
0x0, likely server has closed socket, closing socket connection and attempting reconnect
13/09/22 01:37:57 DEBUG SecurityLogger.additivity: preRegister called. Server=com.sun.jmx.mbeanserver.JmxMBeanServer@1a082e2,
name=log4j:logger=SecurityLogger.additivity
13/09/22 01:37:57 DEBUG SecurityLogger.additivity: preRegister called. Server=com.sun.jmx.mbeanserver.JmxMBeanServer@1a082e2,
name=log4j:logger=SecurityLogger.additivity
13/09/22 01:37:57 INFO quorum.QuorumPeerConfig: Reading configuration from: ./src/test/resources/zoo.cfg
13/09/22 01:37:57 INFO server.ZooKeeperServerMain: Starting server
13/09/22 01:37:57 INFO server.ZooKeeperServer: Server environment:zookeeper.version=3.4.5-1392090,
built on 09/30/2012 17:52 GMT
13/09/22 01:37:57 INFO server.ZooKeeperServer: Server environment:host.name=minerva.apache.org
13/09/22 01:37:57 INFO server.ZooKeeperServer: Server environment:java.version=1.6.0_45
13/09/22 01:37:57 INFO server.ZooKeeperServer: Server environment:java.vendor=Sun Microsystems
Inc.
13/09/22 01:37:57 INFO server.ZooKeeperServer: Server environment:java.home=/home/jenkins/tools/java/jdk1.6.0_45-32/jre
13/09/22 01:37:57 INFO server.ZooKeeperServer: Server environment:java.class.path=<https://builds.apache.org/job/Blur-master-jdk6/ws/blur-util/target/test-classes>:<https://builds.apache.org/job/Blur-master-jdk6/ws/blur-util/target/classes>:/home/jenkins/jenkins-slave/maven-repositories/1/org/apache/zookeeper/zookeeper/3.4.5/zookeeper-3.4.5.jar:/home/jenkins/jenkins-slave/maven-repositories/1/jline/jline/0.9.94/jline-0.9.94.jar:/home/jenkins/jenkins-slave/maven-repositories/1/org/jboss/netty/netty/3.2.2.Final/netty-3.2.2.Final.jar:/home/jenkins/jenkins-slave/maven-repositories/1/junit/junit/4.7/junit-4.7.jar:/home/jenkins/jenkins-slave/maven-repositories/1/org/slf4j/slf4j-api/1.6.1/slf4j-api-1.6.1.jar:/home/jenkins/jenkins-slave/maven-repositories/1/org/slf4j/slf4j-log4j12/1.6.1/slf4j-log4j12-1.6.1.jar:/home/jenkins/jenkins-slave/maven-repositories/1/org/json/json/20090211/json-20090211.jar:/home/jenkins/jenkins-slave/maven-repositories/1/log4j/log4j/1.2.15/log4j-1.2.15.jar:/home/jenkins/jenkins-slave/maven-repositories/1/com/yammer/metrics/metrics-core/2.2.0/metrics-core-2.2.0.jar:/home/jenkins/jenkins-slave/maven-repositories/1/com/yammer/metrics/metrics-ganglia/2.2.0/metrics-ganglia-2.2.0.jar:/home/jenkins/jenkins-slave/maven-repositories/1/com/yammer/metrics/metrics-graphite/2.2.0/metrics-graphite-2.2.0.jar:/home/jenkins/jenkins-slave/maven-repositories/1/com/google/guava/guava/14.0/guava-14.0.jar:/home/jenkins/jenkins-slave/maven-repositories/1/org/mockito/mockito-core/1.9.0/mockito-core-1.9.0.jar:/home/jenkins/jenkins-slave/maven-repositories/1/org/hamcrest/hamcrest-core/1.1/hamcrest-core-1.1.jar:/home/jenkins/jenkins-slave/maven-repositories/1/org/objenesis/objenesis/1.0/objenesis-1.0.jar:/home/jenkins/jenkins-slave/maven-repositories/1/com/yammer/metrics/metrics-servlet/2.2.0/metrics-servlet-2.2.0.jar:/home/jenkins/jenkins-slave/maven-repositories/1/com/fasterxml/jackson/core/jackson-databind/2.1.1/jackson-databind-2.1.1.jar:/home/jenkins/jenkins-slave/maven-repositories/1/com/fasterxml/jackson/core/jackson-annotations/2.1.1/jackson-annotations-2.1.1.jar:/home/jenkins/jenkins-slave/maven-repositories/1/com/fasterxml/jackson/core/jackson-core/2.1.1/jackson-core-2.1.1.jar:/home/jenkins/jenkins-slave/maven-repositories/1/org/apache/hadoop/hadoop-core/1.2.1/hadoop-core-1.2.1.jar:/home/jenkins/jenkins-slave/maven-repositories/1/commons-cli/commons-cli/1.2/commons-cli-1.2.jar:/home/jenkins/jenkins-slave/maven-repositories/1/xmlenc/xmlenc/0.52/xmlenc-0.52.jar:/home/jenkins/jenkins-slave/maven-repositories/1/com/sun/jersey/jersey-core/1.8/jersey-core-1.8.jar:/home/jenkins/jenkins-slave/maven-repositories/1/com/sun/jersey/jersey-json/1.8/jersey-json-1.8.jar:/home/jenkins/jenkins-slave/maven-repositories/1/org/codehaus/jettison/jettison/1.1/jettison-1.1.jar:/home/jenkins/jenkins-slave/maven-repositories/1/stax/stax-api/1.0.1/stax-api-1.0.1.jar:/home/jenkins/jenkins-slave/maven-repositories/1/com/sun/xml/bind/jaxb-impl/2.2.3-1/jaxb-impl-2.2.3-1.jar:/home/jenkins/jenkins-slave/maven-repositories/1/javax/xml/bind/jaxb-api/2.2.2/jaxb-api-2.2.2.jar:/home/jenkins/jenkins-slave/maven-repositories/1/javax/xml/stream/stax-api/1.0-2/stax-api-1.0-2.jar:/home/jenkins/jenkins-slave/maven-repositories/1/javax/activation/activation/1.1/activation-1.1.jar:/home/jenkins/jenkins-slave/maven-repositories/1/org/codehaus/jackson/jackson-core-asl/1.7.1/jackson-core-asl-1.7.1.jar:/home/jenkins/jenkins-slave/maven-repositories/1/org/codehaus/jackson/jackson-jaxrs/1.7.1/jackson-jaxrs-1.7.1.jar:/home/jenkins/jenkins-slave/maven-repositories/1/org/codehaus/jackson/jackson-xc/1.7.1/jackson-xc-1.7.1.jar:/home/jenkins/jenkins-slave/maven-repositories/1/com/sun/jersey/jersey-server/1.8/jersey-server-1.8.jar:/home/jenkins/jenkins-slave/maven-repositories/1/asm/asm/3.1/asm-3.1.jar:/home/jenkins/jenkins-slave/maven-repositories/1/commons-io/commons-io/2.1/commons-io-2.1.jar:/home/jenkins/jenkins-slave/maven-repositories/1/commons-httpclient/commons-httpclient/3.0.1/commons-httpclient-3.0.1.jar:/home/jenkins/jenkins-slave/maven-repositories/1/commons-logging/commons-logging/1.0.3/commons-logging-1.0.3.jar:/home/jenkins/jenkins-slave/maven-repositories/1/commons-codec/commons-codec/1.4/commons-codec-1.4.jar:/home/jenkins/jenkins-slave/maven-repositories/1/org/apache/commons/commons-math/2.1/commons-math-2.1.jar:/home/jenkins/jenkins-slave/maven-repositories/1/commons-configuration/commons-configuration/1.6/commons-configuration-1.6.jar:/home/jenkins/jenkins-slave/maven-repositories/1/commons-collections/commons-collections/3.2.1/commons-collections-3.2.1.jar:/home/jenkins/jenkins-slave/maven-repositories/1/commons-lang/commons-lang/2.4/commons-lang-2.4.jar:/home/jenkins/jenkins-slave/maven-repositories/1/commons-digester/commons-digester/1.8/commons-digester-1.8.jar:/home/jenkins/jenkins-slave/maven-repositories/1/commons-beanutils/commons-beanutils/1.7.0/commons-beanutils-1.7.0.jar:/home/jenkins/jenkins-slave/maven-repositories/1/commons-beanutils/commons-beanutils-core/1.8.0/commons-beanutils-core-1.8.0.jar:/home/jenkins/jenkins-slave/maven-repositories/1/commons-net/commons-net/1.4.1/commons-net-1.4.1.jar:/home/jenkins/jenkins-slave/maven-repositories/1/org/mortbay/jetty/jetty/6.1.26/jetty-6.1.26.jar:/home/jenkins/jenkins-slave/maven-repositories/1/org/mortbay/jetty/servlet-api/2.5-20081211/servlet-api-2.5-20081211.jar:/home/jenkins/jenkins-slave/maven-repositories/1/org/mortbay/jetty/jetty-util/6.1.26/jetty-util-6.1.26.jar:/home/jenkins/jenkins-slave/maven-repositories/1/tomcat/jasper-runtime/5.5.12/jasper-runtime-5.5.12.jar:/home/jenkins/jenkins-slave/maven-repositories/1/tomcat/jasper-compiler/5.5.12/jasper-compiler-5.5.12.jar:/home/jenkins/jenkins-slave/maven-repositories/1/org/mortbay/jetty/jsp-api-2.1/6.1.14/jsp-api-2.1-6.1.14.jar:/home/jenkins/jenkins-slave/maven-repositories/1/org/mortbay/jetty/servlet-api-2.5/6.1.14/servlet-api-2.5-6.1.14.jar:/home/jenkins/jenkins-slave/maven-repositories/1/org/mortbay/jetty/jsp-2.1/6.1.14/jsp-2.1-6.1.14.jar:/home/jenkins/jenkins-slave/maven-repositories/1/ant/ant/1.6.5/ant-1.6.5.jar:/home/jenkins/jenkins-slave/maven-repositories/1/commons-el/commons-el/1.0/commons-el-1.0.jar:/home/jenkins/jenkins-slave/maven-repositories/1/net/java/dev/jets3t/jets3t/0.6.1/jets3t-0.6.1.jar:/home/jenkins/jenkins-slave/maven-repositories/1/hsqldb/hsqldb/1.8.0.10/hsqldb-1.8.0.10.jar:/home/jenkins/jenkins-slave/maven-repositories/1/oro/oro/2.0.8/oro-2.0.8.jar:/home/jenkins/jenkins-slave/maven-repositories/1/org/eclipse/jdt/core/3.1.1/core-3.1.1.jar:/home/jenkins/jenkins-slave/maven-repositories/1/org/codehaus/jackson/jackson-mapper-asl/1.8.8/jackson-mapper-asl-1.8.8.jar:
13/09/22 01:37:57 INFO server.ZooKeeperServer: Server environment:java.library.path=/home/jenkins/tools/java/jdk1.6.0_45-32/jre/lib/i386/server:/home/jenkins/tools/java/jdk1.6.0_45-32/jre/lib/i386:/home/jenkins/tools/java/jdk1.6.0_45-32/jre/../lib/i386:/usr/lib/jvm/java-6-openjdk-amd64/jre/lib/amd64/server:/usr/lib/jvm/java-6-openjdk-amd64/jre/lib/amd64:/usr/lib/jvm/java-6-openjdk-amd64/jre/../lib/amd64:/usr/java/packages/lib/i386:/lib:/usr/lib
13/09/22 01:37:57 INFO server.ZooKeeperServer: Server environment:java.io.tmpdir=/tmp
13/09/22 01:37:57 INFO server.ZooKeeperServer: Server environment:java.compiler=<NA>
13/09/22 01:37:57 INFO server.ZooKeeperServer: Server environment:os.name=Linux
13/09/22 01:37:57 INFO server.ZooKeeperServer: Server environment:os.arch=i386
13/09/22 01:37:57 INFO server.ZooKeeperServer: Server environment:os.version=3.2.0-51-generic
13/09/22 01:37:57 INFO server.ZooKeeperServer: Server environment:user.name=jenkins
13/09/22 01:37:57 INFO server.ZooKeeperServer: Server environment:user.home=/home/jenkins
13/09/22 01:37:57 INFO server.ZooKeeperServer: Server environment:user.dir=<https://builds.apache.org/job/Blur-master-jdk6/ws/blur-util>
13/09/22 01:37:57 INFO server.ZooKeeperServer: tickTime set to 2000
13/09/22 01:37:57 INFO server.ZooKeeperServer: minSessionTimeout set to -1
13/09/22 01:37:57 INFO server.ZooKeeperServer: maxSessionTimeout set to -1
13/09/22 01:37:57 INFO server.NIOServerCnxnFactory: binding to port 0.0.0.0/0.0.0.0:10101
13/09/22 01:37:57 ERROR server.ZooKeeperServerMain: Unexpected exception, exiting abnormally
java.net.BindException: Address already in use
	at sun.nio.ch.Net.bind(Native Method)
	at sun.nio.ch.ServerSocketChannelImpl.bind(ServerSocketChannelImpl.java:124)
	at sun.nio.ch.ServerSocketAdaptor.bind(ServerSocketAdaptor.java:59)
	at sun.nio.ch.ServerSocketAdaptor.bind(ServerSocketAdaptor.java:52)
	at org.apache.zookeeper.server.NIOServerCnxnFactory.configure(NIOServerCnxnFactory.java:95)
	at org.apache.zookeeper.server.ZooKeeperServerMain.runFromConfig(ZooKeeperServerMain.java:110)
	at org.apache.zookeeper.server.ZooKeeperServerMain.initializeAndRun(ZooKeeperServerMain.java:86)
	at org.apache.zookeeper.server.ZooKeeperServerMain.main(ZooKeeperServerMain.java:52)
	at org.apache.zookeeper.server.quorum.QuorumPeerMain.initializeAndRun(QuorumPeerMain.java:116)
	at org.apache.zookeeper.server.quorum.QuorumPeerMain.main(QuorumPeerMain.java:78)
	at org.apache.blur.zookeeper.ZkUtilsTest$1.run(ZkUtilsTest.java:51)
	at java.lang.Thread.run(Thread.java:662)

Results :

Tests run: 0, Failures: 0, Errors: 0, Skipped: 0

[JENKINS] Recording test results
Sep 22, 2013 1:37:57 AM org.apache.maven.cli.event.ExecutionEventLogger logReactorSummary
INFO: ------------------------------------------------------------------------
Sep 22, 2013 1:37:57 AM org.apache.maven.cli.event.ExecutionEventLogger logReactorSummary
INFO: Reactor Summary:
Sep 22, 2013 1:37:57 AM org.apache.maven.cli.event.ExecutionEventLogger logReactorSummary
INFO: 
Sep 22, 2013 1:37:57 AM org.apache.maven.cli.event.ExecutionEventLogger logReactorSummary
INFO: Blur .............................................. SUCCESS [19.383s]
Sep 22, 2013 1:37:57 AM org.apache.maven.cli.event.ExecutionEventLogger logReactorSummary
INFO: Blur Util ......................................... FAILURE [8.352s]
Sep 22, 2013 1:37:57 AM org.apache.maven.cli.event.ExecutionEventLogger logReactorSummary
INFO: Blur Thrift ....................................... SKIPPED
Sep 22, 2013 1:37:57 AM org.apache.maven.cli.event.ExecutionEventLogger logReactorSummary
INFO: Blur Store ........................................ SKIPPED
Sep 22, 2013 1:37:57 AM org.apache.maven.cli.event.ExecutionEventLogger logReactorSummary
INFO: Blur Query ........................................ SKIPPED
Sep 22, 2013 1:37:57 AM org.apache.maven.cli.event.ExecutionEventLogger logReactorSummary
INFO: Blur GUI .......................................... SKIPPED
Sep 22, 2013 1:37:57 AM org.apache.maven.cli.event.ExecutionEventLogger logReactorSummary
INFO: Blur Core ......................................... SKIPPED
Sep 22, 2013 1:37:57 AM org.apache.maven.cli.event.ExecutionEventLogger logReactorSummary
INFO: Blur Map Reduce ................................... SKIPPED
Sep 22, 2013 1:37:57 AM org.apache.maven.cli.event.ExecutionEventLogger logReactorSummary
INFO: Blur Shell ........................................ SKIPPED
Sep 22, 2013 1:37:57 AM org.apache.maven.cli.event.ExecutionEventLogger logReactorSummary
INFO: Blur JDBC ......................................... SKIPPED
Sep 22, 2013 1:37:57 AM org.apache.maven.cli.event.ExecutionEventLogger logReactorSummary
INFO: Distribution ...................................... SKIPPED
Sep 22, 2013 1:37:57 AM org.apache.maven.cli.event.ExecutionEventLogger logResult
INFO: ------------------------------------------------------------------------
Sep 22, 2013 1:37:57 AM org.apache.maven.cli.event.ExecutionEventLogger logResult
INFO: BUILD FAILURE
Sep 22, 2013 1:37:57 AM org.apache.maven.cli.event.ExecutionEventLogger logStats
INFO: ------------------------------------------------------------------------
Sep 22, 2013 1:37:57 AM org.apache.maven.cli.event.ExecutionEventLogger logStats
INFO: Total time: 29.543s
Sep 22, 2013 1:37:57 AM org.apache.maven.cli.event.ExecutionEventLogger logStats
INFO: Finished at: Sun Sep 22 01:37:57 UTC 2013
Sep 22, 2013 1:37:57 AM org.apache.maven.cli.event.ExecutionEventLogger logStats
INFO: Final Memory: 22M/80M
Sep 22, 2013 1:37:57 AM org.apache.maven.cli.event.ExecutionEventLogger sessionEnded
INFO: ------------------------------------------------------------------------
[JENKINS] Archiving <https://builds.apache.org/job/Blur-master-jdk6/ws/blur-core/pom.xml>
to /home/hudson/hudson/jobs/Blur-master-jdk6/modules/org.apache.blur$blur-core/builds/2013-09-22_01-37-19/archive/org.apache.blur/blur-core/0.3.0-incubating-SNAPSHOT/blur-core-0.3.0-incubating-SNAPSHOT.pom
[JENKINS] Archiving <https://builds.apache.org/job/Blur-master-jdk6/ws/blur-mapred/pom.xml>
to /home/hudson/hudson/jobs/Blur-master-jdk6/modules/org.apache.blur$blur-mapred/builds/2013-09-22_01-37-19/archive/org.apache.blur/blur-mapred/0.3.0-incubating-SNAPSHOT/blur-mapred-0.3.0-incubating-SNAPSHOT.pom
[JENKINS] Archiving <https://builds.apache.org/job/Blur-master-jdk6/ws/blur-gui/pom.xml>
to /home/hudson/hudson/jobs/Blur-master-jdk6/modules/org.apache.blur$blur-gui/builds/2013-09-22_01-37-19/archive/org.apache.blur/blur-gui/0.3.0-incubating-SNAPSHOT/blur-gui-0.3.0-incubating-SNAPSHOT.pom
[JENKINS] Archiving <https://builds.apache.org/job/Blur-master-jdk6/ws/pom.xml> to /home/hudson/hudson/jobs/Blur-master-jdk6/modules/org.apache.blur$blur/builds/2013-09-22_01-37-19/archive/org.apache.blur/blur/0.3.0-incubating-SNAPSHOT/blur-0.3.0-incubating-SNAPSHOT.pom
[JENKINS] Archiving <https://builds.apache.org/job/Blur-master-jdk6/ws/blur-util/pom.xml>
to /home/hudson/hudson/jobs/Blur-master-jdk6/modules/org.apache.blur$blur-util/builds/2013-09-22_01-37-19/archive/org.apache.blur/blur-util/0.3.0-incubating-SNAPSHOT/blur-util-0.3.0-incubating-SNAPSHOT.pom
[JENKINS] Archiving <https://builds.apache.org/job/Blur-master-jdk6/ws/blur-store/pom.xml>
to /home/hudson/hudson/jobs/Blur-master-jdk6/modules/org.apache.blur$blur-store/builds/2013-09-22_01-37-19/archive/org.apache.blur/blur-store/0.3.0-incubating-SNAPSHOT/blur-store-0.3.0-incubating-SNAPSHOT.pom
[JENKINS] Archiving <https://builds.apache.org/job/Blur-master-jdk6/ws/blur-thrift/pom.xml>
to /home/hudson/hudson/jobs/Blur-master-jdk6/modules/org.apache.blur$blur-thrift/builds/2013-09-22_01-37-19/archive/org.apache.blur/blur-thrift/0.3.0-incubating-SNAPSHOT/blur-thrift-0.3.0-incubating-SNAPSHOT.pom
[JENKINS] Archiving <https://builds.apache.org/job/Blur-master-jdk6/ws/blur-query/pom.xml>
to /home/hudson/hudson/jobs/Blur-master-jdk6/modules/org.apache.blur$blur-query/builds/2013-09-22_01-37-19/archive/org.apache.blur/blur-query/0.3.0-incubating-SNAPSHOT/blur-query-0.3.0-incubating-SNAPSHOT.pom
[JENKINS] Archiving <https://builds.apache.org/job/Blur-master-jdk6/ws/distribution/pom.xml>
to /home/hudson/hudson/jobs/Blur-master-jdk6/modules/org.apache.blur$apache-blur/builds/2013-09-22_01-37-19/archive/org.apache.blur/apache-blur/0.3.0-incubating-SNAPSHOT/apache-blur-0.3.0-incubating-SNAPSHOT.pom
[JENKINS] Archiving <https://builds.apache.org/job/Blur-master-jdk6/ws/blur-shell/pom.xml>
to /home/hudson/hudson/jobs/Blur-master-jdk6/modules/org.apache.blur$blur-shell/builds/2013-09-22_01-37-19/archive/org.apache.blur/blur-shell/0.3.0-incubating-SNAPSHOT/blur-shell-0.3.0-incubating-SNAPSHOT.pom
[JENKINS] Archiving <https://builds.apache.org/job/Blur-master-jdk6/ws/blur-jdbc/pom.xml>
to /home/hudson/hudson/jobs/Blur-master-jdk6/modules/org.apache.blur$blur-jdbc/builds/2013-09-22_01-37-19/archive/org.apache.blur/blur-jdbc/0.3.0-incubating-SNAPSHOT/blur-jdbc-0.3.0-incubating-SNAPSHOT.pom
Waiting for Jenkins to finish collecting data
Sending e-mails to: blur-dev@incubator.apache.org
Sending e-mails to: blur-dev@incubator.apache.org
channel stopped

Mime
View raw message