incubator-bigtop-dev mailing list archives

Site index · List index
Message view « Date » · « Thread »
Top « Date » · « Thread »
From Apache Jenkins Server <jenk...@builds.apache.org>
Subject Build failed in Jenkins: Bigtop-trunk #217
Date Fri, 14 Sep 2012 04:57:49 GMT
See <https://builds.apache.org/job/Bigtop-trunk/217/changes>

Changes:

[bmahe] BIGTOP-701. Bigtop Hadoop package does not include bash tab completion (Sean Mackrory
via Bruno Mahé)

------------------------------------------
[...truncated 504 lines...]
[WARNING] Entry: bigtop-0.5.0-incubating-SNAPSHOT/bigtop-tests/test-artifacts/package/src/main/resources/apt/giraph.xml
longer than 100 characters.
[WARNING] Entry: bigtop-0.5.0-incubating-SNAPSHOT/bigtop-tests/test-artifacts/package/src/main/resources/apt/whirr.xml
longer than 100 characters.
[WARNING] Entry: bigtop-0.5.0-incubating-SNAPSHOT/bigtop-tests/test-artifacts/package/src/main/resources/apt/flume-node.xml
longer than 100 characters.
[WARNING] Entry: bigtop-0.5.0-incubating-SNAPSHOT/bigtop-tests/test-artifacts/package/src/main/resources/apt/hadoop-hdfs-secondarynamenode.xml
longer than 100 characters.
[WARNING] Entry: bigtop-0.5.0-incubating-SNAPSHOT/bigtop-tests/test-artifacts/package/src/main/resources/apt/hadoop-hdfs.xml
longer than 100 characters.
[WARNING] Entry: bigtop-0.5.0-incubating-SNAPSHOT/bigtop-tests/test-artifacts/package/src/main/resources/apt/hadoop-pipes.xml
longer than 100 characters.
[WARNING] Entry: bigtop-0.5.0-incubating-SNAPSHOT/bigtop-tests/test-artifacts/package/src/main/resources/apt/hadoop-namenode.xml
longer than 100 characters.
[WARNING] Entry: bigtop-0.5.0-incubating-SNAPSHOT/bigtop-tests/test-artifacts/package/src/main/resources/apt/oozie.xml
longer than 100 characters.
[WARNING] Entry: bigtop-0.5.0-incubating-SNAPSHOT/bigtop-tests/test-artifacts/package/src/main/resources/apt/hadoop-mapreduce-historyserver.xml
longer than 100 characters.
[WARNING] Entry: bigtop-0.5.0-incubating-SNAPSHOT/bigtop-tests/test-artifacts/package/src/main/resources/apt/hadoop-client.xml
longer than 100 characters.
[WARNING] Entry: bigtop-0.5.0-incubating-SNAPSHOT/bigtop-tests/test-artifacts/package/src/main/resources/apt/hive-metastore.xml
longer than 100 characters.
[WARNING] Entry: bigtop-0.5.0-incubating-SNAPSHOT/bigtop-tests/test-artifacts/package/src/main/groovy/org/apache/bigtop/itest/packagesmoke/StateVerifierFlume.groovy
longer than 100 characters.
[WARNING] Entry: bigtop-0.5.0-incubating-SNAPSHOT/bigtop-tests/test-artifacts/package/src/main/groovy/org/apache/bigtop/itest/packagesmoke/TestPackagesPseudoDistributedState.groovy
longer than 100 characters.
[WARNING] Entry: bigtop-0.5.0-incubating-SNAPSHOT/bigtop-tests/test-artifacts/package/src/main/groovy/org/apache/bigtop/itest/packagesmoke/TestPackagesPseudoDistributed.groovy
longer than 100 characters.
[WARNING] Entry: bigtop-0.5.0-incubating-SNAPSHOT/bigtop-tests/test-artifacts/package/src/main/groovy/org/apache/bigtop/itest/packagesmoke/TestServicesCreateState.groovy
longer than 100 characters.
[WARNING] Entry: bigtop-0.5.0-incubating-SNAPSHOT/bigtop-tests/test-artifacts/package/src/main/groovy/org/apache/bigtop/itest/packagesmoke/CDHUpgradeSequence.groovy
longer than 100 characters.
[WARNING] Entry: bigtop-0.5.0-incubating-SNAPSHOT/bigtop-tests/test-artifacts/package/src/main/groovy/org/apache/bigtop/itest/packagesmoke/TestServices.groovy
longer than 100 characters.
[WARNING] Entry: bigtop-0.5.0-incubating-SNAPSHOT/bigtop-tests/test-artifacts/package/src/main/groovy/org/apache/bigtop/itest/packagesmoke/TestPackagesPseudoDistributedUpgrade.groovy
longer than 100 characters.
[WARNING] Entry: bigtop-0.5.0-incubating-SNAPSHOT/bigtop-tests/test-artifacts/package/src/main/groovy/org/apache/bigtop/itest/packagesmoke/StateVerifierHue.groovy
longer than 100 characters.
[WARNING] Entry: bigtop-0.5.0-incubating-SNAPSHOT/bigtop-tests/test-artifacts/package/src/main/groovy/org/apache/bigtop/itest/packagesmoke/StateVerifierZookeeper.groovy
longer than 100 characters.
[WARNING] Entry: bigtop-0.5.0-incubating-SNAPSHOT/bigtop-tests/test-artifacts/package/src/main/groovy/org/apache/bigtop/itest/packagesmoke/StateVerifierOozie.groovy
longer than 100 characters.
[WARNING] Entry: bigtop-0.5.0-incubating-SNAPSHOT/bigtop-tests/test-artifacts/package/src/main/groovy/org/apache/bigtop/itest/packagesmoke/StateVerifierSqoop.groovy
longer than 100 characters.
[WARNING] Entry: bigtop-0.5.0-incubating-SNAPSHOT/bigtop-tests/test-artifacts/package/src/main/groovy/org/apache/bigtop/itest/packagesmoke/TestPackagesBasics.groovy
longer than 100 characters.
[WARNING] Entry: bigtop-0.5.0-incubating-SNAPSHOT/bigtop-tests/test-artifacts/package/src/main/groovy/org/apache/bigtop/itest/packagesmoke/PackageTestErrorProxy.java
longer than 100 characters.
[WARNING] Entry: bigtop-0.5.0-incubating-SNAPSHOT/bigtop-tests/test-artifacts/package/src/main/groovy/org/apache/bigtop/itest/packagesmoke/TestPackagesPseudoDistributedWithRM.groovy
longer than 100 characters.
[WARNING] Entry: bigtop-0.5.0-incubating-SNAPSHOT/bigtop-tests/test-artifacts/package/src/main/groovy/org/apache/bigtop/itest/packagesmoke/PackageTestMatchers.java
longer than 100 characters.
[WARNING] Entry: bigtop-0.5.0-incubating-SNAPSHOT/bigtop-tests/test-artifacts/package/src/main/groovy/org/apache/bigtop/itest/packagesmoke/CDHServices.groovy
longer than 100 characters.
[WARNING] Entry: bigtop-0.5.0-incubating-SNAPSHOT/bigtop-tests/test-artifacts/package/src/main/groovy/org/apache/bigtop/itest/packagesmoke/PackageTestRepoMgr.groovy
longer than 100 characters.
[WARNING] Entry: bigtop-0.5.0-incubating-SNAPSHOT/bigtop-tests/test-artifacts/package/src/main/groovy/org/apache/bigtop/itest/packagesmoke/PackageTestCommon.groovy
longer than 100 characters.
[WARNING] Entry: bigtop-0.5.0-incubating-SNAPSHOT/bigtop-tests/test-artifacts/package/src/main/groovy/org/apache/bigtop/itest/packagesmoke/TestServicesCreateStateMissing.groovy
longer than 100 characters.
[WARNING] Entry: bigtop-0.5.0-incubating-SNAPSHOT/bigtop-tests/test-artifacts/package/src/main/groovy/org/apache/bigtop/itest/packagesmoke/StateVerifier.groovy
longer than 100 characters.
[WARNING] Entry: bigtop-0.5.0-incubating-SNAPSHOT/bigtop-tests/test-artifacts/package/src/main/groovy/org/apache/bigtop/itest/packagesmoke/StateVerifierMapreduce.groovy
longer than 100 characters.
[WARNING] Entry: bigtop-0.5.0-incubating-SNAPSHOT/bigtop-tests/test-artifacts/package/src/main/groovy/org/apache/bigtop/itest/packagesmoke/StateVerifierHive.groovy
longer than 100 characters.
[WARNING] Entry: bigtop-0.5.0-incubating-SNAPSHOT/bigtop-tests/test-artifacts/package/src/main/groovy/org/apache/bigtop/itest/packagesmoke/DeployCDH.groovy
longer than 100 characters.
[WARNING] Entry: bigtop-0.5.0-incubating-SNAPSHOT/bigtop-tests/test-artifacts/package/src/main/groovy/org/apache/bigtop/itest/packagesmoke/StateVerifierHDFS.groovy
longer than 100 characters.
[WARNING] Entry: bigtop-0.5.0-incubating-SNAPSHOT/bigtop-tests/test-artifacts/package/src/main/groovy/org/apache/bigtop/itest/packagesmoke/TestServicesVerifyState.groovy
longer than 100 characters.
[WARNING] Entry: bigtop-0.5.0-incubating-SNAPSHOT/bigtop-tests/test-artifacts/package/src/main/groovy/org/apache/bigtop/itest/packagesmoke/StateVerifierHBase.groovy
longer than 100 characters.
[WARNING] Entry: bigtop-0.5.0-incubating-SNAPSHOT/bigtop-tests/test-artifacts/hue/src/main/groovy/org/apache/bigtop/itest/huesmoke/TestHueSmoke.groovy
longer than 100 characters.
[WARNING] Entry: bigtop-0.5.0-incubating-SNAPSHOT/bigtop-tests/test-artifacts/sqoop/src/main/resources/hbase-sqoop/expected-hbase-output.txt
longer than 100 characters.
[WARNING] Entry: bigtop-0.5.0-incubating-SNAPSHOT/bigtop-tests/test-artifacts/sqoop/src/main/resources/hbase-sqoop/drop-table.hxt
longer than 100 characters.
[WARNING] Entry: bigtop-0.5.0-incubating-SNAPSHOT/bigtop-tests/test-artifacts/sqoop/src/main/resources/hbase-sqoop/mysql-create-db.sql
longer than 100 characters.
[WARNING] Entry: bigtop-0.5.0-incubating-SNAPSHOT/bigtop-tests/test-artifacts/sqoop/src/main/resources/hbase-sqoop/select-table.hxt
longer than 100 characters.
[WARNING] Entry: bigtop-0.5.0-incubating-SNAPSHOT/bigtop-tests/test-artifacts/sqoop/src/main/resources/hbase-sqoop/mysql-load-db.sql
longer than 100 characters.
[WARNING] Entry: bigtop-0.5.0-incubating-SNAPSHOT/bigtop-tests/test-artifacts/sqoop/src/main/resources/hbase-sqoop/create-table.hxt
longer than 100 characters.
[WARNING] Entry: bigtop-0.5.0-incubating-SNAPSHOT/bigtop-tests/test-artifacts/sqoop/src/main/resources/hive-sqoop/mysql-load-db.sql
longer than 100 characters.
[WARNING] Entry: bigtop-0.5.0-incubating-SNAPSHOT/bigtop-tests/test-artifacts/sqoop/src/main/resources/hive-sqoop/expected-hive-output.txt
longer than 100 characters.
[WARNING] Entry: bigtop-0.5.0-incubating-SNAPSHOT/bigtop-tests/test-artifacts/sqoop/src/main/resources/hive-sqoop/hive-select-table.hql
longer than 100 characters.
[WARNING] Entry: bigtop-0.5.0-incubating-SNAPSHOT/bigtop-tests/test-artifacts/sqoop/src/main/resources/hive-sqoop/hive-drop-table.hql
longer than 100 characters.
[WARNING] Entry: bigtop-0.5.0-incubating-SNAPSHOT/bigtop-tests/test-artifacts/sqoop/src/main/resources/hive-sqoop/mysql-create-db.sql
longer than 100 characters.
[WARNING] Entry: bigtop-0.5.0-incubating-SNAPSHOT/bigtop-tests/test-artifacts/sqoop/src/main/groovy/org/apache/bigtop/itest/integration/sqoop/IntegrationTestSqoopHBase.groovy
longer than 100 characters.
[WARNING] Entry: bigtop-0.5.0-incubating-SNAPSHOT/bigtop-tests/test-artifacts/sqoop/src/main/groovy/org/apache/bigtop/itest/integration/sqoop/IntegrationTestSqoopHive.groovy
longer than 100 characters.
[WARNING] Entry: bigtop-0.5.0-incubating-SNAPSHOT/bigtop-tests/test-artifacts/flume/src/main/resources/FlumeSmokeDeflate/flume-site.xml
longer than 100 characters.
[WARNING] Entry: bigtop-0.5.0-incubating-SNAPSHOT/bigtop-tests/test-artifacts/flume/src/main/resources/FlumeSmokeBzip2/flume-site.xml
longer than 100 characters.
[WARNING] Entry: bigtop-0.5.0-incubating-SNAPSHOT/bigtop-tests/test-artifacts/flume/src/main/resources/FlumeSmokeGzip/flume-site.xml
longer than 100 characters.
[WARNING] Entry: bigtop-0.5.0-incubating-SNAPSHOT/bigtop-tests/test-artifacts/flume/src/main/groovy/org/apache/bigtop/itest/flumesmoke/TestFlumeSmoke.groovy
longer than 100 characters.
[WARNING] Entry: bigtop-0.5.0-incubating-SNAPSHOT/bigtop-tests/test-artifacts/oozie/src/main/groovy/org/apache/bigtop/itest/ooziesmoke/TestOozieSmoke.groovy
longer than 100 characters.
[WARNING] Entry: bigtop-0.5.0-incubating-SNAPSHOT/bigtop-tests/test-artifacts/hadoop/src/main/groovy/org/apache/bigtop/itest/hdfstests/TestHDFSQuota.groovy
longer than 100 characters.
[WARNING] Entry: bigtop-0.5.0-incubating-SNAPSHOT/bigtop-tests/test-artifacts/hadoop/src/main/groovy/org/apache/bigtop/itest/hdfstests/TestDFSAdmin.groovy
longer than 100 characters.
[WARNING] Entry: bigtop-0.5.0-incubating-SNAPSHOT/bigtop-tests/test-artifacts/hadoop/src/main/groovy/org/apache/bigtop/itest/hdfstests/TestFsck.groovy
longer than 100 characters.
[WARNING] Entry: bigtop-0.5.0-incubating-SNAPSHOT/bigtop-tests/test-artifacts/hadoop/src/main/groovy/org/apache/bigtop/itest/hdfstests/TestHDFSBalancer.groovy
longer than 100 characters.
[WARNING] Entry: bigtop-0.5.0-incubating-SNAPSHOT/bigtop-tests/test-artifacts/hadoop/src/main/groovy/org/apache/bigtop/itest/hadoopexamples/TestHadoopExamples.groovy
longer than 100 characters.
[WARNING] Entry: bigtop-0.5.0-incubating-SNAPSHOT/bigtop-tests/test-artifacts/hadoop/src/main/groovy/org/apache/bigtop/itest/hadooptests/TestCLI.java
longer than 100 characters.
[WARNING] Entry: bigtop-0.5.0-incubating-SNAPSHOT/bigtop-tests/test-artifacts/hadoop/src/main/groovy/org/apache/bigtop/itest/hadooptests/FSCmdExecutor.java
longer than 100 characters.
[WARNING] Entry: bigtop-0.5.0-incubating-SNAPSHOT/bigtop-tests/test-artifacts/hadoop/src/main/groovy/org/apache/bigtop/itest/hadoopsmoke/TestHadoopSmoke.groovy
longer than 100 characters.
[WARNING] Entry: bigtop-0.5.0-incubating-SNAPSHOT/bigtop-tests/test-artifacts/hadoop/src/main/resources/clitest_data/testConf.xml
longer than 100 characters.
[WARNING] Entry: bigtop-0.5.0-incubating-SNAPSHOT/bigtop-tests/test-artifacts/hadoop/src/main/resources/clitest_data/data60bytes
longer than 100 characters.
[WARNING] Entry: bigtop-0.5.0-incubating-SNAPSHOT/bigtop-tests/test-artifacts/hadoop/src/main/resources/clitest_data/data120bytes
longer than 100 characters.
[WARNING] Entry: bigtop-0.5.0-incubating-SNAPSHOT/bigtop-tests/test-artifacts/hadoop/src/main/resources/clitest_data/data15bytes
longer than 100 characters.
[WARNING] Entry: bigtop-0.5.0-incubating-SNAPSHOT/bigtop-tests/test-artifacts/hadoop/src/main/resources/clitest_data/data30bytes
longer than 100 characters.
[WARNING] Entry: bigtop-0.5.0-incubating-SNAPSHOT/bigtop-tests/test-artifacts/hadoop/src/main/resources/examples/ints/file1.txt
longer than 100 characters.
[WARNING] Entry: bigtop-0.5.0-incubating-SNAPSHOT/bigtop-tests/test-artifacts/hadoop/src/main/resources/examples/ints/file2.txt
longer than 100 characters.
[WARNING] Entry: bigtop-0.5.0-incubating-SNAPSHOT/bigtop-tests/test-artifacts/hadoop/src/main/resources/examples/text/pg11.txt
longer than 100 characters.
[WARNING] Entry: bigtop-0.5.0-incubating-SNAPSHOT/bigtop-tests/test-artifacts/hadoop/src/main/resources/examples/text/pg2265.txt
longer than 100 characters.
[WARNING] Entry: bigtop-0.5.0-incubating-SNAPSHOT/bigtop-tests/test-artifacts/mahout/src/main/groovy/org/apache/bigtop/itest/mahout/smoke/TestMahoutExamples.groovy
longer than 100 characters.
[WARNING] Entry: bigtop-0.5.0-incubating-SNAPSHOT/bigtop-tests/test-artifacts/hbase/src/main/groovy/org/apache/bigtop/itest/hbase/util/HBaseTestUtil.java
longer than 100 characters.
[WARNING] Entry: bigtop-0.5.0-incubating-SNAPSHOT/bigtop-tests/test-artifacts/hbase/src/main/groovy/org/apache/bigtop/itest/hbase/system/TestMoveRootMetaRegions.java
longer than 100 characters.
[WARNING] Entry: bigtop-0.5.0-incubating-SNAPSHOT/bigtop-tests/test-artifacts/hbase/src/main/groovy/org/apache/bigtop/itest/hbase/system/TestLoadAndVerify.java
longer than 100 characters.
[WARNING] Entry: bigtop-0.5.0-incubating-SNAPSHOT/bigtop-tests/test-artifacts/hbase/src/main/groovy/org/apache/bigtop/itest/hbase/system/Putter.java
longer than 100 characters.
[WARNING] Entry: bigtop-0.5.0-incubating-SNAPSHOT/bigtop-tests/test-artifacts/hbase/src/main/groovy/org/apache/bigtop/itest/hbase/system/TestRegionMover.java
longer than 100 characters.
[WARNING] Entry: bigtop-0.5.0-incubating-SNAPSHOT/bigtop-tests/test-artifacts/hbase/src/main/groovy/org/apache/bigtop/itest/hbase/system/TestConcurrentScanAndPut.java
longer than 100 characters.
[WARNING] Entry: bigtop-0.5.0-incubating-SNAPSHOT/bigtop-tests/test-artifacts/hbase/src/main/groovy/org/apache/bigtop/itest/hbase/system/Scanner.java
longer than 100 characters.
[WARNING] Entry: bigtop-0.5.0-incubating-SNAPSHOT/bigtop-tests/test-artifacts/hbase/src/main/groovy/org/apache/bigtop/itest/hbase/smoke/TestHBaseCompression.groovy
longer than 100 characters.
[WARNING] Entry: bigtop-0.5.0-incubating-SNAPSHOT/bigtop-tests/test-artifacts/hbase/src/main/groovy/org/apache/bigtop/itest/hbase/smoke/TestHBaseSmoke.java
longer than 100 characters.
[WARNING] Entry: bigtop-0.5.0-incubating-SNAPSHOT/bigtop-tests/test-artifacts/hbase/src/main/groovy/org/apache/bigtop/itest/hbase/smoke/TestHbck.groovy
longer than 100 characters.
[WARNING] Entry: bigtop-0.5.0-incubating-SNAPSHOT/bigtop-tests/test-artifacts/hbase/src/main/groovy/org/apache/bigtop/itest/hbase/smoke/TestHBaseImportExport.groovy
longer than 100 characters.
[WARNING] Entry: bigtop-0.5.0-incubating-SNAPSHOT/bigtop-tests/test-artifacts/hbase/src/main/groovy/org/apache/bigtop/itest/hbase/smoke/TestLoadIncrementalHFiles.java
longer than 100 characters.
[WARNING] Entry: bigtop-0.5.0-incubating-SNAPSHOT/bigtop-tests/test-artifacts/hbase/src/main/groovy/org/apache/bigtop/itest/hbase/smoke/TestCopyTable.java
longer than 100 characters.
[WARNING] Entry: bigtop-0.5.0-incubating-SNAPSHOT/bigtop-tests/test-artifacts/hbase/src/main/groovy/org/apache/bigtop/itest/hbase/smoke/TestHFileOutputFormat.java
longer than 100 characters.
[WARNING] Entry: bigtop-0.5.0-incubating-SNAPSHOT/bigtop-tests/test-artifacts/hbase/src/main/groovy/org/apache/bigtop/itest/hbase/smoke/TestHBaseBalancer.groovy
longer than 100 characters.
[WARNING] Entry: bigtop-0.5.0-incubating-SNAPSHOT/bigtop-tests/test-artifacts/hbase/src/main/groovy/org/apache/bigtop/itest/hbase/smoke/IncrementalPELoad.java
longer than 100 characters.
[WARNING] Entry: bigtop-0.5.0-incubating-SNAPSHOT/bigtop-tests/test-artifacts/hbase/src/main/groovy/org/apache/bigtop/itest/hbase/smoke/TestHBasePigSmoke.groovy
longer than 100 characters.
[WARNING] Entry: bigtop-0.5.0-incubating-SNAPSHOT/bigtop-tests/test-artifacts/hbase/src/main/groovy/org/apache/bigtop/itest/hbase/smoke/TestImportTsv.groovy
longer than 100 characters.
[WARNING] Entry: bigtop-0.5.0-incubating-SNAPSHOT/bigtop-tests/test-artifacts/giraph/src/main/groovy/org/apache/bigtop/itest/giraphsmoke/TestGiraphSmoke.groovy
longer than 100 characters.
[WARNING] Entry: bigtop-0.5.0-incubating-SNAPSHOT/bigtop-tests/test-artifacts/sqoop-smokes/src/main/groovy/org/apache/itest/sqoop/TestSqoopImport.groovy
longer than 100 characters.
[WARNING] Entry: bigtop-0.5.0-incubating-SNAPSHOT/bigtop-tests/test-artifacts/sqoop-smokes/src/main/groovy/org/apache/itest/sqoop/TestSqoopExport.groovy
longer than 100 characters.
[WARNING] Entry: bigtop-0.5.0-incubating-SNAPSHOT/bigtop-tests/test-artifacts/sqoop-smokes/src/main/resources/mysql-files/mysql-create-tables.sql
longer than 100 characters.
[WARNING] Entry: bigtop-0.5.0-incubating-SNAPSHOT/bigtop-tests/test-artifacts/sqoop-smokes/src/main/resources/mysql-files/sqoop-t_int.out
longer than 100 characters.
[WARNING] Entry: bigtop-0.5.0-incubating-SNAPSHOT/bigtop-tests/test-artifacts/sqoop-smokes/src/main/resources/mysql-files/mysql-insert-data.sql
longer than 100 characters.
[WARNING] Entry: bigtop-0.5.0-incubating-SNAPSHOT/bigtop-tests/test-artifacts/sqoop-smokes/src/main/resources/mysql-files/sqoop-testtable.out
longer than 100 characters.
[WARNING] Entry: bigtop-0.5.0-incubating-SNAPSHOT/bigtop-tests/test-artifacts/sqoop-smokes/src/main/resources/mysql-files/sqoop-columns.out
longer than 100 characters.
[WARNING] Entry: bigtop-0.5.0-incubating-SNAPSHOT/bigtop-tests/test-artifacts/sqoop-smokes/src/main/resources/mysql-files/sqoop-all-tables.out
longer than 100 characters.
[WARNING] Entry: bigtop-0.5.0-incubating-SNAPSHOT/bigtop-tests/test-artifacts/sqoop-smokes/src/main/resources/mysql-files/sqoop-where-clause.out
longer than 100 characters.
[WARNING] Entry: bigtop-0.5.0-incubating-SNAPSHOT/bigtop-tests/test-artifacts/sqoop-smokes/src/main/resources/mysql-files/sqoop-t_fp.out
longer than 100 characters.
[WARNING] Entry: bigtop-0.5.0-incubating-SNAPSHOT/bigtop-tests/test-artifacts/sqoop-smokes/src/main/resources/mysql-files/mysql-create-db.sql
longer than 100 characters.
[WARNING] Entry: bigtop-0.5.0-incubating-SNAPSHOT/bigtop-tests/test-artifacts/sqoop-smokes/src/main/resources/mysql-files/sqoop-t_date.out
longer than 100 characters.
[WARNING] Entry: bigtop-0.5.0-incubating-SNAPSHOT/bigtop-tests/test-artifacts/sqoop-smokes/src/main/resources/mysql-files/sqoop-t_bool-export.out
longer than 100 characters.
[WARNING] Entry: bigtop-0.5.0-incubating-SNAPSHOT/bigtop-tests/test-artifacts/sqoop-smokes/src/main/resources/mysql-files/sqoop-t_bool.out
longer than 100 characters.
[WARNING] Entry: bigtop-0.5.0-incubating-SNAPSHOT/bigtop-tests/test-artifacts/sqoop-smokes/src/main/resources/mysql-files/sqoop-query.out
longer than 100 characters.
[WARNING] Entry: bigtop-0.5.0-incubating-SNAPSHOT/bigtop-tests/test-artifacts/sqoop-smokes/src/main/resources/mysql-files/sqoop-null-string.out
longer than 100 characters.
[WARNING] Entry: bigtop-0.5.0-incubating-SNAPSHOT/bigtop-tests/test-artifacts/sqoop-smokes/src/main/resources/mysql-files/sqoop-t_date-export.out
longer than 100 characters.
[WARNING] Entry: bigtop-0.5.0-incubating-SNAPSHOT/bigtop-tests/test-artifacts/sqoop-smokes/src/main/resources/mysql-files/sqoop-append.out
longer than 100 characters.
[WARNING] Entry: bigtop-0.5.0-incubating-SNAPSHOT/bigtop-tests/test-artifacts/sqoop-smokes/src/main/resources/mysql-files/sqoop-null-non-string.out
longer than 100 characters.
[WARNING] Entry: bigtop-0.5.0-incubating-SNAPSHOT/bigtop-tests/test-artifacts/sqoop-smokes/src/main/resources/mysql-files/sqoop-t_string.out
longer than 100 characters.
[WARNING] Entry: bigtop-0.5.0-incubating-SNAPSHOT/bigtop-tests/test-execution/conf/src/main/resources/org.apache.bigtop.itest.log4j.configuration
longer than 100 characters.
[WARNING] Entry: bigtop-0.5.0-incubating-SNAPSHOT/bigtop-packages/src/common/hadoop/conf.pseudo/hadoop-metrics.properties
longer than 100 characters.
[WARNING] Entry: bigtop-0.5.0-incubating-SNAPSHOT/bigtop-packages/src/common/hadoop/conf.secure/mapred-queue-acls.xml
longer than 100 characters.
[WARNING] Entry: bigtop-0.5.0-incubating-SNAPSHOT/bigtop-packages/src/common/hadoop/conf.secure/hadoop-metrics.properties
longer than 100 characters.
[WARNING] Entry: bigtop-0.5.0-incubating-SNAPSHOT/bigtop-packages/src/common/hadoop/hadoop-hdfs-secondarynamenode.svc
longer than 100 characters.
[WARNING] Entry: bigtop-0.5.0-incubating-SNAPSHOT/bigtop-packages/src/common/hadoop/hadoop-mapreduce-historyserver.svc
longer than 100 characters.
[WARNING] Entry: bigtop-0.5.0-incubating-SNAPSHOT/bigtop-packages/src/deb/hadoop/hadoop-conf-pseudo.lintian-overrides
longer than 100 characters.
[WARNING] Entry: bigtop-0.5.0-incubating-SNAPSHOT/bigtop-deploy/puppet/modules/bigtop_util/lib/puppet/parser/functions/append_each.rb
longer than 100 characters.
[WARNING] Entry: bigtop-0.5.0-incubating-SNAPSHOT/bigtop-deploy/puppet/modules/bigtop_util/lib/puppet/parser/functions/get_setting.rb
longer than 100 characters.
[WARNING] Entry: bigtop-0.5.0-incubating-SNAPSHOT/bigtop-deploy/puppet/modules/hadoop/lib/facter/hadoop_storage_dirs.rb
longer than 100 characters.
[WARNING] Entry: bigtop-0.5.0-incubating-SNAPSHOT/bigtop-deploy/puppet/modules/hadoop/lib/facter/hadoop_storage_locations.rb
longer than 100 characters.
[WARNING] Entry: bigtop-0.5.0-incubating-SNAPSHOT/bigtop-deploy/puppet/modules/hadoop/templates/container-executor.cfg
longer than 100 characters.
[WARNING] Entry: bigtop-0.5.0-incubating-SNAPSHOT/bigtop-test-framework/src/main/groovy/org/apache/bigtop/itest/pmanager/ZypperCmdLinePackageManager.groovy
longer than 100 characters.
[WARNING] Entry: bigtop-0.5.0-incubating-SNAPSHOT/bigtop-test-framework/src/main/groovy/org/apache/bigtop/itest/pmanager/DEBPackage.groovy
longer than 100 characters.
[WARNING] Entry: bigtop-0.5.0-incubating-SNAPSHOT/bigtop-test-framework/src/main/groovy/org/apache/bigtop/itest/pmanager/ManagedPackage.groovy
longer than 100 characters.
[WARNING] Entry: bigtop-0.5.0-incubating-SNAPSHOT/bigtop-test-framework/src/main/groovy/org/apache/bigtop/itest/pmanager/PackageInstance.groovy
longer than 100 characters.
[WARNING] Entry: bigtop-0.5.0-incubating-SNAPSHOT/bigtop-test-framework/src/main/groovy/org/apache/bigtop/itest/pmanager/RPMPackage.groovy
longer than 100 characters.
[WARNING] Entry: bigtop-0.5.0-incubating-SNAPSHOT/bigtop-test-framework/src/main/groovy/org/apache/bigtop/itest/pmanager/UrpmiCmdLinePackageManager.groovy
longer than 100 characters.
[WARNING] Entry: bigtop-0.5.0-incubating-SNAPSHOT/bigtop-test-framework/src/main/groovy/org/apache/bigtop/itest/pmanager/PackageManager.groovy
longer than 100 characters.
[WARNING] Entry: bigtop-0.5.0-incubating-SNAPSHOT/bigtop-test-framework/src/main/groovy/org/apache/bigtop/itest/pmanager/AptCmdLinePackageManager.groovy
longer than 100 characters.
[WARNING] Entry: bigtop-0.5.0-incubating-SNAPSHOT/bigtop-test-framework/src/main/groovy/org/apache/bigtop/itest/pmanager/YumCmdLinePackageManager.groovy
longer than 100 characters.
[WARNING] Entry: bigtop-0.5.0-incubating-SNAPSHOT/bigtop-test-framework/src/main/groovy/org/apache/bigtop/itest/shell/OS.groovy
longer than 100 characters.
[WARNING] Entry: bigtop-0.5.0-incubating-SNAPSHOT/bigtop-test-framework/src/main/groovy/org/apache/bigtop/itest/shell/Shell.groovy
longer than 100 characters.
[WARNING] Entry: bigtop-0.5.0-incubating-SNAPSHOT/bigtop-test-framework/src/main/groovy/org/apache/bigtop/itest/TestListUtils.groovy
longer than 100 characters.
[WARNING] Entry: bigtop-0.5.0-incubating-SNAPSHOT/bigtop-test-framework/src/main/groovy/org/apache/bigtop/itest/LogErrorsUtils.groovy
longer than 100 characters.
[WARNING] Entry: bigtop-0.5.0-incubating-SNAPSHOT/bigtop-test-framework/src/main/groovy/org/apache/bigtop/itest/junit/OrderedParameterized.java
longer than 100 characters.
[WARNING] Entry: bigtop-0.5.0-incubating-SNAPSHOT/bigtop-test-framework/src/main/groovy/org/apache/bigtop/itest/Variable.java
longer than 100 characters.
[WARNING] Entry: bigtop-0.5.0-incubating-SNAPSHOT/bigtop-test-framework/src/main/groovy/org/apache/bigtop/itest/ParameterSetter.java
longer than 100 characters.
[WARNING] Entry: bigtop-0.5.0-incubating-SNAPSHOT/bigtop-test-framework/src/main/groovy/org/apache/bigtop/itest/Property.java
longer than 100 characters.
[WARNING] Entry: bigtop-0.5.0-incubating-SNAPSHOT/bigtop-test-framework/src/main/groovy/org/apache/bigtop/itest/posix/Service.groovy
longer than 100 characters.
[WARNING] Entry: bigtop-0.5.0-incubating-SNAPSHOT/bigtop-test-framework/src/main/groovy/org/apache/bigtop/itest/posix/UGI.groovy
longer than 100 characters.
[WARNING] Entry: bigtop-0.5.0-incubating-SNAPSHOT/bigtop-test-framework/src/main/groovy/org/apache/bigtop/itest/posix/Alternative.groovy
longer than 100 characters.
[WARNING] Entry: bigtop-0.5.0-incubating-SNAPSHOT/bigtop-test-framework/src/main/groovy/org/apache/bigtop/itest/JUnitUtils.groovy
longer than 100 characters.
[WARNING] Entry: bigtop-0.5.0-incubating-SNAPSHOT/bigtop-test-framework/src/main/groovy/org/apache/bigtop/itest/Parameters.java
longer than 100 characters.
[WARNING] Entry: bigtop-0.5.0-incubating-SNAPSHOT/bigtop-test-framework/src/main/groovy/org/apache/bigtop/itest/JarContent.groovy
longer than 100 characters.
[WARNING] Entry: bigtop-0.5.0-incubating-SNAPSHOT/bigtop-test-framework/src/test/groovy/org/apache/bigtop/itest/TestListUtilsTest.groovy
longer than 100 characters.
[WARNING] Entry: bigtop-0.5.0-incubating-SNAPSHOT/bigtop-test-framework/src/test/groovy/org/apache/bigtop/itest/pmanager/PackageManagerTest.groovy
longer than 100 characters.
[WARNING] Entry: bigtop-0.5.0-incubating-SNAPSHOT/bigtop-test-framework/src/test/groovy/org/apache/bigtop/itest/DummyTestPass.groovy
longer than 100 characters.
[WARNING] Entry: bigtop-0.5.0-incubating-SNAPSHOT/bigtop-test-framework/src/test/groovy/org/apache/bigtop/itest/JarContentTest.groovy
longer than 100 characters.
[WARNING] Entry: bigtop-0.5.0-incubating-SNAPSHOT/bigtop-test-framework/src/test/groovy/org/apache/bigtop/itest/DummyTestError.groovy
longer than 100 characters.
[WARNING] Entry: bigtop-0.5.0-incubating-SNAPSHOT/bigtop-test-framework/src/test/groovy/org/apache/bigtop/itest/shell/ShellTest.groovy
longer than 100 characters.
[WARNING] Entry: bigtop-0.5.0-incubating-SNAPSHOT/bigtop-test-framework/src/test/groovy/org/apache/bigtop/itest/JUnitUtilsTest.groovy
longer than 100 characters.
[WARNING] Entry: bigtop-0.5.0-incubating-SNAPSHOT/bigtop-test-framework/src/test/groovy/org/apache/bigtop/itest/junit/OrderedParameterizedTest.groovy
longer than 100 characters.
[WARNING] Entry: bigtop-0.5.0-incubating-SNAPSHOT/bigtop-test-framework/src/test/groovy/org/apache/bigtop/itest/DummyTestFail.groovy
longer than 100 characters.
[WARNING] Entry: bigtop-0.5.0-incubating-SNAPSHOT/bigtop-test-framework/src/test/groovy/org/apache/bigtop/itest/posix/UGITest.groovy
longer than 100 characters.
[WARNING] Entry: bigtop-0.5.0-incubating-SNAPSHOT/bigtop-test-framework/src/test/groovy/org/apache/bigtop/itest/posix/ServiceTest.groovy
longer than 100 characters.
[WARNING] Entry: bigtop-0.5.0-incubating-SNAPSHOT/bigtop-test-framework/src/test/groovy/org/apache/bigtop/itest/posix/AlternativeTest.groovy
longer than 100 characters.
mojoFailed org.apache.maven.plugins:maven-assembly-plugin:2.3(default)
projectFailed org.apache.bigtop:bigtop:0.5.0-incubating-SNAPSHOT
sessionEnded
[INFO] ------------------------------------------------------------------------
[INFO] BUILD FAILURE
[INFO] ------------------------------------------------------------------------
[INFO] Total time: 3:55.040s
[INFO] Finished at: Fri Sep 14 04:52:56 GMT+00:00 2012
[INFO] Final Memory: 14M/260M
[INFO] ------------------------------------------------------------------------
Projects to build: [MavenProject: org.apache.bigtop:bigtop:0.5.0-incubating-SNAPSHOT @ <https://builds.apache.org/job/Bigtop-trunk/ws/trunk/pom.xml]>
[JENKINS] Archiving <https://builds.apache.org/job/Bigtop-trunk/ws/trunk/pom.xml> to
/home/hudson/hudson/jobs/Bigtop-trunk/modules/org.apache.bigtop$bigtop/builds/2012-09-14_04-47-15/archive/org.apache.bigtop/bigtop/0.5.0-incubating-SNAPSHOT/bigtop-0.5.0-incubating-SNAPSHOT.pom
[JENKINS] Archiving <https://builds.apache.org/job/Bigtop-trunk/ws/trunk/target/bigtop-0.5.0-incubating-SNAPSHOT-project.tar.gz>
to /home/hudson/hudson/jobs/Bigtop-trunk/modules/org.apache.bigtop$bigtop/builds/2012-09-14_04-47-15/archive/org.apache.bigtop/bigtop/0.5.0-incubating-SNAPSHOT/bigtop-0.5.0-incubating-SNAPSHOT-project.tar.gz
Waiting for Jenkins to finish collecting data
mavenExecutionResult exceptions not empty
message : Failed to execute goal org.apache.maven.plugins:maven-assembly-plugin:2.3:single
(default) on project bigtop: Failed to create assembly: Error creating assembly archive project:
Failed to quote directory: '<https://builds.apache.org/job/Bigtop-trunk/ws/trunk/.'>
cause : Failed to create assembly: Error creating assembly archive project: Failed to quote
directory: '<https://builds.apache.org/job/Bigtop-trunk/ws/trunk/.'>
Stack trace : 
org.apache.maven.lifecycle.LifecycleExecutionException: Failed to execute goal org.apache.maven.plugins:maven-assembly-plugin:2.3:single
(default) on project bigtop: Failed to create assembly: Error creating assembly archive project:
Failed to quote directory: '<https://builds.apache.org/job/Bigtop-trunk/ws/trunk/.'>
	at org.apache.maven.lifecycle.internal.MojoExecutor.execute(MojoExecutor.java:217)
	at org.apache.maven.lifecycle.internal.MojoExecutor.execute(MojoExecutor.java:153)
	at org.apache.maven.lifecycle.internal.MojoExecutor.execute(MojoExecutor.java:145)
	at org.apache.maven.lifecycle.internal.LifecycleModuleBuilder.buildProject(LifecycleModuleBuilder.java:84)
	at org.apache.maven.lifecycle.internal.LifecycleModuleBuilder.buildProject(LifecycleModuleBuilder.java:59)
	at org.apache.maven.lifecycle.internal.LifecycleStarter.singleThreadedBuild(LifecycleStarter.java:183)
	at org.apache.maven.lifecycle.internal.LifecycleStarter.execute(LifecycleStarter.java:161)
	at org.apache.maven.DefaultMaven.doExecute(DefaultMaven.java:319)
	at org.apache.maven.DefaultMaven.execute(DefaultMaven.java:156)
	at org.jvnet.hudson.maven3.launcher.Maven3Launcher.main(Maven3Launcher.java:79)
	at sun.reflect.NativeMethodAccessorImpl.invoke0(Native Method)
	at sun.reflect.NativeMethodAccessorImpl.invoke(NativeMethodAccessorImpl.java:39)
	at sun.reflect.DelegatingMethodAccessorImpl.invoke(DelegatingMethodAccessorImpl.java:25)
	at java.lang.reflect.Method.invoke(Method.java:597)
	at org.codehaus.plexus.classworlds.launcher.Launcher.launchStandard(Launcher.java:329)
	at org.codehaus.plexus.classworlds.launcher.Launcher.launch(Launcher.java:239)
	at org.jvnet.hudson.maven3.agent.Maven3Main.launch(Maven3Main.java:158)
	at hudson.maven.Maven3Builder.call(Maven3Builder.java:98)
	at hudson.maven.Maven3Builder.call(Maven3Builder.java:64)
	at hudson.remoting.UserRequest.perform(UserRequest.java:118)
	at hudson.remoting.UserRequest.perform(UserRequest.java:48)
	at hudson.remoting.Request$2.run(Request.java:326)
	at hudson.remoting.InterceptingExecutorService$1.call(InterceptingExecutorService.java:72)
	at java.util.concurrent.FutureTask$Sync.innerRun(FutureTask.java:303)
	at java.util.concurrent.FutureTask.run(FutureTask.java:138)
	at java.util.concurrent.ThreadPoolExecutor$Worker.runTask(ThreadPoolExecutor.java:886)
	at java.util.concurrent.ThreadPoolExecutor$Worker.run(ThreadPoolExecutor.java:908)
	at java.lang.Thread.run(Thread.java:662)
Caused by: org.apache.maven.plugin.MojoExecutionException: Failed to create assembly: Error
creating assembly archive project: Failed to quote directory: '<https://builds.apache.org/job/Bigtop-trunk/ws/trunk/.'>
	at org.apache.maven.plugin.assembly.mojos.AbstractAssemblyMojo.execute(AbstractAssemblyMojo.java:511)
	at org.apache.maven.plugin.DefaultBuildPluginManager.executeMojo(DefaultBuildPluginManager.java:101)
	at org.apache.maven.lifecycle.internal.MojoExecutor.execute(MojoExecutor.java:209)
	... 27 more
Caused by: org.apache.maven.plugin.assembly.archive.ArchiveCreationException: Error creating
assembly archive project: Failed to quote directory: '<https://builds.apache.org/job/Bigtop-trunk/ws/trunk/.'>
	at org.apache.maven.plugin.assembly.archive.DefaultAssemblyArchiver.createArchive(DefaultAssemblyArchiver.java:189)
	at org.apache.maven.plugin.assembly.mojos.AbstractAssemblyMojo.execute(AbstractAssemblyMojo.java:452)
	... 29 more
Caused by: org.codehaus.plexus.archiver.ArchiverException: Failed to quote directory: '<https://builds.apache.org/job/Bigtop-trunk/ws/trunk/.'>
	at org.codehaus.plexus.archiver.AbstractArchiver$1.hasNext(AbstractArchiver.java:459)
	at org.apache.maven.plugin.assembly.filter.ComponentsXmlArchiverFileFilter.finalizeArchiveCreation(ComponentsXmlArchiverFileFilter.java:166)
	at org.codehaus.plexus.archiver.AbstractArchiver.runArchiveFinalizers(AbstractArchiver.java:871)
	at org.codehaus.plexus.archiver.AbstractArchiver.createArchive(AbstractArchiver.java:895)
	at org.apache.maven.plugin.assembly.archive.archiver.AssemblyProxyArchiver.createArchive(AssemblyProxyArchiver.java:512)
	at org.apache.maven.plugin.assembly.archive.DefaultAssemblyArchiver.createArchive(DefaultAssemblyArchiver.java:185)
	... 30 more
Caused by: java.io.IOException: Failed to quote directory: '<https://builds.apache.org/job/Bigtop-trunk/ws/trunk/.'>
	at org.codehaus.plexus.components.io.attributes.PlexusIoResourceAttributeUtils.getFileAttributesByPath(PlexusIoResourceAttributeUtils.java:256)
	at org.codehaus.plexus.components.io.attributes.PlexusIoResourceAttributeUtils.getFileAttributesByPath(PlexusIoResourceAttributeUtils.java:195)
	at org.codehaus.plexus.components.io.resources.PlexusIoFileResourceCollection.getResources(PlexusIoFileResourceCollection.java:189)
	at org.codehaus.plexus.archiver.AbstractArchiver$1.hasNext(AbstractArchiver.java:455)
	... 35 more
Caused by: org.codehaus.plexus.util.cli.CommandLineException: Error while executing process.
	at org.codehaus.plexus.util.cli.Commandline.execute(Commandline.java:656)
	at org.codehaus.plexus.util.cli.CommandLineUtils.executeCommandLineAsCallable(CommandLineUtils.java:140)
	at org.codehaus.plexus.components.io.attributes.PlexusIoResourceAttributeUtils.getFileAttributesByPath(PlexusIoResourceAttributeUtils.java:247)
	... 38 more
Caused by: java.io.IOException: Cannot run program "/bin/sh": error=12, Not enough space
	at java.lang.ProcessBuilder.start(ProcessBuilder.java:460)
	at java.lang.Runtime.exec(Runtime.java:593)
	at java.lang.Runtime.exec(Runtime.java:509)
	at org.codehaus.plexus.util.cli.Commandline.execute(Commandline.java:636)
	... 40 more
Caused by: java.io.IOException: error=12, Not enough space
	at java.lang.UNIXProcess.forkAndExec(Native Method)
	at java.lang.UNIXProcess.<init>(UNIXProcess.java:53)
	at java.lang.ProcessImpl.start(ProcessImpl.java:65)
	at java.lang.ProcessBuilder.start(ProcessBuilder.java:453)
	... 43 more
Sending e-mails to: bigtop-dev@incubator.apache.org
channel stopped

Mime
View raw message