incubator-bigtop-dev mailing list archives

Site index · List index
Message view « Date » · « Thread »
Top « Date » · « Thread »
From Apache Jenkins Server <jenk...@builds.apache.org>
Subject Build failed in Jenkins: Bigtop-trunk-testartifacts » hivesmoke #260
Date Thu, 26 Jul 2012 22:18:27 GMT
See <https://builds.apache.org/job/Bigtop-trunk-testartifacts/org.apache.bigtop.itest$hive-smoke/260/changes>

Changes:

[bmahe] BIGTOP-685. Provide a way to specify the parameters expected by a test (Wing Yew Poon
via Bruno Mahé)

------------------------------------------
projectStarted org.apache.bigtop.itest:hive-smoke:0.5.0-incubating-SNAPSHOT
[INFO]                                                                         
[INFO] ------------------------------------------------------------------------
[INFO] Building hivesmoke 0.5.0-incubating-SNAPSHOT
[INFO] ------------------------------------------------------------------------
mojoStarted org.apache.maven.plugins:maven-clean-plugin:2.4.1(default-clean)
[INFO] 
[INFO] --- maven-clean-plugin:2.4.1:clean (default-clean) @ hive-smoke ---[INFO] Deleting
<https://builds.apache.org/job/Bigtop-trunk-testartifacts/org.apache.bigtop.itest$hive-smoke/ws/target>

mojoSucceeded org.apache.maven.plugins:maven-clean-plugin:2.4.1(default-clean)
mojoStarted org.codehaus.groovy.maven:gmaven-plugin:1.0(default)
[INFO] 
[INFO]  Generated 3 Java stubs
[INFO] --- gmaven-plugin:1.0:generateStubs (default) @ hive-smoke ---
mojoSucceeded org.codehaus.groovy.maven:gmaven-plugin:1.0(default)
mojoStarted org.apache.maven.plugins:maven-remote-resources-plugin:1.1(default)
[INFO] 
[INFO] --- maven-remote-resources-plugin:1.1:process (default) @ hive-smoke ---
mojoSucceeded org.apache.maven.plugins:maven-remote-resources-plugin:1.1(default)
mojoStarted org.apache.maven.plugins:maven-resources-plugin:2.4.3(default-resources)
[INFO] 
[INFO] Using 'UTF-8' encoding to copy filtered resources.
[INFO] --- maven-resources-plugin:2.4.3:resources (default-resources) @ hive-smoke ---
[INFO] Copying 148 resources
[INFO] Copying 3 resources
mojoSucceeded org.apache.maven.plugins:maven-resources-plugin:2.4.3(default-resources)
mojoStarted org.apache.maven.plugins:maven-compiler-plugin:2.3.2(default-compile)
[INFO] 
[INFO] Compiling 4 source files to <https://builds.apache.org/job/Bigtop-trunk-testartifacts/org.apache.bigtop.itest$hive-smoke/ws/target/classes>
[INFO] --- maven-compiler-plugin:2.3.2:compile (default-compile) @ hive-smoke ---
[INFO] -------------------------------------------------------------
[ERROR] COMPILATION ERROR : 
[INFO] -------------------------------------------------------------
[ERROR] /zonestorage/hudson_solaris/home/hudson/hudson-slave/workspace/Bigtop-trunk-testartifacts/bigtop-tests/test-artifacts/hive/src/main/groovy/org/apache/bigtop/itest/hivesmoke/TestJdbcDriver.java:[39,30]
cannot find symbol
symbol  : class Parameters
location: package org.apache.bigtop.itest
[ERROR] /zonestorage/hudson_solaris/home/hudson/hudson-slave/workspace/Bigtop-trunk-testartifacts/bigtop-tests/test-artifacts/hive/src/main/groovy/org/apache/bigtop/itest/hivesmoke/TestJdbcDriver.java:[40,30]
cannot find symbol
symbol  : class ParameterSetter
location: package org.apache.bigtop.itest
[ERROR] /zonestorage/hudson_solaris/home/hudson/hudson-slave/workspace/Bigtop-trunk-testartifacts/bigtop-tests/test-artifacts/hive/src/main/groovy/org/apache/bigtop/itest/hivesmoke/TestJdbcDriver.java:[41,30]
cannot find symbol
symbol  : class Property
location: package org.apache.bigtop.itest
[ERROR] /zonestorage/hudson_solaris/home/hudson/hudson-slave/workspace/Bigtop-trunk-testartifacts/bigtop-tests/test-artifacts/hive/src/main/groovy/org/apache/bigtop/itest/hivesmoke/TestJdbcDriver.java:[44,1]
cannot find symbol
symbol: class Parameters
@Parameters(
[ERROR] /zonestorage/hudson_solaris/home/hudson/hudson-slave/workspace/Bigtop-trunk-testartifacts/bigtop-tests/test-artifacts/hive/src/main/groovy/org/apache/bigtop/itest/hivesmoke/TestJdbcDriver.java:[61,4]
cannot find symbol
symbol  : variable ParameterSetter
location: class org.apache.bigtop.itest.hivesmoke.TestJdbcDriver
[INFO] 5 errors 
[INFO] -------------------------------------------------------------
mojoFailed org.apache.maven.plugins:maven-compiler-plugin:2.3.2(default-compile)
projectFailed org.apache.bigtop.itest:hive-smoke:0.5.0-incubating-SNAPSHOT

Mime
View raw message