incubator-bigtop-dev mailing list archives

Site index · List index
Message view « Date » · « Thread »
Top « Date » · « Thread »
From Apache Jenkins Server <jenk...@builds.apache.org>
Subject Build failed in Jenkins: Bigtop-trunk-test-execution #126
Date Mon, 25 Jun 2012 17:00:55 GMT
See <https://builds.apache.org/job/Bigtop-trunk-test-execution/126/>

------------------------------------------
Started by an SCM change
Building remotely on ubuntu5 in workspace <https://builds.apache.org/job/Bigtop-trunk-test-execution/ws/>
Updating https://svn.apache.org/repos/asf/incubator/bigtop/trunk
U         CHANGES.txt
U         bigtop-packages/src/common/pig/do-component-build
U         bigtop-packages/src/common/pig/install_pig.sh
U         bigtop-packages/src/common/hadoop/do-component-build
U         bigtop-packages/src/common/whirr/install_whirr.sh
U         bigtop-packages/src/deb/pig/rules
U         bigtop-packages/src/deb/hue/control
U         bigtop-packages/src/deb/hue/hue-common.postrm
U         bigtop-packages/src/deb/bigtop-utils/control
U         bigtop-packages/src/rpm/pig/SPECS/pig.spec
U         bigtop-packages/src/rpm/bigtop-utils/SPECS/bigtop-utils.spec
U         bigtop-tests/test-artifacts/hive/pom.xml
U         bigtop-tests/test-artifacts/hadoop/src/main/groovy/org/apache/bigtop/itest/hdfstests/TestHDFSQuota.groovy
A         bigtop-tests/test-artifacts/hadoop/src/main/groovy/org/apache/bigtop/itest/hdfstests/TestHDFSBalancer.groovy
A         bigtop-tests/test-artifacts/hadoop/src/main/groovy/org/apache/bigtop/itest/hdfstests/TestDFSAdmin.groovy
ERROR: Failed to update https://svn.apache.org/repos/asf/incubator/bigtop/trunk
org.tmatesoft.svn.core.SVNException: svn: E175002: REPORT /repos/asf/!svn/vcc/default failed
	at org.tmatesoft.svn.core.internal.io.dav.http.HTTPConnection.request(HTTPConnection.java:304)
	at org.tmatesoft.svn.core.internal.io.dav.http.HTTPConnection.request(HTTPConnection.java:289)
	at org.tmatesoft.svn.core.internal.io.dav.http.HTTPConnection.request(HTTPConnection.java:277)
	at org.tmatesoft.svn.core.internal.io.dav.DAVConnection.performHttpRequest(DAVConnection.java:696)
	at org.tmatesoft.svn.core.internal.io.dav.DAVConnection.doReport(DAVConnection.java:328)
	at org.tmatesoft.svn.core.internal.io.dav.DAVRepository.runReport(DAVRepository.java:1289)
	at org.tmatesoft.svn.core.internal.io.dav.DAVRepository.update(DAVRepository.java:837)
	at org.tmatesoft.svn.core.internal.wc16.SVNUpdateClient16.update(SVNUpdateClient16.java:557)
	at org.tmatesoft.svn.core.internal.wc16.SVNUpdateClient16.doUpdate(SVNUpdateClient16.java:414)
	at org.tmatesoft.svn.core.internal.wc16.SVNUpdateClient16.doUpdate(SVNUpdateClient16.java:324)
	at org.tmatesoft.svn.core.internal.wc2.old.SvnOldUpdate.run(SvnOldUpdate.java:27)
	at org.tmatesoft.svn.core.internal.wc2.old.SvnOldUpdate.run(SvnOldUpdate.java:11)
	at org.tmatesoft.svn.core.internal.wc2.SvnOperationRunner.run(SvnOperationRunner.java:20)
	at org.tmatesoft.svn.core.wc2.SvnOperationFactory.run(SvnOperationFactory.java:1221)
	at org.tmatesoft.svn.core.wc2.SvnOperation.run(SvnOperation.java:292)
	at org.tmatesoft.svn.core.wc.SVNUpdateClient.doUpdate(SVNUpdateClient.java:315)
	at org.tmatesoft.svn.core.wc.SVNUpdateClient.doUpdate(SVNUpdateClient.java:295)
	at org.tmatesoft.svn.core.wc.SVNUpdateClient.doUpdate(SVNUpdateClient.java:391)
	at hudson.scm.subversion.UpdateUpdater$TaskImpl.perform(UpdateUpdater.java:136)
	at hudson.scm.subversion.WorkspaceUpdater$UpdateTask.delegateTo(WorkspaceUpdater.java:144)
	at hudson.scm.SubversionSCM$CheckOutTask.perform(SubversionSCM.java:789)
	at hudson.scm.SubversionSCM$CheckOutTask.invoke(SubversionSCM.java:770)
	at hudson.scm.SubversionSCM$CheckOutTask.invoke(SubversionSCM.java:753)
	at hudson.FilePath$FileCallableWrapper.call(FilePath.java:2180)
	at hudson.remoting.UserRequest.perform(UserRequest.java:118)
	at hudson.remoting.UserRequest.perform(UserRequest.java:48)
	at hudson.remoting.Request$2.run(Request.java:287)
	at hudson.remoting.InterceptingExecutorService$1.call(InterceptingExecutorService.java:72)
	at java.util.concurrent.FutureTask$Sync.innerRun(FutureTask.java:334)
	at java.util.concurrent.FutureTask.run(FutureTask.java:166)
	at java.util.concurrent.ThreadPoolExecutor.runWorker(ThreadPoolExecutor.java:1110)
	at java.util.concurrent.ThreadPoolExecutor$Worker.run(ThreadPoolExecutor.java:603)
	at java.lang.Thread.run(Thread.java:636)
Caused by: svn: E175002: REPORT /repos/asf/!svn/vcc/default failed
	at org.tmatesoft.svn.core.SVNErrorMessage.create(SVNErrorMessage.java:208)
	at org.tmatesoft.svn.core.SVNErrorMessage.create(SVNErrorMessage.java:154)
	at org.tmatesoft.svn.core.SVNErrorMessage.create(SVNErrorMessage.java:97)
	... 33 more
no change for https://svn.apache.org/repos/asf/incubator/bigtop/trunk since the previous build
[Bigtop-trunk-test-execution] $ /bin/bash -xe /tmp/hudson4659621381716223245.sh
+ export HADOOP_CONF_DIR=
+ HADOOP_CONF_DIR=
+ export HADOOP_HOME=
+ HADOOP_HOME=
+ /home/hudson/tools/maven/latest3/bin/mvn -f bigtop-tests/test-execution/pom.xml -DskipTests
-DskipITs deploy -DrepositoryId=apache.snapshots.https
[INFO] Scanning for projects...
[ERROR] The build could not read 1 project -> [Help 1]
[ERROR]   
[ERROR]   The project org.apache.bigtop.itest:bigtop-test-execution:0.5.0-incubating-SNAPSHOT
(<https://builds.apache.org/job/Bigtop-trunk-test-execution/ws/bigtop-tests/test-execution/pom.xml)>
has 1 error
[ERROR]     Non-resolvable parent POM: Could not find artifact org.apache.bigtop:bigtop:pom:0.5.0-incubating-SNAPSHOT
and 'parent.relativePath' points at wrong local POM @ line 21, column 11 -> [Help 2]
[ERROR] 
[ERROR] To see the full stack trace of the errors, re-run Maven with the -e switch.
[ERROR] Re-run Maven using the -X switch to enable full debug logging.
[ERROR] 
[ERROR] For more information about the errors and possible solutions, please read the following
articles:
[ERROR] [Help 1] http://cwiki.apache.org/confluence/display/MAVEN/ProjectBuildingException
[ERROR] [Help 2] http://cwiki.apache.org/confluence/display/MAVEN/UnresolvableModelException
Build step 'Execute shell' marked build as failure

Mime
View raw message