incubator-bigtop-dev mailing list archives

Site index · List index
Message view « Date » · « Thread »
Top « Date » · « Thread »
From Apache Jenkins Server <jenk...@builds.apache.org>
Subject Build failed in Jenkins: Bigtop-trunk-test-execution #135
Date Tue, 26 Jun 2012 00:22:57 GMT
See <https://builds.apache.org/job/Bigtop-trunk-test-execution/135/changes>

Changes:

[rvs] BIGTOP-639. sqoop-metastore cannot stop because "Could not load db driver class: org.hsqldb.jdbcDriver"

[rvs] BIGTOP-648. hbase-thrift cannot be started properly

[bmahe] BIGTOP-652. Hadoop install script is trying to remove some tests jars but fails to
do so

[bmahe] BIGTOP-647. Service flume-node fail to start

[rvs] BIGTOP-638. move <services> block from common package_date.xml to each platform's
(yum, apt, zypper) package_data.xml (Johnny Zhang via rvs)

[rvs] Updating release notes for Bigtop 0.5.0 release

[rvs] Opening up 0.5.0 development

[rvs] Preparing for release 0.4.0

[rvs] BIGTOP-620. Add test for dfsadmin commands (Sujay Rau via rvs)

[rvs] BIGTOP-622. Add test for HDFS Balancer (Sujay Rau via rvs)

[rvs] BIGTOP-641. Add hdfs fsck options in TestFsck (Stephen Chu via rvs)

[rvs] BIGTOP-649. PackageTestCommon.checkRemoval() is broken (Andrew Bayer via rvs)

[rvs] BIGTOP-646. update metadata for Hue in the package testing manifest

------------------------------------------
Started by an SCM change
Building remotely on ubuntu4 in workspace <https://builds.apache.org/job/Bigtop-trunk-test-execution/ws/>
Updating https://svn.apache.org/repos/asf/incubator/bigtop/trunk
U         bigtop-packages/src/common/sqoop/do-component-build
U         bigtop-packages/src/common/hbase/hbase.default
U         bigtop-packages/src/deb/hbase/install_init_scripts.sh
U         bigtop-packages/src/rpm/hbase/SPECS/hbase.spec
At revision 1353781
[Bigtop-trunk-test-execution] $ /bin/bash -xe /tmp/hudson6817599605218904556.sh
+ export HADOOP_CONF_DIR=
+ HADOOP_CONF_DIR=
+ export HADOOP_HOME=
+ HADOOP_HOME=
+ /home/hudson/tools/maven/latest3/bin/mvn -f bigtop-tests/test-execution/pom.xml -DskipTests
-DskipITs deploy -DrepositoryId=apache.snapshots.https
[INFO] Scanning for projects...
[INFO] ------------------------------------------------------------------------
[INFO] Reactor Build Order:
[INFO] 
[INFO] stacks-validation-common
[INFO] smoke-tests-conf
[INFO] packagesmokes
[INFO] bigtop-smokes
[INFO]                                                                         
[INFO] ------------------------------------------------------------------------
[INFO] Building stacks-validation-common 0.5.0-incubating-SNAPSHOT
[INFO] ------------------------------------------------------------------------
[INFO] 
[INFO] --- maven-remote-resources-plugin:1.1:process (default) @ stacks-common ---
[INFO] Setting property: classpath.resource.loader.class => 'org.codehaus.plexus.velocity.ContextClassLoaderResourceLoader'.
[INFO] Setting property: velocimacro.messages.on => 'false'.
[INFO] Setting property: resource.loader => 'classpath'.
[INFO] Setting property: resource.manager.logwhenfound => 'false'.
[INFO] 
[INFO] --- maven-install-plugin:2.3:install (default-install) @ stacks-common ---
[INFO] Installing <https://builds.apache.org/job/Bigtop-trunk-test-execution/ws/bigtop-tests/test-execution/common/pom.xml>
to /home/jenkins/.m2/repository/org/apache/bigtop/itest/stacks-common/0.5.0-incubating-SNAPSHOT/stacks-common-0.5.0-incubating-SNAPSHOT.pom
[INFO] 
[INFO] --- maven-deploy-plugin:2.5:deploy (default-deploy) @ stacks-common ---
Downloading: https://repository.apache.org/content/repositories/snapshots/org/apache/bigtop/itest/stacks-common/0.5.0-incubating-SNAPSHOT/maven-metadata.xml
635 B   
        
Downloaded: https://repository.apache.org/content/repositories/snapshots/org/apache/bigtop/itest/stacks-common/0.5.0-incubating-SNAPSHOT/maven-metadata.xml
(635 B at 0.7 KB/sec)
Uploading: https://repository.apache.org/content/repositories/snapshots/org/apache/bigtop/itest/stacks-common/0.5.0-incubating-SNAPSHOT/stacks-common-0.5.0-incubating-20120626.002252-5.pom
4 KB    
8 KB   
12 KB   
        
Uploaded: https://repository.apache.org/content/repositories/snapshots/org/apache/bigtop/itest/stacks-common/0.5.0-incubating-SNAPSHOT/stacks-common-0.5.0-incubating-20120626.002252-5.pom
(12 KB at 11.1 KB/sec)
Downloading: https://repository.apache.org/content/repositories/snapshots/org/apache/bigtop/itest/stacks-common/maven-metadata.xml
409 B   
        
Downloaded: https://repository.apache.org/content/repositories/snapshots/org/apache/bigtop/itest/stacks-common/maven-metadata.xml
(409 B at 2.2 KB/sec)
Uploading: https://repository.apache.org/content/repositories/snapshots/org/apache/bigtop/itest/stacks-common/0.5.0-incubating-SNAPSHOT/maven-metadata.xml
635 B   
        
Uploaded: https://repository.apache.org/content/repositories/snapshots/org/apache/bigtop/itest/stacks-common/0.5.0-incubating-SNAPSHOT/maven-metadata.xml
(635 B at 2.7 KB/sec)
Uploading: https://repository.apache.org/content/repositories/snapshots/org/apache/bigtop/itest/stacks-common/maven-metadata.xml
409 B   
        
Uploaded: https://repository.apache.org/content/repositories/snapshots/org/apache/bigtop/itest/stacks-common/maven-metadata.xml
(409 B at 1.3 KB/sec)
[INFO]                                                                         
[INFO] ------------------------------------------------------------------------
[INFO] Building smoke-tests-conf 0.5.0-incubating-SNAPSHOT
[INFO] ------------------------------------------------------------------------
[INFO] 
[INFO] --- maven-remote-resources-plugin:1.1:process (default) @ smoke-tests-conf ---
[INFO] 
[INFO] --- maven-resources-plugin:2.4:resources (default-resources) @ smoke-tests-conf ---
[INFO] Using 'UTF-8' encoding to copy filtered resources.
[INFO] Copying 1 resource
[INFO] Copying 3 resources
[INFO] 
[INFO] --- maven-compiler-plugin:2.0.2:compile (default-compile) @ smoke-tests-conf ---
[INFO] No sources to compile
[INFO] 
[INFO] --- maven-resources-plugin:2.4:testResources (default-testResources) @ smoke-tests-conf
---
[INFO] Using 'UTF-8' encoding to copy filtered resources.
[INFO] skip non existing resourceDirectory <https://builds.apache.org/job/Bigtop-trunk-test-execution/ws/bigtop-tests/test-execution/conf/src/test/resources>
[INFO] Copying 3 resources
[INFO] 
[INFO] --- maven-compiler-plugin:2.0.2:testCompile (default-testCompile) @ smoke-tests-conf
---
[INFO] No sources to compile
[INFO] 
[INFO] --- maven-surefire-plugin:2.7:test (default-test) @ smoke-tests-conf ---
[INFO] Tests are skipped.
[INFO] 
[INFO] --- maven-jar-plugin:2.3:jar (default-jar) @ smoke-tests-conf ---
[INFO] Building jar: <https://builds.apache.org/job/Bigtop-trunk-test-execution/ws/bigtop-tests/test-execution/conf/target/smoke-tests-conf-0.5.0-incubating-SNAPSHOT.jar>
[INFO] 
[INFO] --- maven-install-plugin:2.3:install (default-install) @ smoke-tests-conf ---
[INFO] Installing <https://builds.apache.org/job/Bigtop-trunk-test-execution/ws/bigtop-tests/test-execution/conf/target/smoke-tests-conf-0.5.0-incubating-SNAPSHOT.jar>
to /home/jenkins/.m2/repository/org/apache/bigtop/itest/smoke-tests-conf/0.5.0-incubating-SNAPSHOT/smoke-tests-conf-0.5.0-incubating-SNAPSHOT.jar
[INFO] Installing <https://builds.apache.org/job/Bigtop-trunk-test-execution/ws/bigtop-tests/test-execution/conf/pom.xml>
to /home/jenkins/.m2/repository/org/apache/bigtop/itest/smoke-tests-conf/0.5.0-incubating-SNAPSHOT/smoke-tests-conf-0.5.0-incubating-SNAPSHOT.pom
[INFO] 
[INFO] --- maven-deploy-plugin:2.5:deploy (default-deploy) @ smoke-tests-conf ---
Downloading: https://repository.apache.org/content/repositories/snapshots/org/apache/bigtop/itest/smoke-tests-conf/0.5.0-incubating-SNAPSHOT/maven-metadata.xml
822 B   
        
Downloaded: https://repository.apache.org/content/repositories/snapshots/org/apache/bigtop/itest/smoke-tests-conf/0.5.0-incubating-SNAPSHOT/maven-metadata.xml
(822 B at 3.1 KB/sec)
Uploading: https://repository.apache.org/content/repositories/snapshots/org/apache/bigtop/itest/smoke-tests-conf/0.5.0-incubating-SNAPSHOT/smoke-tests-conf-0.5.0-incubating-20120626.002255-5.jar
4 KB    
8 KB   
       
Uploaded: https://repository.apache.org/content/repositories/snapshots/org/apache/bigtop/itest/smoke-tests-conf/0.5.0-incubating-SNAPSHOT/smoke-tests-conf-0.5.0-incubating-20120626.002255-5.jar
(8 KB at 17.2 KB/sec)
Uploading: https://repository.apache.org/content/repositories/snapshots/org/apache/bigtop/itest/smoke-tests-conf/0.5.0-incubating-SNAPSHOT/smoke-tests-conf-0.5.0-incubating-20120626.002255-5.pom
2 KB   
       
Uploaded: https://repository.apache.org/content/repositories/snapshots/org/apache/bigtop/itest/smoke-tests-conf/0.5.0-incubating-SNAPSHOT/smoke-tests-conf-0.5.0-incubating-20120626.002255-5.pom
(2 KB at 11.6 KB/sec)
Downloading: https://repository.apache.org/content/repositories/snapshots/org/apache/bigtop/itest/smoke-tests-conf/maven-metadata.xml
412 B   
        
Downloaded: https://repository.apache.org/content/repositories/snapshots/org/apache/bigtop/itest/smoke-tests-conf/maven-metadata.xml
(412 B at 1.7 KB/sec)
Uploading: https://repository.apache.org/content/repositories/snapshots/org/apache/bigtop/itest/smoke-tests-conf/0.5.0-incubating-SNAPSHOT/maven-metadata.xml
822 B   
        
Uploaded: https://repository.apache.org/content/repositories/snapshots/org/apache/bigtop/itest/smoke-tests-conf/0.5.0-incubating-SNAPSHOT/maven-metadata.xml
(822 B at 3.6 KB/sec)
Uploading: https://repository.apache.org/content/repositories/snapshots/org/apache/bigtop/itest/smoke-tests-conf/maven-metadata.xml
412 B   
        
Uploaded: https://repository.apache.org/content/repositories/snapshots/org/apache/bigtop/itest/smoke-tests-conf/maven-metadata.xml
(412 B at 2.1 KB/sec)
[INFO]                                                                         
[INFO] ------------------------------------------------------------------------
[INFO] Building packagesmokes 0.5.0-incubating-SNAPSHOT
[INFO] ------------------------------------------------------------------------
Downloading: http://repository.apache.org/snapshots/org/apache/bigtop/itest/package-smoke/0.5.0-incubating-SNAPSHOT/maven-metadata.xml
        
Downloading: http://repository.apache.org/snapshots/org/apache/bigtop/itest/package-smoke/0.5.0-incubating-SNAPSHOT/package-smoke-0.5.0-incubating-SNAPSHOT.pom
        
[WARNING] The POM for org.apache.bigtop.itest:package-smoke:jar:0.5.0-incubating-SNAPSHOT
is missing, no dependency information available
Downloading: http://repository.apache.org/snapshots/org/apache/bigtop/itest/itest-common/0.5.0-incubating-SNAPSHOT/maven-metadata.xml
        
Downloading: http://repository.apache.org/snapshots/org/apache/bigtop/itest/itest-common/0.5.0-incubating-SNAPSHOT/itest-common-0.5.0-incubating-SNAPSHOT.pom
        
[WARNING] The POM for org.apache.bigtop.itest:itest-common:jar:0.5.0-incubating-SNAPSHOT is
missing, no dependency information available
Downloading: http://repository.apache.org/snapshots/org/apache/bigtop/itest/package-smoke/0.5.0-incubating-SNAPSHOT/package-smoke-0.5.0-incubating-SNAPSHOT.jar
Downloading: http://repository.apache.org/snapshots/org/apache/bigtop/itest/itest-common/0.5.0-incubating-SNAPSHOT/itest-common-0.5.0-incubating-SNAPSHOT.jar
        
        
[INFO] ------------------------------------------------------------------------
[INFO] Reactor Summary:
[INFO] 
[INFO] stacks-validation-common .......................... SUCCESS [3.787s]
[INFO] smoke-tests-conf .................................. SUCCESS [2.308s]
[INFO] packagesmokes ..................................... FAILURE [0.715s]
[INFO] bigtop-smokes ..................................... SKIPPED
[INFO] ------------------------------------------------------------------------
[INFO] BUILD FAILURE
[INFO] ------------------------------------------------------------------------
[INFO] Total time: 7.153s
[INFO] Finished at: Tue Jun 26 00:22:57 UTC 2012
[INFO] Final Memory: 12M/176M
[INFO] ------------------------------------------------------------------------
[ERROR] Failed to execute goal on project package-smoke-execution: Could not resolve dependencies
for project org.apache.bigtop.itest:package-smoke-execution:jar:0.5.0-incubating-SNAPSHOT:
The following artifacts could not be resolved: org.apache.bigtop.itest:package-smoke:jar:0.5.0-incubating-SNAPSHOT,
org.apache.bigtop.itest:itest-common:jar:0.5.0-incubating-SNAPSHOT: Could not find artifact
org.apache.bigtop.itest:package-smoke:jar:0.5.0-incubating-SNAPSHOT in Nexus (http://repository.apache.org/snapshots)
-> [Help 1]
[ERROR] 
[ERROR] To see the full stack trace of the errors, re-run Maven with the -e switch.
[ERROR] Re-run Maven using the -X switch to enable full debug logging.
[ERROR] 
[ERROR] For more information about the errors and possible solutions, please read the following
articles:
[ERROR] [Help 1] http://cwiki.apache.org/confluence/display/MAVEN/DependencyResolutionException
[ERROR] 
[ERROR] After correcting the problems, you can resume the build with the command
[ERROR]   mvn <goals> -rf :package-smoke-execution
Build step 'Execute shell' marked build as failure

Mime
View raw message