incubator-bigtop-dev mailing list archives

Site index · List index
Message view « Date » · « Thread »
Top « Date » · « Thread »
From Apache Jenkins Server <jenk...@builds.apache.org>
Subject Build failed in Jenkins: Bigtop-trunk-testartifacts #121
Date Sun, 24 Jun 2012 21:05:14 GMT
See <https://builds.apache.org/job/Bigtop-trunk-testartifacts/121/changes>

Changes:

[rvs] BIGTOP-646. update metadata for Hue in the package testing manifest

[bmahe] BIGTOP-650. Override libexecdir for bigtop-utils on mageia

[cos] BIGTOP-643: Fix package statement in TestHDFSQuota

[rvs] BIGTOP-186. whirr package ships source code and needs some permissions fixes (Peter
Linnell via rvs)

[bmahe] BIGTOP-642. Suse does not have a package named 'which'

[rvs] BIGTOP-359. documentation build is picked from the wrong place

[rvs] BIGTOP-596. move service configuration from groovy code to package xml manifest file
(Johnny Zhang via rvs)

[rvs] BIGTOP-608. remove source/build artifacts from the Pig package

[bmahe] BIGTOP-633. bigtop-utils packages should depend on 'which' (Jolly Chen via Bruno Mahé)

[bmahe] BIGTOP-523. JAVA_HOME not found if JVM is java-7-oracle (Jolly Chen via Bruno Mahé)

[bmahe] BIGTOP-630. fixed init priority, higher for zookeeper and lower for hbase. (Masatake
Iwasaki via Bruno Mahé)

[rvs] BIGTOP-636. a few minor tweaks to the Hue deployment code

[rvs] BIGTOP-527. Integrate Hue 2.0.0 into Bigtop

[rvs] BIGTOP-623. Add test for HDFS Quota Testing (Sujay Rau via rvs)

[rvs] BIGTOP-627. Add HBase balancer test (Stephen Chu via rvs)

[rvs] BIGTOP-631. Add HBase Import/Export test (Stephen Chu via rvs)

[rvs] BIGTOP-611. Add HBase TestImportTsv (Stephen Chu via rvs)

[bmahe] BIGTOP-628. bump version of Mahout to 0.7.0 (fix typo)

[rvs] BIGTOP-619. Add HBase CopyTable test (Stephen Chu via rvs)

[rvs] BIGTOP-618. Add HBase hbck test (Stephen Chu via rvs)

[rvs] BIGTOP-628. bump version of Mahout to 0.7.0

[rvs] BIGTOP-628. bump version of Mahout to 0.7.0

[rvs] BIGTOP-628. bump version of Mahout to 0.7.0

[rvs] BUILD. Hooking up Mahout 0.7 RC1

[rvs] BIGTOP-626.  small misc. issues with the newly introduced Giraph package

[rvs] BIGTOP-570. Build package for Apache Giraph (Andrew Purtell via rvs)

[rvs] BIGTOP-570. Build package for Apache Giraph (Andrew Purtell via rvs)

[rvs] BIGTOP-570. Build package for Apache Giraph (Andrew Purtell via rvs)

[rvs] BIGTOP-617. Bump version of Oozie to 3.2.0

[rvs] BIGTOP-617. Bump version of Oozie to 3.2.0

[rvs] BIGTOP-616. Fix TestHadoopSmoke and TestHadoopExamples: tests look for streaming and
examples jar in wrong directory (Stephen Chu via rvs)

[rvs] BUILD. Getting closer to Mahout 0.7 RC

[rvs] BIGTOP-604. Bump version of Hive to 0.9.0

[bmahe] BIGTOP-610. Add basic hdfs fsck test and move logError helper to bigtop-test-framework
(Stephen Chu via Bruno Mahé)

------------------------------------------
Started by an SCM change
Building remotely on solaris1 in workspace <https://builds.apache.org/job/Bigtop-trunk-testartifacts/ws/>
Updating https://svn.apache.org/repos/asf/incubator/bigtop/trunk
U         CHANGES.txt
U         bigtop-packages/src/deb/zookeeper/zookeeper-server.init
U         bigtop-packages/src/deb/pig/rules
U         bigtop-packages/src/deb/bigtop-utils/control
U         bigtop-packages/src/deb/hbase/service-init.d.tpl
U         bigtop-packages/src/deb/hue/control
U         bigtop-packages/src/deb/hue/hue-common.postrm
U         bigtop-packages/src/common/hadoop/do-component-build
U         bigtop-packages/src/common/zookeeper/zookeeper-server.sh
U         bigtop-packages/src/common/zookeeper/zookeeper-server.sh.suse
U         bigtop-packages/src/common/pig/do-component-build
U         bigtop-packages/src/common/pig/install_pig.sh
U         bigtop-packages/src/common/whirr/install_whirr.sh
U         bigtop-packages/src/common/bigtop-utils/bigtop-detect-javahome
U         bigtop-packages/src/rpm/pig/SPECS/pig.spec
U         bigtop-packages/src/rpm/bigtop-utils/SPECS/bigtop-utils.spec
U         bigtop-packages/src/rpm/hbase/SOURCES/hbase.sh.suse
U         bigtop-packages/src/rpm/hbase/SOURCES/hbase.sh
U         bigtop-tests/test-artifacts/hadoop/src/main/groovy/org/apache/bigtop/itest/hdfstests/TestHDFSQuota.groovy
U         bigtop-tests/test-artifacts/package/src/main/resources/package_data.xml
U         bigtop-tests/test-artifacts/package/src/main/groovy/org/apache/bigtop/itest/packagesmoke/TestPackagesBasics.groovy
U         bigtop-tests/test-artifacts/package/src/main/groovy/org/apache/bigtop/itest/packagesmoke/PackageTestCommon.groovy
U         bigtop-tests/test-artifacts/package/src/main/groovy/org/apache/bigtop/itest/packagesmoke/StateVerifierHBase.groovy
U         bigtop-tests/test-artifacts/package/src/main/groovy/org/apache/bigtop/itest/packagesmoke/StateVerifierHDFS.groovy
ERROR: Failed to update https://svn.apache.org/repos/asf/incubator/bigtop/trunk
org.tmatesoft.svn.core.SVNException: svn: E175002: REPORT /repos/asf/!svn/vcc/default failed
	at org.tmatesoft.svn.core.internal.io.dav.http.HTTPConnection.request(HTTPConnection.java:304)
	at org.tmatesoft.svn.core.internal.io.dav.http.HTTPConnection.request(HTTPConnection.java:289)
	at org.tmatesoft.svn.core.internal.io.dav.http.HTTPConnection.request(HTTPConnection.java:277)
	at org.tmatesoft.svn.core.internal.io.dav.DAVConnection.performHttpRequest(DAVConnection.java:696)
	at org.tmatesoft.svn.core.internal.io.dav.DAVConnection.doReport(DAVConnection.java:328)
	at org.tmatesoft.svn.core.internal.io.dav.DAVRepository.runReport(DAVRepository.java:1289)
	at org.tmatesoft.svn.core.internal.io.dav.DAVRepository.update(DAVRepository.java:837)
	at org.tmatesoft.svn.core.internal.wc16.SVNUpdateClient16.update(SVNUpdateClient16.java:557)
	at org.tmatesoft.svn.core.internal.wc16.SVNUpdateClient16.doUpdate(SVNUpdateClient16.java:414)
	at org.tmatesoft.svn.core.internal.wc16.SVNUpdateClient16.doUpdate(SVNUpdateClient16.java:324)
	at org.tmatesoft.svn.core.internal.wc2.old.SvnOldUpdate.run(SvnOldUpdate.java:27)
	at org.tmatesoft.svn.core.internal.wc2.old.SvnOldUpdate.run(SvnOldUpdate.java:11)
	at org.tmatesoft.svn.core.internal.wc2.SvnOperationRunner.run(SvnOperationRunner.java:20)
	at org.tmatesoft.svn.core.wc2.SvnOperationFactory.run(SvnOperationFactory.java:1221)
	at org.tmatesoft.svn.core.wc2.SvnOperation.run(SvnOperation.java:292)
	at org.tmatesoft.svn.core.wc.SVNUpdateClient.doUpdate(SVNUpdateClient.java:315)
	at org.tmatesoft.svn.core.wc.SVNUpdateClient.doUpdate(SVNUpdateClient.java:295)
	at org.tmatesoft.svn.core.wc.SVNUpdateClient.doUpdate(SVNUpdateClient.java:391)
	at hudson.scm.subversion.UpdateUpdater$TaskImpl.perform(UpdateUpdater.java:136)
	at hudson.scm.subversion.WorkspaceUpdater$UpdateTask.delegateTo(WorkspaceUpdater.java:144)
	at hudson.scm.SubversionSCM$CheckOutTask.perform(SubversionSCM.java:789)
	at hudson.scm.SubversionSCM$CheckOutTask.invoke(SubversionSCM.java:770)
	at hudson.scm.SubversionSCM$CheckOutTask.invoke(SubversionSCM.java:753)
	at hudson.FilePath$FileCallableWrapper.call(FilePath.java:2180)
	at hudson.remoting.UserRequest.perform(UserRequest.java:118)
	at hudson.remoting.UserRequest.perform(UserRequest.java:48)
	at hudson.remoting.Request$2.run(Request.java:287)
	at hudson.remoting.InterceptingExecutorService$1.call(InterceptingExecutorService.java:72)
	at java.util.concurrent.FutureTask$Sync.innerRun(FutureTask.java:269)
	at java.util.concurrent.FutureTask.run(FutureTask.java:123)
	at java.util.concurrent.ThreadPoolExecutor$Worker.runTask(ThreadPoolExecutor.java:651)
	at java.util.concurrent.ThreadPoolExecutor$Worker.run(ThreadPoolExecutor.java:676)
	at java.lang.Thread.run(Thread.java:595)
Caused by: svn: E175002: REPORT /repos/asf/!svn/vcc/default failed
	at org.tmatesoft.svn.core.SVNErrorMessage.create(SVNErrorMessage.java:208)
	at org.tmatesoft.svn.core.SVNErrorMessage.create(SVNErrorMessage.java:154)
	at org.tmatesoft.svn.core.SVNErrorMessage.create(SVNErrorMessage.java:97)
	... 33 more
Parsing POMs
ERROR: Failed to parse POMs
hudson.util.IOException2: remote file operation failed: <https://builds.apache.org/job/Bigtop-trunk-testartifacts/ws/>
at hudson.remoting.Channel@3618ffca:solaris1
	at hudson.FilePath.act(FilePath.java:838)
	at hudson.FilePath.act(FilePath.java:824)
	at hudson.maven.MavenModuleSetBuild$MavenModuleSetBuildExecution.parsePoms(MavenModuleSetBuild.java:910)
	at hudson.maven.MavenModuleSetBuild$MavenModuleSetBuildExecution.doRun(MavenModuleSetBuild.java:654)
	at hudson.model.AbstractBuild$AbstractBuildExecution.run(AbstractBuild.java:499)
	at hudson.model.Run.execute(Run.java:1460)
	at hudson.maven.MavenModuleSetBuild.run(MavenModuleSetBuild.java:477)
	at hudson.model.ResourceController.execute(ResourceController.java:88)
	at hudson.model.Executor.run(Executor.java:239)
Caused by: hudson.remoting.ProxyException: hudson.maven.MavenModuleSetBuild$MavenExecutionException:
org.apache.maven.project.ProjectBuildingException: Some problems were encountered while processing
the POMs:
[ERROR] Child module <https://builds.apache.org/job/Bigtop-trunk-testartifacts/ws/bigtop-tests/test-artifacts/giraph/pom.xml>
of <https://builds.apache.org/job/Bigtop-trunk-testartifacts/ws/bigtop-tests/test-artifacts/pom.xml>
does not exist @ 
[ERROR] Child module <https://builds.apache.org/job/Bigtop-trunk-testartifacts/ws/bigtop-tests/test-artifacts/hue>
of <https://builds.apache.org/job/Bigtop-trunk-testartifacts/ws/bigtop-tests/test-artifacts/pom.xml>
does not exist @ 

	at hudson.maven.MavenModuleSetBuild$PomParser.invoke(MavenModuleSetBuild.java:1277)
	at hudson.maven.MavenModuleSetBuild$PomParser.invoke(MavenModuleSetBuild.java:1045)
	at hudson.FilePath$FileCallableWrapper.call(FilePath.java:2180)
	at hudson.remoting.UserRequest.perform(UserRequest.java:118)
	at hudson.remoting.UserRequest.perform(UserRequest.java:48)
	at hudson.remoting.Request$2.run(Request.java:287)
	at hudson.remoting.InterceptingExecutorService$1.call(InterceptingExecutorService.java:72)
	at java.util.concurrent.FutureTask$Sync.innerRun(FutureTask.java:269)
	at java.util.concurrent.FutureTask.run(FutureTask.java:123)
	at java.util.concurrent.ThreadPoolExecutor$Worker.runTask(ThreadPoolExecutor.java:651)
	at java.util.concurrent.ThreadPoolExecutor$Worker.run(ThreadPoolExecutor.java:676)
	at java.lang.Thread.run(Thread.java:595)
Caused by: hudson.remoting.ProxyException: org.apache.maven.project.ProjectBuildingException:
Some problems were encountered while processing the POMs:
[ERROR] Child module <https://builds.apache.org/job/Bigtop-trunk-testartifacts/ws/bigtop-tests/test-artifacts/giraph/pom.xml>
of <https://builds.apache.org/job/Bigtop-trunk-testartifacts/ws/bigtop-tests/test-artifacts/pom.xml>
does not exist @ 
[ERROR] Child module <https://builds.apache.org/job/Bigtop-trunk-testartifacts/ws/bigtop-tests/test-artifacts/hue>
of <https://builds.apache.org/job/Bigtop-trunk-testartifacts/ws/bigtop-tests/test-artifacts/pom.xml>
does not exist @ 

	at org.apache.maven.project.DefaultProjectBuilder.build(DefaultProjectBuilder.java:363)
	at hudson.maven.MavenEmbedder.buildProjects(MavenEmbedder.java:361)
	at hudson.maven.MavenEmbedder.readProjects(MavenEmbedder.java:331)
	at hudson.maven.MavenModuleSetBuild$PomParser.invoke(MavenModuleSetBuild.java:1227)
	... 11 more

Mime
View raw message