incubator-bigtop-dev mailing list archives

Site index · List index
Message view « Date » · « Thread »
Top « Date » · « Thread »
From Apache Jenkins Server <jenk...@builds.apache.org>
Subject Build failed in Jenkins: Bigtop-trunk-testartifacts #217
Date Mon, 25 Jun 2012 23:48:58 GMT
See <https://builds.apache.org/job/Bigtop-trunk-testartifacts/217/changes>

Changes:

[bmahe] BIGTOP-652. Hadoop install script is trying to remove some tests jars but fails to
do so

[bmahe] BIGTOP-647. Service flume-node fail to start

[rvs] BIGTOP-638. move <services> block from common package_date.xml to each platform's
(yum, apt, zypper) package_data.xml (Johnny Zhang via rvs)

[rvs] Updating release notes for Bigtop 0.5.0 release

[rvs] Opening up 0.5.0 development

[rvs] Preparing for release 0.4.0

[rvs] BIGTOP-620. Add test for dfsadmin commands (Sujay Rau via rvs)

[rvs] BIGTOP-622. Add test for HDFS Balancer (Sujay Rau via rvs)

[rvs] BIGTOP-641. Add hdfs fsck options in TestFsck (Stephen Chu via rvs)

[rvs] BIGTOP-649. PackageTestCommon.checkRemoval() is broken (Andrew Bayer via rvs)

[rvs] BIGTOP-646. update metadata for Hue in the package testing manifest

------------------------------------------
Started by an SCM change
Building remotely on ubuntu2 in workspace <https://builds.apache.org/job/Bigtop-trunk-testartifacts/ws/>
Updating https://svn.apache.org/repos/asf/incubator/bigtop/trunk
U         bigtop-packages/src/common/flume/flume-node.init
U         bigtop-packages/src/common/hadoop/install_hadoop.sh
At revision 1353779
Parsing POMs
[test-artifacts] $ /home/hudson/tools/java/latest1.6/bin/java -cp /home/hudson/hudson-slave/maven3-agent.jar:/home/hudson/tools/maven/latest3/boot/plexus-classworlds-2.4.jar
org.jvnet.hudson.maven3.agent.Maven3Main /home/hudson/tools/maven/latest3 /home/hudson/hudson-slave/slave.jar
/home/hudson/hudson-slave/maven3-interceptor.jar 47659
<===[JENKINS REMOTING CAPACITY]===>channel started
   log4j:WARN No appenders could be found for logger (org.apache.commons.beanutils.converters.BooleanConverter).
log4j:WARN Please initialize the log4j system properly.
Executing Maven:  -B -f <https://builds.apache.org/job/Bigtop-trunk-testartifacts/ws/bigtop-tests/test-artifacts/pom.xml>
-Dmaven.repo.local=/home/hudson/hudson-slave/maven-repositories/0 clean deploy
[INFO] Scanning for projects...
[INFO] ------------------------------------------------------------------------
[INFO] Reactor Build Order:
[INFO] 
[INFO] bigtop-smokes
[INFO] hadoopsmoke
[INFO] packagesmoke
[INFO] ooziesmoke
[INFO] hivesmoke
[INFO] hbasesmoke
[INFO] flumesmoke
[INFO] sqoop-integration
[INFO] mahoutsmoke
[INFO] giraphsmoke
[INFO] huesmoke
Projects to build: [MavenProject: org.apache.bigtop.itest:bigtop-smokes:0.5.0-incubating-SNAPSHOT
@ <https://builds.apache.org/job/Bigtop-trunk-testartifacts/ws/bigtop-tests/test-artifacts/pom.xml,>
MavenProject: org.apache.bigtop.itest:hadoop-smoke:0.5.0-incubating-SNAPSHOT @ <https://builds.apache.org/job/Bigtop-trunk-testartifacts/ws/bigtop-tests/test-artifacts/hadoop/pom.xml,>
MavenProject: org.apache.bigtop.itest:package-smoke:0.5.0-incubating-SNAPSHOT @ <https://builds.apache.org/job/Bigtop-trunk-testartifacts/ws/bigtop-tests/test-artifacts/package/pom.xml,>
MavenProject: org.apache.bigtop.itest:oozie-smoke:0.5.0-incubating-SNAPSHOT @ <https://builds.apache.org/job/Bigtop-trunk-testartifacts/ws/bigtop-tests/test-artifacts/oozie/pom.xml,>
MavenProject: org.apache.bigtop.itest:hive-smoke:0.5.0-incubating-SNAPSHOT @ <https://builds.apache.org/job/Bigtop-trunk-testartifacts/ws/bigtop-tests/test-artifacts/hive/pom.xml,>
MavenProject: org.apache.bigtop.itest:hbase-smoke:0.5.0-incubating-SNAPSHOT @ <https://builds.apache.org/job/Bigtop-trunk-testartifacts/ws/bigtop-tests/test-artifacts/hbase/pom.xml,>
MavenProject: org.apache.bigtop.itest:flume-smoke:0.5.0-incubating-SNAPSHOT @ <https://builds.apache.org/job/Bigtop-trunk-testartifacts/ws/bigtop-tests/test-artifacts/flume/pom.xml,>
MavenProject: org.apache.bigtop.itest:sqoop-integration:0.5.0-incubating-SNAPSHOT @ <https://builds.apache.org/job/Bigtop-trunk-testartifacts/ws/bigtop-tests/test-artifacts/sqoop/pom.xml,>
MavenProject: org.apache.bigtop.itest:mahout-smoke:0.5.0-incubating-SNAPSHOT @ <https://builds.apache.org/job/Bigtop-trunk-testartifacts/ws/bigtop-tests/test-artifacts/mahout/pom.xml,>
MavenProject: org.apache.bigtop.itest:giraph-smoke:0.5.0-incubating-SNAPSHOT @ <https://builds.apache.org/job/Bigtop-trunk-testartifacts/ws/bigtop-tests/test-artifacts/giraph/pom.xml,>
MavenProject: org.apache.bigtop.itest:hue-smoke:0.5.0-incubating-SNAPSHOT @ <https://builds.apache.org/job/Bigtop-trunk-testartifacts/ws/bigtop-tests/test-artifacts/hue/pom.xml]>
projectStarted org.apache.bigtop.itest:bigtop-smokes:0.5.0-incubating-SNAPSHOT
[INFO]                                                                         
[INFO] ------------------------------------------------------------------------
[INFO] Building bigtop-smokes 0.5.0-incubating-SNAPSHOT
[INFO] ------------------------------------------------------------------------
Downloading: http://repository.apache.org/snapshots/org/apache/bigtop/itest/itest-common/0.5.0-incubating-SNAPSHOT/itest-common-0.5.0-incubating-SNAPSHOT.pom
[WARNING] The POM for org.apache.bigtop.itest:itest-common:jar:0.5.0-incubating-SNAPSHOT is
missing, no dependency information available
Downloading: http://repository.apache.org/snapshots/org/apache/bigtop/itest/itest-common/0.5.0-incubating-SNAPSHOT/itest-common-0.5.0-incubating-SNAPSHOT.jar
projectFailed org.apache.bigtop.itest:bigtop-smokes:0.5.0-incubating-SNAPSHOT
sessionEnded
[INFO] ------------------------------------------------------------------------
[INFO] Reactor Summary:
[INFO] 
[INFO] bigtop-smokes ..................................... FAILURE [1.059s]
[INFO] hadoopsmoke ....................................... SKIPPED
[INFO] packagesmoke ...................................... SKIPPED
[INFO] ooziesmoke ........................................ SKIPPED
[INFO] hivesmoke ......................................... SKIPPED
[INFO] hbasesmoke ........................................ SKIPPED
[INFO] flumesmoke ........................................ SKIPPED
[INFO] sqoop-integration ................................. SKIPPED
[INFO] mahoutsmoke ....................................... SKIPPED
[INFO] giraphsmoke ....................................... SKIPPED
[INFO] huesmoke .......................................... SKIPPED
[INFO] ------------------------------------------------------------------------
[INFO] BUILD FAILURE
[INFO] ------------------------------------------------------------------------
[INFO] Total time: 2.858s
[INFO] Finished at: Mon Jun 25 23:48:37 UTC 2012
[INFO] Final Memory: 4M/62M
[INFO] ------------------------------------------------------------------------
Projects to build: [MavenProject: org.apache.bigtop.itest:bigtop-smokes:0.5.0-incubating-SNAPSHOT
@ <https://builds.apache.org/job/Bigtop-trunk-testartifacts/ws/bigtop-tests/test-artifacts/pom.xml,>
MavenProject: org.apache.bigtop.itest:hadoop-smoke:0.5.0-incubating-SNAPSHOT @ <https://builds.apache.org/job/Bigtop-trunk-testartifacts/ws/bigtop-tests/test-artifacts/hadoop/pom.xml,>
MavenProject: org.apache.bigtop.itest:package-smoke:0.5.0-incubating-SNAPSHOT @ <https://builds.apache.org/job/Bigtop-trunk-testartifacts/ws/bigtop-tests/test-artifacts/package/pom.xml,>
MavenProject: org.apache.bigtop.itest:oozie-smoke:0.5.0-incubating-SNAPSHOT @ <https://builds.apache.org/job/Bigtop-trunk-testartifacts/ws/bigtop-tests/test-artifacts/oozie/pom.xml,>
MavenProject: org.apache.bigtop.itest:hive-smoke:0.5.0-incubating-SNAPSHOT @ <https://builds.apache.org/job/Bigtop-trunk-testartifacts/ws/bigtop-tests/test-artifacts/hive/pom.xml,>
MavenProject: org.apache.bigtop.itest:hbase-smoke:0.5.0-incubating-SNAPSHOT @ <https://builds.apache.org/job/Bigtop-trunk-testartifacts/ws/bigtop-tests/test-artifacts/hbase/pom.xml,>
MavenProject: org.apache.bigtop.itest:flume-smoke:0.5.0-incubating-SNAPSHOT @ <https://builds.apache.org/job/Bigtop-trunk-testartifacts/ws/bigtop-tests/test-artifacts/flume/pom.xml,>
MavenProject: org.apache.bigtop.itest:sqoop-integration:0.5.0-incubating-SNAPSHOT @ <https://builds.apache.org/job/Bigtop-trunk-testartifacts/ws/bigtop-tests/test-artifacts/sqoop/pom.xml,>
MavenProject: org.apache.bigtop.itest:mahout-smoke:0.5.0-incubating-SNAPSHOT @ <https://builds.apache.org/job/Bigtop-trunk-testartifacts/ws/bigtop-tests/test-artifacts/mahout/pom.xml,>
MavenProject: org.apache.bigtop.itest:giraph-smoke:0.5.0-incubating-SNAPSHOT @ <https://builds.apache.org/job/Bigtop-trunk-testartifacts/ws/bigtop-tests/test-artifacts/giraph/pom.xml,>
MavenProject: org.apache.bigtop.itest:hue-smoke:0.5.0-incubating-SNAPSHOT @ <https://builds.apache.org/job/Bigtop-trunk-testartifacts/ws/bigtop-tests/test-artifacts/hue/pom.xml]>
[JENKINS] Archiving <https://builds.apache.org/job/Bigtop-trunk-testartifacts/ws/bigtop-tests/test-artifacts/hue/pom.xml>
to /home/hudson/hudson/jobs/Bigtop-trunk-testartifacts/modules/org.apache.bigtop.itest$hue-smoke/builds/2012-06-25_23-48-18/archive/org.apache.bigtop.itest/hue-smoke/0.5.0-incubating-SNAPSHOT/hue-smoke-0.5.0-incubating-SNAPSHOT.pom
[JENKINS] Archiving <https://builds.apache.org/job/Bigtop-trunk-testartifacts/ws/bigtop-tests/test-artifacts/oozie/pom.xml>
to /home/hudson/hudson/jobs/Bigtop-trunk-testartifacts/modules/org.apache.bigtop.itest$oozie-smoke/builds/2012-06-25_23-48-18/archive/org.apache.bigtop.itest/oozie-smoke/0.5.0-incubating-SNAPSHOT/oozie-smoke-0.5.0-incubating-SNAPSHOT.pom
[JENKINS] Archiving <https://builds.apache.org/job/Bigtop-trunk-testartifacts/ws/bigtop-tests/test-artifacts/hbase/pom.xml>
to /home/hudson/hudson/jobs/Bigtop-trunk-testartifacts/modules/org.apache.bigtop.itest$hbase-smoke/builds/2012-06-25_23-48-18/archive/org.apache.bigtop.itest/hbase-smoke/0.5.0-incubating-SNAPSHOT/hbase-smoke-0.5.0-incubating-SNAPSHOT.pom
[JENKINS] Archiving <https://builds.apache.org/job/Bigtop-trunk-testartifacts/ws/bigtop-tests/test-artifacts/giraph/pom.xml>
to /home/hudson/hudson/jobs/Bigtop-trunk-testartifacts/modules/org.apache.bigtop.itest$giraph-smoke/builds/2012-06-25_23-48-18/archive/org.apache.bigtop.itest/giraph-smoke/0.5.0-incubating-SNAPSHOT/giraph-smoke-0.5.0-incubating-SNAPSHOT.pom
[JENKINS] Archiving <https://builds.apache.org/job/Bigtop-trunk-testartifacts/ws/bigtop-tests/test-artifacts/hive/pom.xml>
to /home/hudson/hudson/jobs/Bigtop-trunk-testartifacts/modules/org.apache.bigtop.itest$hive-smoke/builds/2012-06-25_23-48-18/archive/org.apache.bigtop.itest/hive-smoke/0.5.0-incubating-SNAPSHOT/hive-smoke-0.5.0-incubating-SNAPSHOT.pom
[JENKINS] Archiving <https://builds.apache.org/job/Bigtop-trunk-testartifacts/ws/bigtop-tests/test-artifacts/mahout/pom.xml>
to /home/hudson/hudson/jobs/Bigtop-trunk-testartifacts/modules/org.apache.bigtop.itest$mahout-smoke/builds/2012-06-25_23-48-18/archive/org.apache.bigtop.itest/mahout-smoke/0.5.0-incubating-SNAPSHOT/mahout-smoke-0.5.0-incubating-SNAPSHOT.pom
[JENKINS] Archiving <https://builds.apache.org/job/Bigtop-trunk-testartifacts/ws/bigtop-tests/test-artifacts/flume/pom.xml>
to /home/hudson/hudson/jobs/Bigtop-trunk-testartifacts/modules/org.apache.bigtop.itest$flume-smoke/builds/2012-06-25_23-48-18/archive/org.apache.bigtop.itest/flume-smoke/0.5.0-incubating-SNAPSHOT/flume-smoke-0.5.0-incubating-SNAPSHOT.pom
[JENKINS] Archiving <https://builds.apache.org/job/Bigtop-trunk-testartifacts/ws/bigtop-tests/test-artifacts/package/pom.xml>
to /home/hudson/hudson/jobs/Bigtop-trunk-testartifacts/modules/org.apache.bigtop.itest$package-smoke/builds/2012-06-25_23-48-18/archive/org.apache.bigtop.itest/package-smoke/0.5.0-incubating-SNAPSHOT/package-smoke-0.5.0-incubating-SNAPSHOT.pom
[JENKINS] Archiving <https://builds.apache.org/job/Bigtop-trunk-testartifacts/ws/bigtop-tests/test-artifacts/sqoop/pom.xml>
to /home/hudson/hudson/jobs/Bigtop-trunk-testartifacts/modules/org.apache.bigtop.itest$sqoop-integration/builds/2012-06-25_23-48-18/archive/org.apache.bigtop.itest/sqoop-integration/0.5.0-incubating-SNAPSHOT/sqoop-integration-0.5.0-incubating-SNAPSHOT.pom
[JENKINS] Archiving <https://builds.apache.org/job/Bigtop-trunk-testartifacts/ws/bigtop-tests/test-artifacts/pom.xml>
to /home/hudson/hudson/jobs/Bigtop-trunk-testartifacts/modules/org.apache.bigtop.itest$bigtop-smokes/builds/2012-06-25_23-48-17/archive/org.apache.bigtop.itest/bigtop-smokes/0.5.0-incubating-SNAPSHOT/bigtop-smokes-0.5.0-incubating-SNAPSHOT.pom
[JENKINS] Archiving <https://builds.apache.org/job/Bigtop-trunk-testartifacts/ws/bigtop-tests/test-artifacts/hadoop/pom.xml>
to /home/hudson/hudson/jobs/Bigtop-trunk-testartifacts/modules/org.apache.bigtop.itest$hadoop-smoke/builds/2012-06-25_23-48-18/archive/org.apache.bigtop.itest/hadoop-smoke/0.5.0-incubating-SNAPSHOT/hadoop-smoke-0.5.0-incubating-SNAPSHOT.pom
Waiting for Jenkins to finish collecting data
mavenExecutionResult exceptions not empty
message : Failed to execute goal on project bigtop-smokes: Could not resolve dependencies
for project org.apache.bigtop.itest:bigtop-smokes:pom:0.5.0-incubating-SNAPSHOT: Could not
find artifact org.apache.bigtop.itest:itest-common:jar:0.5.0-incubating-SNAPSHOT in Nexus
(http://repository.apache.org/snapshots)
cause : Could not resolve dependencies for project org.apache.bigtop.itest:bigtop-smokes:pom:0.5.0-incubating-SNAPSHOT:
Could not find artifact org.apache.bigtop.itest:itest-common:jar:0.5.0-incubating-SNAPSHOT
in Nexus (http://repository.apache.org/snapshots)
Stack trace : 
org.apache.maven.lifecycle.LifecycleExecutionException: Failed to execute goal on project
bigtop-smokes: Could not resolve dependencies for project org.apache.bigtop.itest:bigtop-smokes:pom:0.5.0-incubating-SNAPSHOT:
Could not find artifact org.apache.bigtop.itest:itest-common:jar:0.5.0-incubating-SNAPSHOT
in Nexus (http://repository.apache.org/snapshots)
	at org.apache.maven.lifecycle.internal.LifecycleDependencyResolver.getDependencies(LifecycleDependencyResolver.java:196)
	at org.apache.maven.lifecycle.internal.LifecycleDependencyResolver.resolveProjectDependencies(LifecycleDependencyResolver.java:108)
	at org.apache.maven.lifecycle.internal.MojoExecutor.ensureDependenciesAreResolved(MojoExecutor.java:258)
	at org.apache.maven.lifecycle.internal.MojoExecutor.execute(MojoExecutor.java:201)
	at org.apache.maven.lifecycle.internal.MojoExecutor.execute(MojoExecutor.java:153)
	at org.apache.maven.lifecycle.internal.MojoExecutor.execute(MojoExecutor.java:145)
	at org.apache.maven.lifecycle.internal.LifecycleModuleBuilder.buildProject(LifecycleModuleBuilder.java:84)
	at org.apache.maven.lifecycle.internal.LifecycleModuleBuilder.buildProject(LifecycleModuleBuilder.java:59)
	at org.apache.maven.lifecycle.internal.LifecycleStarter.singleThreadedBuild(LifecycleStarter.java:183)
	at org.apache.maven.lifecycle.internal.LifecycleStarter.execute(LifecycleStarter.java:161)
	at org.apache.maven.DefaultMaven.doExecute(DefaultMaven.java:319)
	at org.apache.maven.DefaultMaven.execute(DefaultMaven.java:156)
	at org.jvnet.hudson.maven3.launcher.Maven3Launcher.main(Maven3Launcher.java:79)
	at sun.reflect.NativeMethodAccessorImpl.invoke0(Native Method)
	at sun.reflect.NativeMethodAccessorImpl.invoke(NativeMethodAccessorImpl.java:39)
	at sun.reflect.DelegatingMethodAccessorImpl.invoke(DelegatingMethodAccessorImpl.java:25)
	at java.lang.reflect.Method.invoke(Method.java:597)
	at org.codehaus.plexus.classworlds.launcher.Launcher.launchStandard(Launcher.java:329)
	at org.codehaus.plexus.classworlds.launcher.Launcher.launch(Launcher.java:239)
	at org.jvnet.hudson.maven3.agent.Maven3Main.launch(Maven3Main.java:158)
	at hudson.maven.Maven3Builder.call(Maven3Builder.java:98)
	at hudson.maven.Maven3Builder.call(Maven3Builder.java:64)
	at hudson.remoting.UserRequest.perform(UserRequest.java:118)
	at hudson.remoting.UserRequest.perform(UserRequest.java:48)
	at hudson.remoting.Request$2.run(Request.java:287)
	at hudson.remoting.InterceptingExecutorService$1.call(InterceptingExecutorService.java:72)
	at java.util.concurrent.FutureTask$Sync.innerRun(FutureTask.java:303)
	at java.util.concurrent.FutureTask.run(FutureTask.java:138)
	at java.util.concurrent.ThreadPoolExecutor$Worker.runTask(ThreadPoolExecutor.java:886)
	at java.util.concurrent.ThreadPoolExecutor$Worker.run(ThreadPoolExecutor.java:908)
	at java.lang.Thread.run(Thread.java:662)
Caused by: org.apache.maven.project.DependencyResolutionException: Could not resolve dependencies
for project org.apache.bigtop.itest:bigtop-smokes:pom:0.5.0-incubating-SNAPSHOT: Could not
find artifact org.apache.bigtop.itest:itest-common:jar:0.5.0-incubating-SNAPSHOT in Nexus
(http://repository.apache.org/snapshots)
	at org.apache.maven.project.DefaultProjectDependenciesResolver.resolve(DefaultProjectDependenciesResolver.java:170)
	at org.apache.maven.lifecycle.internal.LifecycleDependencyResolver.getDependencies(LifecycleDependencyResolver.java:171)
	... 30 more
Caused by: org.sonatype.aether.resolution.DependencyResolutionException: Could not find artifact
org.apache.bigtop.itest:itest-common:jar:0.5.0-incubating-SNAPSHOT in Nexus (http://repository.apache.org/snapshots)
	at org.sonatype.aether.impl.internal.DefaultRepositorySystem.resolveDependencies(DefaultRepositorySystem.java:412)
	at org.apache.maven.project.DefaultProjectDependenciesResolver.resolve(DefaultProjectDependenciesResolver.java:164)
	... 31 more
Caused by: org.sonatype.aether.resolution.ArtifactResolutionException: Could not find artifact
org.apache.bigtop.itest:itest-common:jar:0.5.0-incubating-SNAPSHOT in Nexus (http://repository.apache.org/snapshots)
	at org.sonatype.aether.impl.internal.DefaultArtifactResolver.resolve(DefaultArtifactResolver.java:541)
	at org.sonatype.aether.impl.internal.DefaultArtifactResolver.resolveArtifacts(DefaultArtifactResolver.java:220)
	at org.sonatype.aether.impl.internal.DefaultRepositorySystem.resolveDependencies(DefaultRepositorySystem.java:395)
	... 32 more
Caused by: org.sonatype.aether.transfer.ArtifactNotFoundException: Could not find artifact
org.apache.bigtop.itest:itest-common:jar:0.5.0-incubating-SNAPSHOT in Nexus (http://repository.apache.org/snapshots)
	at org.sonatype.aether.connector.wagon.WagonRepositoryConnector$4.wrap(WagonRepositoryConnector.java:945)
	at org.sonatype.aether.connector.wagon.WagonRepositoryConnector$4.wrap(WagonRepositoryConnector.java:940)
	at org.sonatype.aether.connector.wagon.WagonRepositoryConnector$GetTask.flush(WagonRepositoryConnector.java:695)
	at org.sonatype.aether.connector.wagon.WagonRepositoryConnector$GetTask.flush(WagonRepositoryConnector.java:689)
	at org.sonatype.aether.connector.wagon.WagonRepositoryConnector.get(WagonRepositoryConnector.java:445)
	at org.sonatype.aether.impl.internal.DefaultArtifactResolver.resolve(DefaultArtifactResolver.java:460)
	... 34 more
Sending e-mails to: bigtop-dev@incubator.apache.org
channel stopped

Mime
View raw message