incubator-bigtop-dev mailing list archives

Site index · List index
Message view « Date » · « Thread »
Top « Date » · « Thread »
From "doug chang (Commented) (JIRA)" <j...@apache.org>
Subject [jira] [Commented] (BIGTOP-483) Smoke test of Hadoop fails with clitest missing testConf.xml file
Date Wed, 04 Apr 2012 15:05:25 GMT

    [ https://issues.apache.org/jira/browse/BIGTOP-483?page=com.atlassian.jira.plugin.system.issuetabpanels:comment-tabpanel&focusedCommentId=13246333#comment-13246333
] 

doug chang commented on BIGTOP-483:
-----------------------------------

Hey David, how about I work on this with you? Find me at the sqoop meetup today and we can
chat. This is a good learning experience, using system properties to get rid of the equivalent
of #defines in Java. What ever they are called, static final constants. 

dc
                
> Smoke test of Hadoop fails with clitest missing testConf.xml file
> -----------------------------------------------------------------
>
>                 Key: BIGTOP-483
>                 URL: https://issues.apache.org/jira/browse/BIGTOP-483
>             Project: Bigtop
>          Issue Type: Bug
>          Components: Tests
>    Affects Versions: 0.3.0
>         Environment: Found on ubuntu, but applies to all systems.
>            Reporter: David Liu
>            Assignee: Roman Shaposhnik
>             Fix For: 0.4.0
>
>         Attachments: BIGTOP-483.patch.txt
>
>
> 12/03/21 23:10:05 INFO cli.TestCLI: File: /home/ubuntu/bigtop/bigtop-tests/test-execution/smokes/hadoop/target/clitest_data/testConf.xml
not found
> Tests run: 1, Failures: 1, Errors: 0, Skipped: 0, Time elapsed: 1.923 sec <<<
FAILURE!
> Results :
> Failed tests: 
>   testAll(org.apache.bigtop.itest.hadooptests.TestTestCLI)
> Tests run: 10, Failures: 1, Errors: 0, Skipped: 0
> More details:
> -------------------------------------------------------------------------------
> Test set: org.apache.bigtop.itest.hadooptests.TestTestCLI
> -------------------------------------------------------------------------------
> Tests run: 1, Failures: 1, Errors: 0, Skipped: 0, Time elapsed: 1.923 sec <<<
FAILURE!
> testAll(org.apache.bigtop.itest.hadooptests.TestTestCLI)  Time elapsed: 0.096 sec  <<<
FAILURE!
> junit.framework.AssertionFailedError: Error reading test config file
>         at junit.framework.Assert.fail(Assert.java:47)
>         at junit.framework.Assert.assertTrue(Assert.java:20)
>         at org.apache.hadoop.cli.TestCLI.readTestConfigFile(TestCLI.java:105)
>         at org.apache.hadoop.cli.TestCLI.setUp(TestCLI.java:114)

--
This message is automatically generated by JIRA.
If you think it was sent incorrectly, please contact your JIRA administrators: https://issues.apache.org/jira/secure/ContactAdministrators!default.jspa
For more information on JIRA, see: http://www.atlassian.com/software/jira

        

Mime
View raw message