incubator-bigtop-dev mailing list archives

Site index · List index
Message view « Date » · « Thread »
Top « Date » · « Thread »
From "David Liu (Commented) (JIRA)" <j...@apache.org>
Subject [jira] [Commented] (BIGTOP-483) Smoke test of Hadoop fails with clitest missing testConf.xml file
Date Fri, 23 Mar 2012 18:57:28 GMT

    [ https://issues.apache.org/jira/browse/BIGTOP-483?page=com.atlassian.jira.plugin.system.issuetabpanels:comment-tabpanel&focusedCommentId=13236935#comment-13236935
] 

David Liu commented on BIGTOP-483:
----------------------------------

Also seen by others. Comments from Lei Zou:

Do a find on testConf.xml under ./bigtop, then copy it to the target place, you can get pass
this poiny

~/bigtop$ cp ./build/hadoop/deb/hadoop-1.0.1/src/test/org/apache/hadoop/cli/testConf.xml /home/ubuntu/bigtop/bigtop-tests/test-execution/smokes/hadoop/target/clitest_data/testConf.xml


                
> Smoke test of Hadoop fails with clitest missing testConf.xml file
> -----------------------------------------------------------------
>
>                 Key: BIGTOP-483
>                 URL: https://issues.apache.org/jira/browse/BIGTOP-483
>             Project: Bigtop
>          Issue Type: Bug
>          Components: Tests
>    Affects Versions: 0.3.0
>         Environment: Found on ubuntu, but applies to all systems.
>            Reporter: David Liu
>             Fix For: 0.3.0
>
>
> 12/03/21 23:10:05 INFO cli.TestCLI: File: /home/ubuntu/bigtop/bigtop-tests/test-execution/smokes/hadoop/target/clitest_data/testConf.xml
not found
> Tests run: 1, Failures: 1, Errors: 0, Skipped: 0, Time elapsed: 1.923 sec <<<
FAILURE!
> Results :
> Failed tests: 
>   testAll(org.apache.bigtop.itest.hadooptests.TestTestCLI)
> Tests run: 10, Failures: 1, Errors: 0, Skipped: 0
> More details:
> -------------------------------------------------------------------------------
> Test set: org.apache.bigtop.itest.hadooptests.TestTestCLI
> -------------------------------------------------------------------------------
> Tests run: 1, Failures: 1, Errors: 0, Skipped: 0, Time elapsed: 1.923 sec <<<
FAILURE!
> testAll(org.apache.bigtop.itest.hadooptests.TestTestCLI)  Time elapsed: 0.096 sec  <<<
FAILURE!
> junit.framework.AssertionFailedError: Error reading test config file
>         at junit.framework.Assert.fail(Assert.java:47)
>         at junit.framework.Assert.assertTrue(Assert.java:20)
>         at org.apache.hadoop.cli.TestCLI.readTestConfigFile(TestCLI.java:105)
>         at org.apache.hadoop.cli.TestCLI.setUp(TestCLI.java:114)

--
This message is automatically generated by JIRA.
If you think it was sent incorrectly, please contact your JIRA administrators: https://issues.apache.org/jira/secure/ContactAdministrators!default.jspa
For more information on JIRA, see: http://www.atlassian.com/software/jira

        

Mime
View raw message