incubator-bigtop-dev mailing list archives

Site index · List index
Message view « Date » · « Thread »
Top « Date » · « Thread »
From Bruno Mahé (Commented) (JIRA) <j...@apache.org>
Subject [jira] [Commented] (BIGTOP-127) BIGTOP-120 broke build on at least Fedora (and Mageia)
Date Thu, 20 Oct 2011 06:41:10 GMT

    [ https://issues.apache.org/jira/browse/BIGTOP-127?page=com.atlassian.jira.plugin.system.issuetabpanels:comment-tabpanel&focusedCommentId=13131412#comment-13131412
] 

Bruno Mahé commented on BIGTOP-127:
-----------------------------------

it may be related to the build time stamp. But I haven't had time to investigate
                
> BIGTOP-120 broke build on at least Fedora (and Mageia)
> ------------------------------------------------------
>
>                 Key: BIGTOP-127
>                 URL: https://issues.apache.org/jira/browse/BIGTOP-127
>             Project: Bigtop
>          Issue Type: Bug
>          Components: RPM
>    Affects Versions: 0.2.0
>            Reporter: Bruno Mahé
>             Fix For: 0.2.0
>
>
> Logs from Fedora:
> 23:08:19  + install -d -m 0755 /var/lib/jenkins/workspace/BigTop-Pig-Fedora/build/pig/rpm/BUILDROOT/hadoop-pig-0.9.1.20111019230203-1.x86_64/usr/lib/pig
> 23:08:19  + cd /var/lib/jenkins/workspace/BigTop-Pig-Fedora/build/pig/rpm/BUILDROOT/hadoop-pig-0.9.1.20111019230203-1.x86_64/usr/lib/pig
> 23:08:19  + tar -xf -
> 23:08:19  + cd build/pig-0.9.1.20111019230203
> 23:08:19  /var/lib/jenkins/workspace/BigTop-Pig-Fedora/build/pig/rpm/SOURCES/install_pig.sh:
line 106: cd: build/pig-0.9.1.20111019230203: No such file or directory
> 23:08:19  tar: This does not look like a tar archive
> 23:08:19  tar: Exiting with failure status due to previous errors
> 23:08:19  error: Bad exit status from /var/tmp/rpm-tmp.3AUjfZ (%install)
> 23:08:19  
> 23:08:19  
> 23:08:19  RPM build errors:
> 23:08:19      Bad exit status from /var/tmp/rpm-tmp.3AUjfZ (%install)
> 23:08:20  make: *** [/var/lib/jenkins/workspace/BigTop-Pig-Fedora/build/pig//.rpm] Error
1
> 23:08:20  Build step 'Execute shell' marked build as failure
> 23:08:20  [WARNINGS] Skipping publisher since build result is FAILURE
> 23:08:20  Archiving artifacts
> 23:09:51  Notifying upstream projects of job completion
> 23:09:52  Finished: FAILURE

--
This message is automatically generated by JIRA.
If you think it was sent incorrectly, please contact your JIRA administrators: https://issues.apache.org/jira/secure/ContactAdministrators!default.jspa
For more information on JIRA, see: http://www.atlassian.com/software/jira

       

Mime
View raw message