incubator-any23-dev mailing list archives

Site index · List index
Message view « Date » · « Thread »
Top « Date » · « Thread »
From Apache Jenkins Server <jenk...@builds.apache.org>
Subject Build failed in Jenkins: Any23-trunk #289
Date Sun, 12 Aug 2012 07:48:22 GMT
See <https://builds.apache.org/job/Any23-trunk/289/>

------------------------------------------
[...truncated 809 lines...]
A         core/src/main/java/org/apache/any23/extractor/html/annotations/Includes.java
A         core/src/main/java/org/apache/any23/extractor/html/LicenseExtractor.java
A         core/src/main/java/org/apache/any23/extractor/html/MicroformatExtractor.java
A         core/src/main/java/org/apache/any23/extractor/html/HCardName.java
AU        core/src/main/java/org/apache/any23/extractor/html/package-info.java
AU        core/src/main/java/org/apache/any23/extractor/html/SpeciesExtractor.java
A         core/src/main/java/org/apache/any23/extractor/html/XFNExtractor.java
AU        core/src/main/java/org/apache/any23/extractor/package-info.java
A         core/src/main/java/org/apache/any23/extractor/ExtractionContext.java
A         core/src/main/java/org/apache/any23/extractor/ExtractorGroup.java
A         core/src/main/java/org/apache/any23/extractor/rdf
AU        core/src/main/java/org/apache/any23/extractor/rdf/RDFParserFactory.java
A         core/src/main/java/org/apache/any23/extractor/rdf/BaseRDFExtractor.java
A         core/src/main/java/org/apache/any23/extractor/rdf/TriXExtractor.java
AU        core/src/main/java/org/apache/any23/extractor/rdf/package-info.java
AU        core/src/main/java/org/apache/any23/extractor/rdf/NQuadsExtractor.java
A         core/src/main/java/org/apache/any23/extractor/rdf/RDFXMLExtractor.java
A         core/src/main/java/org/apache/any23/extractor/rdf/RDFHandlerAdapter.java
A         core/src/main/java/org/apache/any23/extractor/rdf/TurtleExtractor.java
A         core/src/main/java/org/apache/any23/extractor/rdf/NTriplesExtractor.java
A         core/src/main/java/org/apache/any23/extractor/ExampleInputOutput.java
A         core/src/main/java/org/apache/any23/extractor/rdfa
AU        core/src/main/java/org/apache/any23/extractor/rdfa/XSLTStylesheetException.java
A         core/src/main/java/org/apache/any23/extractor/rdfa/XSLTStylesheet.java
AU        core/src/main/java/org/apache/any23/extractor/rdfa/package-info.java
A         core/src/main/java/org/apache/any23/extractor/rdfa/RDFaExtractor.java
A         core/src/main/java/org/apache/any23/extractor/rdfa/RDFa11Extractor.java
A         core/src/main/java/org/apache/any23/extractor/rdfa/RDFa11ParserException.java
A         core/src/main/java/org/apache/any23/extractor/rdfa/RDFa11Parser.java
A         core/src/main/java/org/apache/any23/rdf
A         core/src/main/java/org/apache/any23/rdf/Any23ValueFactoryWrapper.java
AU        core/src/main/java/org/apache/any23/rdf/package-info.java
A         core/src/main/java/org/apache/any23/rdf/Prefixes.java
A         core/src/main/java/org/apache/any23/rdf/PopularPrefixes.java
AU        core/src/main/java/org/apache/any23/rdf/RDFUtils.java
A         core/src/main/java/org/apache/any23/Any23.java
A         core/src/main/java/org/apache/any23/writer
A         core/src/main/java/org/apache/any23/writer/CountingTripleHandler.java
A         core/src/main/java/org/apache/any23/writer/LoggingTripleHandler.java
A         core/src/main/java/org/apache/any23/writer/WriterRegistry.java
A         core/src/main/java/org/apache/any23/writer/JSONWriter.java
A         core/src/main/java/org/apache/any23/writer/BenchmarkTripleHandler.java
A         core/src/main/java/org/apache/any23/writer/Writer.java
A         core/src/main/java/org/apache/any23/writer/RepositoryWriter.java
AU        core/src/main/java/org/apache/any23/writer/TripleHandlerException.java
A         core/src/main/java/org/apache/any23/writer/TurtleWriter.java
A         core/src/main/java/org/apache/any23/writer/CompositeTripleHandler.java
A         core/src/main/java/org/apache/any23/writer/TriXWriter.java
AU        core/src/main/java/org/apache/any23/writer/package-info.java
A         core/src/main/java/org/apache/any23/writer/FormatWriter.java
A         core/src/main/java/org/apache/any23/writer/RDFWriterTripleHandler.java
A         core/src/main/java/org/apache/any23/writer/ReportingTripleHandler.java
A         core/src/main/java/org/apache/any23/writer/NQuadsWriter.java
A         core/src/main/java/org/apache/any23/writer/URIListWriter.java
A         core/src/main/java/org/apache/any23/writer/RDFXMLWriter.java
A         core/src/main/java/org/apache/any23/writer/TripleHandler.java
A         core/src/main/java/org/apache/any23/writer/NTriplesWriter.java
A         core/src/main/java/org/apache/any23/util
A         core/src/main/java/org/apache/any23/util/FileUtils.java
A         core/src/main/java/org/apache/any23/util/LogUtils.java
A         core/src/main/java/org/apache/any23/util/URLUtils.java
AU        core/src/main/java/org/apache/any23/util/package-info.java
A         core/src/main/java/org/apache/any23/util/StringUtils.java
A         core/src/main/java/org/apache/any23/util/DiscoveryUtils.java
AU        core/src/main/java/org/apache/any23/util/MathUtils.java
A         core/src/main/java/org/apache/any23/util/StreamUtils.java
AU        core/src/main/java/org/apache/any23/util/ReaderInputStream.java
A         core/src/main/resources
A         core/src/main/resources/default-configuration.properties
A         core/src/main/resources/org
A         core/src/main/resources/org/apache
A         core/src/main/resources/org/apache/any23
A         core/src/main/resources/org/apache/any23/prefixes
AU        core/src/main/resources/org/apache/any23/prefixes/prefixes.properties
A         core/src/main/resources/org/apache/any23/mime
A         core/src/main/resources/org/apache/any23/mime/tika-config.xml
A         core/src/main/resources/org/apache/any23/mime/mimetypes.xml
A         core/src/main/resources/org/apache/any23/extractor
A         core/src/main/resources/org/apache/any23/extractor/microdata
A         core/src/main/resources/org/apache/any23/extractor/microdata/example-microdata.html
A         core/src/main/resources/org/apache/any23/extractor/html
A         core/src/main/resources/org/apache/any23/extractor/html/example-meta.html
A         core/src/main/resources/org/apache/any23/extractor/html/example-mf-species.html
A         core/src/main/resources/org/apache/any23/extractor/html/example-mf-xfn.html
A         core/src/main/resources/org/apache/any23/extractor/html/example-head-link.html
A         core/src/main/resources/org/apache/any23/extractor/html/example-mf-adr.html
A         core/src/main/resources/org/apache/any23/extractor/html/example-mf-hresume.html
A         core/src/main/resources/org/apache/any23/extractor/html/example-mf-hreview.html
A         core/src/main/resources/org/apache/any23/extractor/html/example-icbm.html
A         core/src/main/resources/org/apache/any23/extractor/html/example-mf-geo.html
A         core/src/main/resources/org/apache/any23/extractor/html/example-mf-hrecipe.html
A         core/src/main/resources/org/apache/any23/extractor/html/example-mf-hcalendar.html
A         core/src/main/resources/org/apache/any23/extractor/html/example-mf-hcard.html
A         core/src/main/resources/org/apache/any23/extractor/html/example-mf-hlisting.html
A         core/src/main/resources/org/apache/any23/extractor/html/example-script-turtle.html
A         core/src/main/resources/org/apache/any23/extractor/html/example-title.html
A         core/src/main/resources/org/apache/any23/extractor/html/example-mf-license.html
A         core/src/main/resources/org/apache/any23/extractor/csv
A         core/src/main/resources/org/apache/any23/extractor/csv/example-csv.csv
A         core/src/main/resources/org/apache/any23/extractor/rdf
A         core/src/main/resources/org/apache/any23/extractor/rdf/example-rdfxml.rdf
A         core/src/main/resources/org/apache/any23/extractor/rdf/example-nquads.nq
A         core/src/main/resources/org/apache/any23/extractor/rdf/example-ntriples.nt
A         core/src/main/resources/org/apache/any23/extractor/rdf/example-turtle.ttl
A         core/src/main/resources/org/apache/any23/extractor/rdf/example-trix.trx
A         core/src/main/resources/org/apache/any23/extractor/rdfa
A         core/src/main/resources/org/apache/any23/extractor/rdfa/rdfa.xslt
A         core/src/main/resources/org/apache/any23/extractor/rdfa/example-rdfa11.html
AU        core/pom.xml
AU        DISCLAIMER.txt
AU        pom.xml
AU        README.txt
 U        .
At revision 1372051
no change for https://svn.apache.org/repos/asf/incubator/any23/trunk since the previous build
Parsing POMs
Modules changed, recalculating dependency graph
[Any23-trunk] $ /home/hudson/tools/java/latest1.6/bin/java -cp /export/home/hudson/hudson-slave/maven-agent.jar:/export/home/hudson/hudson-slave/classworlds.jar
hudson.maven.agent.Main /home/hudson/tools/maven/latest /zonestorage/hudson_solaris/home/hudson/hudson-slave/slave.jar
/export/home/hudson/hudson-slave/maven-interceptor.jar 41186 /export/home/hudson/hudson-slave/maven2.1-interceptor.jar
<===[JENKINS REMOTING CAPACITY]===>   channel started
log4j:WARN No appenders could be found for logger (org.apache.commons.beanutils.converters.BooleanConverter).
log4j:WARN Please initialize the log4j system properly.
Executing Maven:  -B -f <https://builds.apache.org/job/Any23-trunk/ws/pom.xml> -Dmaven.repo.local=/export/home/hudson/hudson-slave/maven-repositories/1
deploy
[INFO] Scanning for projects...
[INFO] Reactor build order: 
[INFO]   Apache Any23
[INFO]   Apache Any23 :: Test Resources
[INFO]   Apache Any23 :: Core
[INFO]   Apache Any23 :: Plugins :: Basic Crawler
[INFO]   Apache Any23 :: Plugins :: HTML Scraper
[INFO]   Apache Any23 :: Plugins :: Office Scraper
[INFO]   Apache Any23 :: Plugins :: Integration Test
[INFO]   Apache Any23 :: Service
[INFO] ------------------------------------------------------------------------
[INFO] Building Apache Any23
[INFO]    task-segment: [deploy]
[INFO] ------------------------------------------------------------------------
[INFO] [buildnumber:create {execution: default}]
[INFO] Checking for local modifications: skipped.
[INFO] Updating project files from SCM: skipped.
[INFO] Executing: /bin/sh -c cd <https://builds.apache.org/job/Any23-trunk/ws/> &&
svn --non-interactive info
[INFO] Working directory: <https://builds.apache.org/job/Any23-trunk/ws/>
[INFO] Storing buildNumber: 1371544 at timestamp: 1344756831208
[INFO] Executing: /bin/sh -c cd <https://builds.apache.org/job/Any23-trunk/ws/> &&
svn --non-interactive info
[INFO] Working directory: <https://builds.apache.org/job/Any23-trunk/ws/>
[INFO] Storing buildScmBranch: trunk
[JENKINS] Archiving <https://builds.apache.org/job/Any23-trunk/ws/pom.xml> to /home/hudson/hudson/jobs/Any23-trunk/modules/org.apache.any23$apache-any23/builds/2012-08-12_07-15-53/archive/org.apache.any23/apache-any23/0.7.1-incubating-SNAPSHOT/apache-any23-0.7.1-incubating-SNAPSHOT.pom
[JENKINS] Archiving /export/home/hudson/hudson-slave/maven-repositories/1/org/apache/any23/apache-any23/0.7.1-incubating-SNAPSHOT/apache-any23-0.7.1-incubating-SNAPSHOT.pom
to /home/hudson/hudson/jobs/Any23-trunk/modules/org.apache.any23$apache-any23/builds/2012-08-12_07-15-53/archive/org.apache.any23/apache-any23/0.7.1-incubating-20120812.073634-51/apache-any23-0.7.1-incubating-20120812.073634-51.pom
[JENKINS] Archiving <https://builds.apache.org/job/Any23-trunk/ws/target/apache-any23-0.7.1-incubating-SNAPSHOT-site.xml>
to /home/hudson/hudson/jobs/Any23-trunk/modules/org.apache.any23$apache-any23/builds/2012-08-12_07-15-53/archive/org.apache.any23/apache-any23/0.7.1-incubating-20120812.073634-51/apache-any23-0.7.1-incubating-20120812.073634-51-site.xml
[JENKINS] Archiving <https://builds.apache.org/job/Any23-trunk/ws/target/apache-any23-0.7.1-incubating-SNAPSHOT-src.tar.gz>
to /home/hudson/hudson/jobs/Any23-trunk/modules/org.apache.any23$apache-any23/builds/2012-08-12_07-15-53/archive/org.apache.any23/apache-any23/0.7.1-incubating-20120812.073634-51/apache-any23-0.7.1-incubating-20120812.073634-51-src.tar.gz
[INFO] [site:attach-descriptor {execution: default-attach-descriptor}]
[INFO] [assembly:single {execution: assembly}]
[INFO] Reading assembly descriptor: <https://builds.apache.org/job/Any23-trunk/ws/src/main/assembly/src.xml>
[INFO] Building tar: <https://builds.apache.org/job/Any23-trunk/ws/target/apache-any23-0.7.1-incubating-SNAPSHOT-src.tar.gz>
[INFO] Building zip: <https://builds.apache.org/job/Any23-trunk/ws/target/apache-any23-0.7.1-incubating-SNAPSHOT-src.zip>
[INFO] [install:install {execution: default-install}]
[INFO] Installing <https://builds.apache.org/job/Any23-trunk/ws/pom.xml> to /export/home/hudson/hudson-slave/maven-repositories/1/org/apache/any23/apache-any23/0.7.1-incubating-SNAPSHOT/apache-any23-0.7.1-incubating-SNAPSHOT.pom
[INFO] Installing <https://builds.apache.org/job/Any23-trunk/ws/target/apache-any23-0.7.1-incubating-SNAPSHOT-site.xml>
to /export/home/hudson/hudson-slave/maven-repositories/1/org/apache/any23/apache-any23/0.7.1-incubating-SNAPSHOT/apache-any23-0.7.1-incubating-SNAPSHOT-site.xml
[INFO] Installing <https://builds.apache.org/job/Any23-trunk/ws/target/apache-any23-0.7.1-incubating-SNAPSHOT-src.tar.gz>
to /export/home/hudson/hudson-slave/maven-repositories/1/org/apache/any23/apache-any23/0.7.1-incubating-SNAPSHOT/apache-any23-0.7.1-incubating-SNAPSHOT-src.tar.gz
[INFO] Installing <https://builds.apache.org/job/Any23-trunk/ws/target/apache-any23-0.7.1-incubating-SNAPSHOT-src.zip>
to /export/home/hudson/hudson-slave/maven-repositories/1/org/apache/any23/apache-any23/0.7.1-incubating-SNAPSHOT/apache-any23-0.7.1-incubating-SNAPSHOT-src.zip
[INFO] [deploy:deploy {execution: default-deploy}]
[INFO] Retrieving previous build number from apache.snapshots.https
[WARNING] *** CHECKSUM FAILED - Checksum failed on download: local = '790a0ee2f049958a9202bb546a9f9d8623da57b0';
remote = '8dd48e2b98f068707a2beb1419906499c3a0b92d' - RETRYING
[WARNING] *** CHECKSUM FAILED - Checksum failed on download: local = '790a0ee2f049958a9202bb546a9f9d8623da57b0';
remote = '8dd48e2b98f068707a2beb1419906499c3a0b92d' - IGNORING
Uploading: https://repository.apache.org/content/repositories/snapshots/org/apache/any23/apache-any23/0.7.1-incubating-SNAPSHOT/apache-any23-0.7.1-incubating-20120812.073634-51.pom
34K uploaded  (apache-any23-0.7.1-incubating-20120812.073634-51.pom)
[INFO] Retrieving previous metadata from apache.snapshots.https
[WARNING] *** CHECKSUM FAILED - Checksum failed on download: local = '790a0ee2f049958a9202bb546a9f9d8623da57b0';
remote = '8dd48e2b98f068707a2beb1419906499c3a0b92d' - RETRYING
[WARNING] *** CHECKSUM FAILED - Checksum failed on download: local = '790a0ee2f049958a9202bb546a9f9d8623da57b0';
remote = '8dd48e2b98f068707a2beb1419906499c3a0b92d' - IGNORING
[INFO] Uploading repository metadata for: 'snapshot org.apache.any23:apache-any23:0.7.1-incubating-SNAPSHOT'
[INFO] Retrieving previous metadata from apache.snapshots.https
[INFO] Uploading repository metadata for: 'artifact org.apache.any23:apache-any23'
[INFO] Retrieving previous build number from apache.snapshots.https
Uploading: https://repository.apache.org/content/repositories/snapshots/org/apache/any23/apache-any23/0.7.1-incubating-SNAPSHOT/apache-any23-0.7.1-incubating-20120812.073634-51-site.xml
4K uploaded  (apache-any23-0.7.1-incubating-20120812.073634-51-site.xml)
[INFO] Retrieving previous build number from apache.snapshots.https
Uploading: https://repository.apache.org/content/repositories/snapshots/org/apache/any23/apache-any23/0.7.1-incubating-SNAPSHOT/apache-any23-0.7.1-incubating-20120812.073634-51-src.tar.gz
1332K uploaded  (apache-any23-0.7.1-incubating-20120812.073634-51-src.tar.gz)
[INFO] Retrieving previous build number from apache.snapshots.https
Uploading: https://repository.apache.org/content/repositories/snapshots/org/apache/any23/apache-any23/0.7.1-incubating-SNAPSHOT/apache-any23-0.7.1-incubating-20120812.073634-51-src.zip
1939K uploaded  (apache-any23-0.7.1-incubating-20120812.073634-51-src.zip)
[JENKINS] Archiving <https://builds.apache.org/job/Any23-trunk/ws/target/apache-any23-0.7.1-incubating-SNAPSHOT-src.zip>
to /home/hudson/hudson/jobs/Any23-trunk/modules/org.apache.any23$apache-any23/builds/2012-08-12_07-15-53/archive/org.apache.any23/apache-any23/0.7.1-incubating-20120812.073634-51/apache-any23-0.7.1-incubating-20120812.073634-51-src.zip
Build timed out (after 45 minutes). Marking the build as failed.
channel stopped
[INFO] ------------------------------------------------------------------------
[ERROR] FATAL ERROR
[INFO] ------------------------------------------------------------------------
[INFO] null
[INFO] ------------------------------------------------------------------------
[INFO] Trace
java.lang.reflect.UndeclaredThrowableException
	at $Proxy2.isArchivingDisabled(Unknown Source)
	at hudson.maven.MavenBuildProxy$Filter.isArchivingDisabled(MavenBuildProxy.java:227)
	at hudson.maven.reporters.MavenArtifact.archive(MavenArtifact.java:223)
	at hudson.maven.reporters.MavenArtifactArchiver.postBuild(MavenArtifactArchiver.java:108)
	at hudson.maven.Maven2Builder.postModule(Maven2Builder.java:127)
	at hudson.maven.MavenBuilder$Adapter.fireLeaveModule(MavenBuilder.java:327)
	at hudson.maven.MavenBuilder$Adapter.postBuild(MavenBuilder.java:285)
	at org.apache.maven.lifecycle.LifecycleExecutorInterceptor.execute(LifecycleExecutorInterceptor.java:68)
	at org.apache.maven.DefaultMaven.doExecute(DefaultMaven.java:328)
	at org.apache.maven.DefaultMaven.execute(DefaultMaven.java:138)
	at org.apache.maven.cli.MavenCli.main(MavenCli.java:362)
	at sun.reflect.NativeMethodAccessorImpl.invoke0(Native Method)
	at sun.reflect.NativeMethodAccessorImpl.invoke(NativeMethodAccessorImpl.java:39)
	at sun.reflect.DelegatingMethodAccessorImpl.invoke(DelegatingMethodAccessorImpl.java:25)
	at java.lang.reflect.Method.invoke(Method.java:597)
	at org.codehaus.classworlds.Launcher.launchEnhanced(Launcher.java:315)
	at org.codehaus.classworlds.Launcher.launch(Launcher.java:255)
	at hudson.maven.agent.Main.launch(Main.java:185)
	at hudson.maven.MavenBuilder.call(MavenBuilder.java:151)
	at hudson.maven.Maven2Builder.call(Maven2Builder.java:77)
	at hudson.maven.Maven2Builder.call(Maven2Builder.java:53)
	at hudson.remoting.UserRequest.perform(UserRequest.java:118)
	at hudson.remoting.UserRequest.perform(UserRequest.java:48)
	at hudson.remoting.Request$2.run(Request.java:326)
	at hudson.remoting.InterceptingExecutorService$1.call(InterceptingExecutorService.java:72)
	at java.util.concurrent.FutureTask$Sync.innerRun(FutureTask.java:303)
	at java.util.concurrent.FutureTask.run(FutureTask.java:138)
	at java.util.concurrent.ThreadPoolExecutor$Worker.runTask(ThreadPoolExecutor.java:886)
	at java.util.concurrent.ThreadPoolExecutor$Worker.run(ThreadPoolExecutor.java:908)
	at java.lang.Thread.run(Thread.java:662)
Caused by: hudson.remoting.ChannelClosedException: channel is already closed
	at hudson.remoting.Channel.send(Channel.java:492)
	at hudson.remoting.Request.call(Request.java:129)
	at hudson.remoting.Channel.call(Channel.java:663)
	at hudson.remoting.RemoteInvocationHandler.invoke(RemoteInvocationHandler.java:158)
	... 30 more
Caused by: hudson.remoting.Channel$OrderlyShutdown
	at hudson.remoting.Channel$CloseCommand.execute(Channel.java:835)
	at hudson.remoting.Channel$2.handle(Channel.java:433)
	at hudson.remoting.SynchronousCommandTransport$ReaderThread.run(SynchronousCommandTransport.java:60)
Caused by: Command close created at
	at hudson.remoting.Command.<init>(Command.java:54)
	at hudson.remoting.Channel$CloseCommand.<init>(Channel.java:829)
	at hudson.remoting.Channel$CloseCommand.<init>(Channel.java:827)
	at hudson.remoting.Channel.close(Channel.java:894)
	at hudson.remoting.Channel.close(Channel.java:877)
	at hudson.slaves.Channels$1.close(Channels.java:91)
	at hudson.maven.ProcessCache$MavenProcess.discard(ProcessCache.java:145)
	at hudson.maven.MavenModuleSetBuild$MavenModuleSetBuildExecution.doRun(MavenModuleSetBuild.java:796)
	at hudson.model.AbstractBuild$AbstractBuildExecution.run(AbstractBuild.java:499)
	at hudson.model.Run.execute(Run.java:1488)
	at hudson.maven.MavenModuleSetBuild.run(MavenModuleSetBuild.java:477)
	at hudson.model.ResourceController.execute(ResourceController.java:88)
	at hudson.model.Executor.run(Executor.java:236)
[INFO] ------------------------------------------------------------------------
[INFO] Total time: 16 minutes 11 seconds
[INFO] Finished at: Sun Aug 12 07:47:02 GMT+00:00 2012
[INFO] Final Memory: 43M/374M
[INFO] ------------------------------------------------------------------------

Mime
View raw message